{
  "$id": "schema.json",
  "type": "object",
  "schema": "http://json-schema.org/draft-07/schema#",
  "translate": true,
  "dynamicfields": true,
  "properties": {
    "ph_request_type": {
      "type": "string",
      "description": "type of request (internal to adapter)",
      "default": "updateSSOBypassAllowedUsers",
      "enum": [
        "updateSSOBypassAllowedUsers",
        "profile",
        "updateProfile",
        "listUsers",
        "addNewUserProfilev2",
        "listUsernames",
        "listUserRoleType",
        "getUsersProfileOtherthanyourown",
        "updateUserProfileOtherthanyourown",
        "deleteUserProfile",
        "updateUserStatus",
        "listEmailDomains",
        "listSSOBypassAllowedUsers"
      ],
      "external_name": "ph_request_type"
    },
    "emailId": {
      "type": "string",
      "description": "",
      "parse": false,
      "encode": false,
      "encrypt": {
        "type": "AES",
        "key": ""
      },
      "external_name": "email-id"
    }
  },
  "definitions": {}
}