{
  "actions": [
    {
      "name": "listComplianceStandards",
      "protocol": "REST",
      "method": "GET",
      "entitypath": "{base_path}/{version}/compliance?{query}",
      "requestSchema": "schema.json",
      "responseSchema": "schema.json",
      "timeout": 0,
      "sendEmpty": false,
      "sendGetBody": false,
      "requestDatatype": "JSON",
      "responseDatatype": "JSON",
      "headers": {},
      "responseObjects": [
        {
          "type": "default",
          "key": "",
          "mockFile": ""
        }
      ]
    },
    {
      "name": "listComplianceStandardsbyID",
      "protocol": "REST",
      "method": "GET",
      "entitypath": "{base_path}/{version}/compliance/COMPLIANCE_ID_HERE?{query}",
      "requestSchema": "schema.json",
      "responseSchema": "schema.json",
      "timeout": 0,
      "sendEmpty": false,
      "sendGetBody": false,
      "requestDatatype": "JSON",
      "responseDatatype": "JSON",
      "headers": {},
      "responseObjects": [
        {
          "type": "default",
          "key": "",
          "mockFile": ""
        }
      ]
    },
    {
      "name": "listComplianceRequirementsbyID",
      "protocol": "REST",
      "method": "GET",
      "entitypath": "{base_path}/{version}/compliance/COMPLIANCE_ID_HERE/requirement?{query}",
      "requestSchema": "schema.json",
      "responseSchema": "schema.json",
      "timeout": 0,
      "sendEmpty": false,
      "sendGetBody": false,
      "requestDatatype": "JSON",
      "responseDatatype": "JSON",
      "headers": {},
      "responseObjects": [
        {
          "type": "default",
          "key": "",
          "mockFile": ""
        }
      ]
    },
    {
      "name": "getComplianceRequirementbyID",
      "protocol": "REST",
      "method": "GET",
      "entitypath": "{base_path}/{version}/compliance/requirement/REQUIREMENT_ID_HERE?{query}",
      "requestSchema": "schema.json",
      "responseSchema": "schema.json",
      "timeout": 0,
      "sendEmpty": false,
      "sendGetBody": false,
      "requestDatatype": "JSON",
      "responseDatatype": "JSON",
      "headers": {},
      "responseObjects": [
        {
          "type": "default",
          "key": "",
          "mockFile": ""
        }
      ]
    },
    {
      "name": "listComplianceRequirementSections",
      "protocol": "REST",
      "method": "GET",
      "entitypath": "{base_path}/{version}/compliance/REQUIREMENT_ID_HERE/section?{query}",
      "requestSchema": "schema.json",
      "responseSchema": "schema.json",
      "timeout": 0,
      "sendEmpty": false,
      "sendGetBody": false,
      "requestDatatype": "JSON",
      "responseDatatype": "JSON",
      "headers": {},
      "responseObjects": [
        {
          "type": "default",
          "key": "",
          "mockFile": ""
        }
      ]
    }
  ]
}