{
  "actions": [
    {
      "name": "getComplianceStatisticsBreakdown",
      "protocol": "REST",
      "method": "GET",
      "entitypath": "{base_path}/{version}/compliance/posture?{query}",
      "requestSchema": "schema.json",
      "responseSchema": "schema.json",
      "timeout": 0,
      "sendEmpty": false,
      "sendGetBody": false,
      "requestDatatype": "JSON",
      "responseDatatype": "JSON",
      "headers": {},
      "responseObjects": [
        {
          "type": "default",
          "key": "",
          "mockFile": ""
        }
      ]
    },
    {
      "name": "getComplianceStatisticsforComplianceStandardID",
      "protocol": "REST",
      "method": "GET",
      "entitypath": "{base_path}/{version}/compliance/posture/fd9e3d3a-29a0-4ddc-b058-6f7eabd7d85a?{query}",
      "requestSchema": "schema.json",
      "responseSchema": "schema.json",
      "timeout": 0,
      "sendEmpty": false,
      "sendGetBody": false,
      "requestDatatype": "JSON",
      "responseDatatype": "JSON",
      "headers": {},
      "responseObjects": [
        {
          "type": "default",
          "key": "",
          "mockFile": ""
        }
      ]
    },
    {
      "name": "getComplianceStatisticsforRequirementID",
      "protocol": "REST",
      "method": "GET",
      "entitypath": "{base_path}/{version}/compliance/posture/fd9e3d3a-29a0-4ddc-b058-6f7eabd7d85a/a467eb11-b55b-4484-83ba-f55a7ef4358b?{query}",
      "requestSchema": "schema.json",
      "responseSchema": "schema.json",
      "timeout": 0,
      "sendEmpty": false,
      "sendGetBody": false,
      "requestDatatype": "JSON",
      "responseDatatype": "JSON",
      "headers": {},
      "responseObjects": [
        {
          "type": "default",
          "key": "",
          "mockFile": ""
        }
      ]
    },
    {
      "name": "getComplianceStatisticsOverTime",
      "protocol": "REST",
      "method": "GET",
      "entitypath": "{base_path}/{version}/compliance/posture/trend?{query}",
      "requestSchema": "schema.json",
      "responseSchema": "schema.json",
      "timeout": 0,
      "sendEmpty": false,
      "sendGetBody": false,
      "requestDatatype": "JSON",
      "responseDatatype": "JSON",
      "headers": {},
      "responseObjects": [
        {
          "type": "default",
          "key": "",
          "mockFile": ""
        }
      ]
    },
    {
      "name": "getComplianceStatisticsOverTimeforComplianceStandardID",
      "protocol": "REST",
      "method": "GET",
      "entitypath": "{base_path}/{version}/compliance/posture/trend/fd9e3d3a-29a0-4ddc-b058-6f7eabd7d85a?{query}",
      "requestSchema": "schema.json",
      "responseSchema": "schema.json",
      "timeout": 0,
      "sendEmpty": false,
      "sendGetBody": false,
      "requestDatatype": "JSON",
      "responseDatatype": "JSON",
      "headers": {},
      "responseObjects": [
        {
          "type": "default",
          "key": "",
          "mockFile": ""
        }
      ]
    },
    {
      "name": "getComplianceStatisticsOverTimeforRequirementID",
      "protocol": "REST",
      "method": "GET",
      "entitypath": "{base_path}/{version}/compliance/posture/trend/fd9e3d3a-29a0-4ddc-b058-6f7eabd7d85a/a467eb11-b55b-4484-83ba-f55a7ef4358b?{query}",
      "requestSchema": "schema.json",
      "responseSchema": "schema.json",
      "timeout": 0,
      "sendEmpty": false,
      "sendGetBody": false,
      "requestDatatype": "JSON",
      "responseDatatype": "JSON",
      "headers": {},
      "responseObjects": [
        {
          "type": "default",
          "key": "",
          "mockFile": ""
        }
      ]
    },
    {
      "name": "getComplianceOverviewFiltersandOptions",
      "protocol": "REST",
      "method": "GET",
      "entitypath": "{base_path}/{version}/filter/compliance/posture/suggest?{query}",
      "requestSchema": "schema.json",
      "responseSchema": "schema.json",
      "timeout": 0,
      "sendEmpty": false,
      "sendGetBody": false,
      "requestDatatype": "JSON",
      "responseDatatype": "JSON",
      "headers": {},
      "responseObjects": [
        {
          "type": "default",
          "key": "",
          "mockFile": ""
        }
      ]
    }
  ]
}