{
  "$id": "schema.json",
  "type": "object",
  "schema": "http://json-schema.org/draft-07/schema#",
  "translate": true,
  "dynamicfields": true,
  "properties": {
    "ph_request_type": {
      "type": "string",
      "description": "type of request (internal to adapter)",
      "default": "listFloatingIps",
      "enum": [
        "listFloatingIps",
        "createFloatingIps",
        "bulkDeleteFloatingIps",
        "listFloatingIpsByHost"
      ],
      "external_name": "ph_request_type"
    },
    "hostName": {
      "type": "string",
      "description": "The name of the host.",
      "parse": false,
      "encode": false,
      "encrypt": {
        "type": "AES",
        "key": ""
      },
      "external_name": "host_name"
    }
  },
  "definitions": {}
}