{
  "$id": "schema.json",
  "type": "object",
  "schema": "http://json-schema.org/draft-07/schema#",
  "translate": true,
  "dynamicfields": true,
  "properties": {
    "ph_request_type": {
      "type": "string",
      "description": "type of request (internal to adapter)",
      "default": "pingInstances",
      "enum": [
        "pingInstances",
        "pingAnInstance"
      ],
      "external_name": "ph_request_type"
    },
    "allTenants": {
      "type": "string",
      "description": "Specify the all_tenants query parameter to ping instances for all tenants. By default this is only allowed by admin users. Value of this query parameter is not checked, o...(description truncated)",
      "parse": false,
      "encode": false,
      "encrypt": {
        "type": "AES",
        "key": ""
      },
      "external_name": "all_tenants"
    },
    "instanceId": {
      "type": "string",
      "description": "The UUID of the instance.",
      "parse": false,
      "encode": false,
      "encrypt": {
        "type": "AES",
        "key": ""
      },
      "external_name": "instance_id"
    }
  },
  "definitions": {}
}