{
  "$id": "schema.json",
  "type": "object",
  "schema": "http://json-schema.org/draft-07/schema#",
  "translate": true,
  "dynamicfields": true,
  "properties": {
    "ph_request_type": {
      "type": "string",
      "description": "type of request (internal to adapter)",
      "default": "listServerGroups",
      "enum": [
        "listServerGroups",
        "createServerGroup",
        "showServerGroupDetails",
        "deleteServerGroup"
      ],
      "external_name": "ph_request_type"
    },
    "allProjects": {
      "type": "string",
      "description": "Administrator only. Lists server groups for all projects. For example:",
      "parse": false,
      "encode": false,
      "encrypt": {
        "type": "AES",
        "key": ""
      },
      "external_name": "all_projects"
    },
    "serverGroupId": {
      "type": "string",
      "description": "The UUID of the server group.",
      "parse": false,
      "encode": false,
      "encrypt": {
        "type": "AES",
        "key": ""
      },
      "external_name": "server_group_id"
    }
  },
  "definitions": {}
}