{
  "$id": "schema.json",
  "type": "object",
  "schema": "http://json-schema.org/draft-07/schema#",
  "translate": true,
  "dynamicfields": true,
  "properties": {
    "ph_request_type": {
      "type": "string",
      "description": "type of request (internal to adapter)",
      "default": "listFloatingIpAddresses",
      "enum": [
        "listFloatingIpAddresses",
        "createAllocateFloatingIpAddress",
        "showFloatingIpAddressDetails",
        "deleteDeallocateFloatingIpAddress"
      ],
      "external_name": "ph_request_type"
    },
    "floatingIpId": {
      "type": "string",
      "description": "The ID of the floating IP address.",
      "parse": false,
      "encode": false,
      "encrypt": {
        "type": "AES",
        "key": ""
      },
      "external_name": "floating_ip_id"
    }
  },
  "definitions": {}
}