{
  "apiVersion": "string",
  "code": 10,
  "details": {
    "causes": [
      {
        "field": "string",
        "message": "string",
        "reason": "string"
      },
      {
        "field": "string",
        "message": "string",
        "reason": "string"
      },
      {
        "field": "string",
        "message": "string",
        "reason": "string"
      },
      {
        "field": "string",
        "message": "string",
        "reason": "string"
      }
    ],
    "group": "string",
    "kind": "string",
    "name": "string",
    "retryAfterSeconds": 7,
    "uid": "string"
  },
  "kind": "string",
  "message": "string",
  "metadata": {
    "continue": "string",
    "remainingItemCount": 3,
    "resourceVersion": "string",
    "selfLink": "string"
  },
  "reason": "string",
  "status": "string"
}