{
  "apiVersion": "string",
  "items": [
    {
      "apiVersion": "string",
      "data": {
        "Raw": "string"
      },
      "kind": "string",
      "metadata": {
        "annotations": {},
        "clusterName": "string",
        "creationTimestamp": "string",
        "deletionGracePeriodSeconds": 7,
        "deletionTimestamp": "string",
        "finalizers": [
          "string",
          "string"
        ],
        "generateName": "string",
        "generation": 5,
        "initializers": {
          "pending": [
            {
              "name": "string"
            },
            {
              "name": "string"
            },
            {
              "name": "string"
            },
            {
              "name": "string"
            },
            {
              "name": "string"
            },
            {
              "name": "string"
            },
            {
              "name": "string"
            },
            {
              "name": "string"
            },
            {
              "name": "string"
            }
          ],
          "result": {
            "apiVersion": "string",
            "code": 4,
            "details": {
              "causes": [
                {
                  "field": "string",
                  "message": "string",
                  "reason": "string"
                }
              ],
              "group": "string",
              "kind": "string",
              "name": "string",
              "retryAfterSeconds": 7,
              "uid": "string"
            },
            "kind": "string",
            "message": "string",
            "metadata": {
              "continue": "string",
              "remainingItemCount": 3,
              "resourceVersion": "string",
              "selfLink": "string"
            },
            "reason": "string",
            "status": "string"
          }
        },
        "labels": {},
        "managedFields": [
          {
            "apiVersion": "string",
            "fields": {},
            "manager": "string",
            "operation": "string",
            "time": "string"
          },
          {
            "apiVersion": "string",
            "fields": {},
            "manager": "string",
            "operation": "string",
            "time": "string"
          },
          {
            "apiVersion": "string",
            "fields": {},
            "manager": "string",
            "operation": "string",
            "time": "string"
          }
        ],
        "name": "string",
        "namespace": "string",
        "ownerReferences": [
          {
            "apiVersion": "string",
            "blockOwnerDeletion": true,
            "controller": true,
            "kind": "string",
            "name": "string",
            "uid": "string"
          },
          {
            "apiVersion": "string",
            "blockOwnerDeletion": false,
            "controller": false,
            "kind": "string",
            "name": "string",
            "uid": "string"
          },
          {
            "apiVersion": "string",
            "blockOwnerDeletion": false,
            "controller": true,
            "kind": "string",
            "name": "string",
            "uid": "string"
          },
          {
            "apiVersion": "string",
            "blockOwnerDeletion": true,
            "controller": true,
            "kind": "string",
            "name": "string",
            "uid": "string"
          },
          {
            "apiVersion": "string",
            "blockOwnerDeletion": false,
            "controller": false,
            "kind": "string",
            "name": "string",
            "uid": "string"
          },
          {
            "apiVersion": "string",
            "blockOwnerDeletion": false,
            "controller": false,
            "kind": "string",
            "name": "string",
            "uid": "string"
          },
          {
            "apiVersion": "string",
            "blockOwnerDeletion": true,
            "controller": true,
            "kind": "string",
            "name": "string",
            "uid": "string"
          },
          {
            "apiVersion": "string",
            "blockOwnerDeletion": true,
            "controller": true,
            "kind": "string",
            "name": "string",
            "uid": "string"
          },
          {
            "apiVersion": "string",
            "blockOwnerDeletion": false,
            "controller": true,
            "kind": "string",
            "name": "string",
            "uid": "string"
          },
          {
            "apiVersion": "string",
            "blockOwnerDeletion": true,
            "controller": true,
            "kind": "string",
            "name": "string",
            "uid": "string"
          }
        ],
        "resourceVersion": "string",
        "selfLink": "string",
        "uid": "string"
      },
      "revision": 6
    },
    {
      "apiVersion": "string",
      "data": {
        "Raw": "string"
      },
      "kind": "string",
      "metadata": {
        "annotations": {},
        "clusterName": "string",
        "creationTimestamp": "string",
        "deletionGracePeriodSeconds": 10,
        "deletionTimestamp": "string",
        "finalizers": [
          "string",
          "string",
          "string",
          "string",
          "string",
          "string",
          "string"
        ],
        "generateName": "string",
        "generation": 10,
        "initializers": {
          "pending": [
            {
              "name": "string"
            },
            {
              "name": "string"
            },
            {
              "name": "string"
            }
          ],
          "result": {
            "apiVersion": "string",
            "code": 5,
            "details": {
              "causes": [
                {
                  "field": "string",
                  "message": "string",
                  "reason": "string"
                },
                {
                  "field": "string",
                  "message": "string",
                  "reason": "string"
                },
                {
                  "field": "string",
                  "message": "string",
                  "reason": "string"
                },
                {
                  "field": "string",
                  "message": "string",
                  "reason": "string"
                }
              ],
              "group": "string",
              "kind": "string",
              "name": "string",
              "retryAfterSeconds": 2,
              "uid": "string"
            },
            "kind": "string",
            "message": "string",
            "metadata": {
              "continue": "string",
              "remainingItemCount": 2,
              "resourceVersion": "string",
              "selfLink": "string"
            },
            "reason": "string",
            "status": "string"
          }
        },
        "labels": {},
        "managedFields": [
          {
            "apiVersion": "string",
            "fields": {},
            "manager": "string",
            "operation": "string",
            "time": "string"
          },
          {
            "apiVersion": "string",
            "fields": {},
            "manager": "string",
            "operation": "string",
            "time": "string"
          },
          {
            "apiVersion": "string",
            "fields": {},
            "manager": "string",
            "operation": "string",
            "time": "string"
          },
          {
            "apiVersion": "string",
            "fields": {},
            "manager": "string",
            "operation": "string",
            "time": "string"
          },
          {
            "apiVersion": "string",
            "fields": {},
            "manager": "string",
            "operation": "string",
            "time": "string"
          },
          {
            "apiVersion": "string",
            "fields": {},
            "manager": "string",
            "operation": "string",
            "time": "string"
          },
          {
            "apiVersion": "string",
            "fields": {},
            "manager": "string",
            "operation": "string",
            "time": "string"
          },
          {
            "apiVersion": "string",
            "fields": {},
            "manager": "string",
            "operation": "string",
            "time": "string"
          },
          {
            "apiVersion": "string",
            "fields": {},
            "manager": "string",
            "operation": "string",
            "time": "string"
          },
          {
            "apiVersion": "string",
            "fields": {},
            "manager": "string",
            "operation": "string",
            "time": "string"
          }
        ],
        "name": "string",
        "namespace": "string",
        "ownerReferences": [
          {
            "apiVersion": "string",
            "blockOwnerDeletion": false,
            "controller": false,
            "kind": "string",
            "name": "string",
            "uid": "string"
          },
          {
            "apiVersion": "string",
            "blockOwnerDeletion": false,
            "controller": true,
            "kind": "string",
            "name": "string",
            "uid": "string"
          },
          {
            "apiVersion": "string",
            "blockOwnerDeletion": false,
            "controller": true,
            "kind": "string",
            "name": "string",
            "uid": "string"
          },
          {
            "apiVersion": "string",
            "blockOwnerDeletion": true,
            "controller": false,
            "kind": "string",
            "name": "string",
            "uid": "string"
          },
          {
            "apiVersion": "string",
            "blockOwnerDeletion": false,
            "controller": true,
            "kind": "string",
            "name": "string",
            "uid": "string"
          }
        ],
        "resourceVersion": "string",
        "selfLink": "string",
        "uid": "string"
      },
      "revision": 1
    },
    {
      "apiVersion": "string",
      "data": {
        "Raw": "string"
      },
      "kind": "string",
      "metadata": {
        "annotations": {},
        "clusterName": "string",
        "creationTimestamp": "string",
        "deletionGracePeriodSeconds": 7,
        "deletionTimestamp": "string",
        "finalizers": [
          "string"
        ],
        "generateName": "string",
        "generation": 10,
        "initializers": {
          "pending": [
            {
              "name": "string"
            },
            {
              "name": "string"
            },
            {
              "name": "string"
            },
            {
              "name": "string"
            },
            {
              "name": "string"
            }
          ],
          "result": {
            "apiVersion": "string",
            "code": 2,
            "details": {
              "causes": [
                {
                  "field": "string",
                  "message": "string",
                  "reason": "string"
                },
                {
                  "field": "string",
                  "message": "string",
                  "reason": "string"
                },
                {
                  "field": "string",
                  "message": "string",
                  "reason": "string"
                },
                {
                  "field": "string",
                  "message": "string",
                  "reason": "string"
                },
                {
                  "field": "string",
                  "message": "string",
                  "reason": "string"
                },
                {
                  "field": "string",
                  "message": "string",
                  "reason": "string"
                }
              ],
              "group": "string",
              "kind": "string",
              "name": "string",
              "retryAfterSeconds": 7,
              "uid": "string"
            },
            "kind": "string",
            "message": "string",
            "metadata": {
              "continue": "string",
              "remainingItemCount": 3,
              "resourceVersion": "string",
              "selfLink": "string"
            },
            "reason": "string",
            "status": "string"
          }
        },
        "labels": {},
        "managedFields": [
          {
            "apiVersion": "string",
            "fields": {},
            "manager": "string",
            "operation": "string",
            "time": "string"
          },
          {
            "apiVersion": "string",
            "fields": {},
            "manager": "string",
            "operation": "string",
            "time": "string"
          }
        ],
        "name": "string",
        "namespace": "string",
        "ownerReferences": [
          {
            "apiVersion": "string",
            "blockOwnerDeletion": true,
            "controller": false,
            "kind": "string",
            "name": "string",
            "uid": "string"
          },
          {
            "apiVersion": "string",
            "blockOwnerDeletion": true,
            "controller": false,
            "kind": "string",
            "name": "string",
            "uid": "string"
          },
          {
            "apiVersion": "string",
            "blockOwnerDeletion": false,
            "controller": true,
            "kind": "string",
            "name": "string",
            "uid": "string"
          },
          {
            "apiVersion": "string",
            "blockOwnerDeletion": true,
            "controller": false,
            "kind": "string",
            "name": "string",
            "uid": "string"
          },
          {
            "apiVersion": "string",
            "blockOwnerDeletion": true,
            "controller": true,
            "kind": "string",
            "name": "string",
            "uid": "string"
          }
        ],
        "resourceVersion": "string",
        "selfLink": "string",
        "uid": "string"
      },
      "revision": 1
    },
    {
      "apiVersion": "string",
      "data": {
        "Raw": "string"
      },
      "kind": "string",
      "metadata": {
        "annotations": {},
        "clusterName": "string",
        "creationTimestamp": "string",
        "deletionGracePeriodSeconds": 3,
        "deletionTimestamp": "string",
        "finalizers": [
          "string",
          "string",
          "string",
          "string",
          "string",
          "string",
          "string"
        ],
        "generateName": "string",
        "generation": 6,
        "initializers": {
          "pending": [
            {
              "name": "string"
            },
            {
              "name": "string"
            },
            {
              "name": "string"
            },
            {
              "name": "string"
            },
            {
              "name": "string"
            },
            {
              "name": "string"
            }
          ],
          "result": {
            "apiVersion": "string",
            "code": 6,
            "details": {
              "causes": [
                {
                  "field": "string",
                  "message": "string",
                  "reason": "string"
                },
                {
                  "field": "string",
                  "message": "string",
                  "reason": "string"
                },
                {
                  "field": "string",
                  "message": "string",
                  "reason": "string"
                },
                {
                  "field": "string",
                  "message": "string",
                  "reason": "string"
                },
                {
                  "field": "string",
                  "message": "string",
                  "reason": "string"
                },
                {
                  "field": "string",
                  "message": "string",
                  "reason": "string"
                },
                {
                  "field": "string",
                  "message": "string",
                  "reason": "string"
                },
                {
                  "field": "string",
                  "message": "string",
                  "reason": "string"
                },
                {
                  "field": "string",
                  "message": "string",
                  "reason": "string"
                },
                {
                  "field": "string",
                  "message": "string",
                  "reason": "string"
                }
              ],
              "group": "string",
              "kind": "string",
              "name": "string",
              "retryAfterSeconds": 1,
              "uid": "string"
            },
            "kind": "string",
            "message": "string",
            "metadata": {
              "continue": "string",
              "remainingItemCount": 7,
              "resourceVersion": "string",
              "selfLink": "string"
            },
            "reason": "string",
            "status": "string"
          }
        },
        "labels": {},
        "managedFields": [
          {
            "apiVersion": "string",
            "fields": {},
            "manager": "string",
            "operation": "string",
            "time": "string"
          },
          {
            "apiVersion": "string",
            "fields": {},
            "manager": "string",
            "operation": "string",
            "time": "string"
          },
          {
            "apiVersion": "string",
            "fields": {},
            "manager": "string",
            "operation": "string",
            "time": "string"
          },
          {
            "apiVersion": "string",
            "fields": {},
            "manager": "string",
            "operation": "string",
            "time": "string"
          },
          {
            "apiVersion": "string",
            "fields": {},
            "manager": "string",
            "operation": "string",
            "time": "string"
          },
          {
            "apiVersion": "string",
            "fields": {},
            "manager": "string",
            "operation": "string",
            "time": "string"
          },
          {
            "apiVersion": "string",
            "fields": {},
            "manager": "string",
            "operation": "string",
            "time": "string"
          }
        ],
        "name": "string",
        "namespace": "string",
        "ownerReferences": [
          {
            "apiVersion": "string",
            "blockOwnerDeletion": false,
            "controller": false,
            "kind": "string",
            "name": "string",
            "uid": "string"
          },
          {
            "apiVersion": "string",
            "blockOwnerDeletion": true,
            "controller": true,
            "kind": "string",
            "name": "string",
            "uid": "string"
          },
          {
            "apiVersion": "string",
            "blockOwnerDeletion": false,
            "controller": true,
            "kind": "string",
            "name": "string",
            "uid": "string"
          }
        ],
        "resourceVersion": "string",
        "selfLink": "string",
        "uid": "string"
      },
      "revision": 10
    },
    {
      "apiVersion": "string",
      "data": {
        "Raw": "string"
      },
      "kind": "string",
      "metadata": {
        "annotations": {},
        "clusterName": "string",
        "creationTimestamp": "string",
        "deletionGracePeriodSeconds": 3,
        "deletionTimestamp": "string",
        "finalizers": [
          "string",
          "string"
        ],
        "generateName": "string",
        "generation": 9,
        "initializers": {
          "pending": [
            {
              "name": "string"
            },
            {
              "name": "string"
            },
            {
              "name": "string"
            },
            {
              "name": "string"
            },
            {
              "name": "string"
            },
            {
              "name": "string"
            }
          ],
          "result": {
            "apiVersion": "string",
            "code": 9,
            "details": {
              "causes": [
                {
                  "field": "string",
                  "message": "string",
                  "reason": "string"
                },
                {
                  "field": "string",
                  "message": "string",
                  "reason": "string"
                },
                {
                  "field": "string",
                  "message": "string",
                  "reason": "string"
                }
              ],
              "group": "string",
              "kind": "string",
              "name": "string",
              "retryAfterSeconds": 5,
              "uid": "string"
            },
            "kind": "string",
            "message": "string",
            "metadata": {
              "continue": "string",
              "remainingItemCount": 1,
              "resourceVersion": "string",
              "selfLink": "string"
            },
            "reason": "string",
            "status": "string"
          }
        },
        "labels": {},
        "managedFields": [
          {
            "apiVersion": "string",
            "fields": {},
            "manager": "string",
            "operation": "string",
            "time": "string"
          },
          {
            "apiVersion": "string",
            "fields": {},
            "manager": "string",
            "operation": "string",
            "time": "string"
          },
          {
            "apiVersion": "string",
            "fields": {},
            "manager": "string",
            "operation": "string",
            "time": "string"
          },
          {
            "apiVersion": "string",
            "fields": {},
            "manager": "string",
            "operation": "string",
            "time": "string"
          },
          {
            "apiVersion": "string",
            "fields": {},
            "manager": "string",
            "operation": "string",
            "time": "string"
          }
        ],
        "name": "string",
        "namespace": "string",
        "ownerReferences": [
          {
            "apiVersion": "string",
            "blockOwnerDeletion": true,
            "controller": false,
            "kind": "string",
            "name": "string",
            "uid": "string"
          },
          {
            "apiVersion": "string",
            "blockOwnerDeletion": true,
            "controller": false,
            "kind": "string",
            "name": "string",
            "uid": "string"
          },
          {
            "apiVersion": "string",
            "blockOwnerDeletion": true,
            "controller": false,
            "kind": "string",
            "name": "string",
            "uid": "string"
          },
          {
            "apiVersion": "string",
            "blockOwnerDeletion": true,
            "controller": false,
            "kind": "string",
            "name": "string",
            "uid": "string"
          },
          {
            "apiVersion": "string",
            "blockOwnerDeletion": true,
            "controller": false,
            "kind": "string",
            "name": "string",
            "uid": "string"
          },
          {
            "apiVersion": "string",
            "blockOwnerDeletion": false,
            "controller": false,
            "kind": "string",
            "name": "string",
            "uid": "string"
          },
          {
            "apiVersion": "string",
            "blockOwnerDeletion": true,
            "controller": false,
            "kind": "string",
            "name": "string",
            "uid": "string"
          },
          {
            "apiVersion": "string",
            "blockOwnerDeletion": true,
            "controller": true,
            "kind": "string",
            "name": "string",
            "uid": "string"
          },
          {
            "apiVersion": "string",
            "blockOwnerDeletion": true,
            "controller": true,
            "kind": "string",
            "name": "string",
            "uid": "string"
          },
          {
            "apiVersion": "string",
            "blockOwnerDeletion": true,
            "controller": false,
            "kind": "string",
            "name": "string",
            "uid": "string"
          }
        ],
        "resourceVersion": "string",
        "selfLink": "string",
        "uid": "string"
      },
      "revision": 4
    },
    {
      "apiVersion": "string",
      "data": {
        "Raw": "string"
      },
      "kind": "string",
      "metadata": {
        "annotations": {},
        "clusterName": "string",
        "creationTimestamp": "string",
        "deletionGracePeriodSeconds": 5,
        "deletionTimestamp": "string",
        "finalizers": [
          "string",
          "string",
          "string",
          "string",
          "string",
          "string"
        ],
        "generateName": "string",
        "generation": 4,
        "initializers": {
          "pending": [
            {
              "name": "string"
            },
            {
              "name": "string"
            },
            {
              "name": "string"
            },
            {
              "name": "string"
            },
            {
              "name": "string"
            }
          ],
          "result": {
            "apiVersion": "string",
            "code": 3,
            "details": {
              "causes": [
                {
                  "field": "string",
                  "message": "string",
                  "reason": "string"
                },
                {
                  "field": "string",
                  "message": "string",
                  "reason": "string"
                },
                {
                  "field": "string",
                  "message": "string",
                  "reason": "string"
                },
                {
                  "field": "string",
                  "message": "string",
                  "reason": "string"
                },
                {
                  "field": "string",
                  "message": "string",
                  "reason": "string"
                },
                {
                  "field": "string",
                  "message": "string",
                  "reason": "string"
                },
                {
                  "field": "string",
                  "message": "string",
                  "reason": "string"
                },
                {
                  "field": "string",
                  "message": "string",
                  "reason": "string"
                },
                {
                  "field": "string",
                  "message": "string",
                  "reason": "string"
                }
              ],
              "group": "string",
              "kind": "string",
              "name": "string",
              "retryAfterSeconds": 5,
              "uid": "string"
            },
            "kind": "string",
            "message": "string",
            "metadata": {
              "continue": "string",
              "remainingItemCount": 8,
              "resourceVersion": "string",
              "selfLink": "string"
            },
            "reason": "string",
            "status": "string"
          }
        },
        "labels": {},
        "managedFields": [
          {
            "apiVersion": "string",
            "fields": {},
            "manager": "string",
            "operation": "string",
            "time": "string"
          },
          {
            "apiVersion": "string",
            "fields": {},
            "manager": "string",
            "operation": "string",
            "time": "string"
          },
          {
            "apiVersion": "string",
            "fields": {},
            "manager": "string",
            "operation": "string",
            "time": "string"
          }
        ],
        "name": "string",
        "namespace": "string",
        "ownerReferences": [
          {
            "apiVersion": "string",
            "blockOwnerDeletion": false,
            "controller": true,
            "kind": "string",
            "name": "string",
            "uid": "string"
          },
          {
            "apiVersion": "string",
            "blockOwnerDeletion": true,
            "controller": true,
            "kind": "string",
            "name": "string",
            "uid": "string"
          }
        ],
        "resourceVersion": "string",
        "selfLink": "string",
        "uid": "string"
      },
      "revision": 5
    },
    {
      "apiVersion": "string",
      "data": {
        "Raw": "string"
      },
      "kind": "string",
      "metadata": {
        "annotations": {},
        "clusterName": "string",
        "creationTimestamp": "string",
        "deletionGracePeriodSeconds": 10,
        "deletionTimestamp": "string",
        "finalizers": [
          "string",
          "string",
          "string",
          "string"
        ],
        "generateName": "string",
        "generation": 3,
        "initializers": {
          "pending": [
            {
              "name": "string"
            },
            {
              "name": "string"
            },
            {
              "name": "string"
            },
            {
              "name": "string"
            },
            {
              "name": "string"
            },
            {
              "name": "string"
            },
            {
              "name": "string"
            },
            {
              "name": "string"
            },
            {
              "name": "string"
            }
          ],
          "result": {
            "apiVersion": "string",
            "code": 1,
            "details": {
              "causes": [
                {
                  "field": "string",
                  "message": "string",
                  "reason": "string"
                },
                {
                  "field": "string",
                  "message": "string",
                  "reason": "string"
                },
                {
                  "field": "string",
                  "message": "string",
                  "reason": "string"
                },
                {
                  "field": "string",
                  "message": "string",
                  "reason": "string"
                },
                {
                  "field": "string",
                  "message": "string",
                  "reason": "string"
                }
              ],
              "group": "string",
              "kind": "string",
              "name": "string",
              "retryAfterSeconds": 1,
              "uid": "string"
            },
            "kind": "string",
            "message": "string",
            "metadata": {
              "continue": "string",
              "remainingItemCount": 10,
              "resourceVersion": "string",
              "selfLink": "string"
            },
            "reason": "string",
            "status": "string"
          }
        },
        "labels": {},
        "managedFields": [
          {
            "apiVersion": "string",
            "fields": {},
            "manager": "string",
            "operation": "string",
            "time": "string"
          },
          {
            "apiVersion": "string",
            "fields": {},
            "manager": "string",
            "operation": "string",
            "time": "string"
          },
          {
            "apiVersion": "string",
            "fields": {},
            "manager": "string",
            "operation": "string",
            "time": "string"
          },
          {
            "apiVersion": "string",
            "fields": {},
            "manager": "string",
            "operation": "string",
            "time": "string"
          },
          {
            "apiVersion": "string",
            "fields": {},
            "manager": "string",
            "operation": "string",
            "time": "string"
          },
          {
            "apiVersion": "string",
            "fields": {},
            "manager": "string",
            "operation": "string",
            "time": "string"
          },
          {
            "apiVersion": "string",
            "fields": {},
            "manager": "string",
            "operation": "string",
            "time": "string"
          },
          {
            "apiVersion": "string",
            "fields": {},
            "manager": "string",
            "operation": "string",
            "time": "string"
          },
          {
            "apiVersion": "string",
            "fields": {},
            "manager": "string",
            "operation": "string",
            "time": "string"
          }
        ],
        "name": "string",
        "namespace": "string",
        "ownerReferences": [
          {
            "apiVersion": "string",
            "blockOwnerDeletion": true,
            "controller": true,
            "kind": "string",
            "name": "string",
            "uid": "string"
          },
          {
            "apiVersion": "string",
            "blockOwnerDeletion": false,
            "controller": true,
            "kind": "string",
            "name": "string",
            "uid": "string"
          },
          {
            "apiVersion": "string",
            "blockOwnerDeletion": true,
            "controller": false,
            "kind": "string",
            "name": "string",
            "uid": "string"
          },
          {
            "apiVersion": "string",
            "blockOwnerDeletion": true,
            "controller": false,
            "kind": "string",
            "name": "string",
            "uid": "string"
          },
          {
            "apiVersion": "string",
            "blockOwnerDeletion": false,
            "controller": true,
            "kind": "string",
            "name": "string",
            "uid": "string"
          },
          {
            "apiVersion": "string",
            "blockOwnerDeletion": false,
            "controller": true,
            "kind": "string",
            "name": "string",
            "uid": "string"
          },
          {
            "apiVersion": "string",
            "blockOwnerDeletion": false,
            "controller": true,
            "kind": "string",
            "name": "string",
            "uid": "string"
          },
          {
            "apiVersion": "string",
            "blockOwnerDeletion": true,
            "controller": true,
            "kind": "string",
            "name": "string",
            "uid": "string"
          },
          {
            "apiVersion": "string",
            "blockOwnerDeletion": true,
            "controller": false,
            "kind": "string",
            "name": "string",
            "uid": "string"
          }
        ],
        "resourceVersion": "string",
        "selfLink": "string",
        "uid": "string"
      },
      "revision": 9
    },
    {
      "apiVersion": "string",
      "data": {
        "Raw": "string"
      },
      "kind": "string",
      "metadata": {
        "annotations": {},
        "clusterName": "string",
        "creationTimestamp": "string",
        "deletionGracePeriodSeconds": 4,
        "deletionTimestamp": "string",
        "finalizers": [
          "string",
          "string"
        ],
        "generateName": "string",
        "generation": 2,
        "initializers": {
          "pending": [
            {
              "name": "string"
            },
            {
              "name": "string"
            },
            {
              "name": "string"
            }
          ],
          "result": {
            "apiVersion": "string",
            "code": 6,
            "details": {
              "causes": [
                {
                  "field": "string",
                  "message": "string",
                  "reason": "string"
                },
                {
                  "field": "string",
                  "message": "string",
                  "reason": "string"
                },
                {
                  "field": "string",
                  "message": "string",
                  "reason": "string"
                },
                {
                  "field": "string",
                  "message": "string",
                  "reason": "string"
                },
                {
                  "field": "string",
                  "message": "string",
                  "reason": "string"
                },
                {
                  "field": "string",
                  "message": "string",
                  "reason": "string"
                },
                {
                  "field": "string",
                  "message": "string",
                  "reason": "string"
                }
              ],
              "group": "string",
              "kind": "string",
              "name": "string",
              "retryAfterSeconds": 8,
              "uid": "string"
            },
            "kind": "string",
            "message": "string",
            "metadata": {
              "continue": "string",
              "remainingItemCount": 10,
              "resourceVersion": "string",
              "selfLink": "string"
            },
            "reason": "string",
            "status": "string"
          }
        },
        "labels": {},
        "managedFields": [
          {
            "apiVersion": "string",
            "fields": {},
            "manager": "string",
            "operation": "string",
            "time": "string"
          },
          {
            "apiVersion": "string",
            "fields": {},
            "manager": "string",
            "operation": "string",
            "time": "string"
          },
          {
            "apiVersion": "string",
            "fields": {},
            "manager": "string",
            "operation": "string",
            "time": "string"
          },
          {
            "apiVersion": "string",
            "fields": {},
            "manager": "string",
            "operation": "string",
            "time": "string"
          },
          {
            "apiVersion": "string",
            "fields": {},
            "manager": "string",
            "operation": "string",
            "time": "string"
          }
        ],
        "name": "string",
        "namespace": "string",
        "ownerReferences": [
          {
            "apiVersion": "string",
            "blockOwnerDeletion": true,
            "controller": true,
            "kind": "string",
            "name": "string",
            "uid": "string"
          },
          {
            "apiVersion": "string",
            "blockOwnerDeletion": false,
            "controller": false,
            "kind": "string",
            "name": "string",
            "uid": "string"
          },
          {
            "apiVersion": "string",
            "blockOwnerDeletion": true,
            "controller": true,
            "kind": "string",
            "name": "string",
            "uid": "string"
          },
          {
            "apiVersion": "string",
            "blockOwnerDeletion": true,
            "controller": false,
            "kind": "string",
            "name": "string",
            "uid": "string"
          },
          {
            "apiVersion": "string",
            "blockOwnerDeletion": true,
            "controller": false,
            "kind": "string",
            "name": "string",
            "uid": "string"
          },
          {
            "apiVersion": "string",
            "blockOwnerDeletion": false,
            "controller": true,
            "kind": "string",
            "name": "string",
            "uid": "string"
          }
        ],
        "resourceVersion": "string",
        "selfLink": "string",
        "uid": "string"
      },
      "revision": 10
    },
    {
      "apiVersion": "string",
      "data": {
        "Raw": "string"
      },
      "kind": "string",
      "metadata": {
        "annotations": {},
        "clusterName": "string",
        "creationTimestamp": "string",
        "deletionGracePeriodSeconds": 8,
        "deletionTimestamp": "string",
        "finalizers": [
          "string",
          "string",
          "string",
          "string",
          "string",
          "string",
          "string",
          "string",
          "string"
        ],
        "generateName": "string",
        "generation": 8,
        "initializers": {
          "pending": [
            {
              "name": "string"
            },
            {
              "name": "string"
            },
            {
              "name": "string"
            },
            {
              "name": "string"
            }
          ],
          "result": {
            "apiVersion": "string",
            "code": 7,
            "details": {
              "causes": [
                {
                  "field": "string",
                  "message": "string",
                  "reason": "string"
                },
                {
                  "field": "string",
                  "message": "string",
                  "reason": "string"
                },
                {
                  "field": "string",
                  "message": "string",
                  "reason": "string"
                },
                {
                  "field": "string",
                  "message": "string",
                  "reason": "string"
                }
              ],
              "group": "string",
              "kind": "string",
              "name": "string",
              "retryAfterSeconds": 4,
              "uid": "string"
            },
            "kind": "string",
            "message": "string",
            "metadata": {
              "continue": "string",
              "remainingItemCount": 5,
              "resourceVersion": "string",
              "selfLink": "string"
            },
            "reason": "string",
            "status": "string"
          }
        },
        "labels": {},
        "managedFields": [
          {
            "apiVersion": "string",
            "fields": {},
            "manager": "string",
            "operation": "string",
            "time": "string"
          },
          {
            "apiVersion": "string",
            "fields": {},
            "manager": "string",
            "operation": "string",
            "time": "string"
          },
          {
            "apiVersion": "string",
            "fields": {},
            "manager": "string",
            "operation": "string",
            "time": "string"
          },
          {
            "apiVersion": "string",
            "fields": {},
            "manager": "string",
            "operation": "string",
            "time": "string"
          },
          {
            "apiVersion": "string",
            "fields": {},
            "manager": "string",
            "operation": "string",
            "time": "string"
          },
          {
            "apiVersion": "string",
            "fields": {},
            "manager": "string",
            "operation": "string",
            "time": "string"
          },
          {
            "apiVersion": "string",
            "fields": {},
            "manager": "string",
            "operation": "string",
            "time": "string"
          },
          {
            "apiVersion": "string",
            "fields": {},
            "manager": "string",
            "operation": "string",
            "time": "string"
          },
          {
            "apiVersion": "string",
            "fields": {},
            "manager": "string",
            "operation": "string",
            "time": "string"
          }
        ],
        "name": "string",
        "namespace": "string",
        "ownerReferences": [
          {
            "apiVersion": "string",
            "blockOwnerDeletion": false,
            "controller": true,
            "kind": "string",
            "name": "string",
            "uid": "string"
          },
          {
            "apiVersion": "string",
            "blockOwnerDeletion": true,
            "controller": false,
            "kind": "string",
            "name": "string",
            "uid": "string"
          },
          {
            "apiVersion": "string",
            "blockOwnerDeletion": true,
            "controller": false,
            "kind": "string",
            "name": "string",
            "uid": "string"
          },
          {
            "apiVersion": "string",
            "blockOwnerDeletion": true,
            "controller": true,
            "kind": "string",
            "name": "string",
            "uid": "string"
          },
          {
            "apiVersion": "string",
            "blockOwnerDeletion": false,
            "controller": false,
            "kind": "string",
            "name": "string",
            "uid": "string"
          },
          {
            "apiVersion": "string",
            "blockOwnerDeletion": false,
            "controller": false,
            "kind": "string",
            "name": "string",
            "uid": "string"
          },
          {
            "apiVersion": "string",
            "blockOwnerDeletion": false,
            "controller": false,
            "kind": "string",
            "name": "string",
            "uid": "string"
          },
          {
            "apiVersion": "string",
            "blockOwnerDeletion": false,
            "controller": false,
            "kind": "string",
            "name": "string",
            "uid": "string"
          },
          {
            "apiVersion": "string",
            "blockOwnerDeletion": true,
            "controller": false,
            "kind": "string",
            "name": "string",
            "uid": "string"
          }
        ],
        "resourceVersion": "string",
        "selfLink": "string",
        "uid": "string"
      },
      "revision": 10
    },
    {
      "apiVersion": "string",
      "data": {
        "Raw": "string"
      },
      "kind": "string",
      "metadata": {
        "annotations": {},
        "clusterName": "string",
        "creationTimestamp": "string",
        "deletionGracePeriodSeconds": 7,
        "deletionTimestamp": "string",
        "finalizers": [
          "string"
        ],
        "generateName": "string",
        "generation": 6,
        "initializers": {
          "pending": [
            {
              "name": "string"
            }
          ],
          "result": {
            "apiVersion": "string",
            "code": 10,
            "details": {
              "causes": [
                {
                  "field": "string",
                  "message": "string",
                  "reason": "string"
                },
                {
                  "field": "string",
                  "message": "string",
                  "reason": "string"
                }
              ],
              "group": "string",
              "kind": "string",
              "name": "string",
              "retryAfterSeconds": 7,
              "uid": "string"
            },
            "kind": "string",
            "message": "string",
            "metadata": {
              "continue": "string",
              "remainingItemCount": 9,
              "resourceVersion": "string",
              "selfLink": "string"
            },
            "reason": "string",
            "status": "string"
          }
        },
        "labels": {},
        "managedFields": [
          {
            "apiVersion": "string",
            "fields": {},
            "manager": "string",
            "operation": "string",
            "time": "string"
          },
          {
            "apiVersion": "string",
            "fields": {},
            "manager": "string",
            "operation": "string",
            "time": "string"
          },
          {
            "apiVersion": "string",
            "fields": {},
            "manager": "string",
            "operation": "string",
            "time": "string"
          }
        ],
        "name": "string",
        "namespace": "string",
        "ownerReferences": [
          {
            "apiVersion": "string",
            "blockOwnerDeletion": false,
            "controller": false,
            "kind": "string",
            "name": "string",
            "uid": "string"
          },
          {
            "apiVersion": "string",
            "blockOwnerDeletion": true,
            "controller": false,
            "kind": "string",
            "name": "string",
            "uid": "string"
          },
          {
            "apiVersion": "string",
            "blockOwnerDeletion": false,
            "controller": true,
            "kind": "string",
            "name": "string",
            "uid": "string"
          }
        ],
        "resourceVersion": "string",
        "selfLink": "string",
        "uid": "string"
      },
      "revision": 10
    }
  ],
  "kind": "string",
  "metadata": {
    "continue": "string",
    "remainingItemCount": 3,
    "resourceVersion": "string",
    "selfLink": "string"
  }
}