{
  "apiVersion": "string",
  "items": [
    {
      "apiVersion": "string",
      "kind": "string",
      "metadata": {
        "annotations": {},
        "clusterName": "string",
        "creationTimestamp": "string",
        "deletionGracePeriodSeconds": 7,
        "deletionTimestamp": "string",
        "finalizers": [
          "string"
        ],
        "generateName": "string",
        "generation": 1,
        "initializers": {
          "pending": [
            {
              "name": "string"
            },
            {
              "name": "string"
            },
            {
              "name": "string"
            },
            {
              "name": "string"
            },
            {
              "name": "string"
            },
            {
              "name": "string"
            },
            {
              "name": "string"
            }
          ],
          "result": {
            "apiVersion": "string",
            "code": 6,
            "details": {
              "causes": [
                {
                  "field": "string",
                  "message": "string",
                  "reason": "string"
                }
              ],
              "group": "string",
              "kind": "string",
              "name": "string",
              "retryAfterSeconds": 2,
              "uid": "string"
            },
            "kind": "string",
            "message": "string",
            "metadata": {
              "continue": "string",
              "remainingItemCount": 5,
              "resourceVersion": "string",
              "selfLink": "string"
            },
            "reason": "string",
            "status": "string"
          }
        },
        "labels": {},
        "managedFields": [
          {
            "apiVersion": "string",
            "fields": {},
            "manager": "string",
            "operation": "string",
            "time": "string"
          },
          {
            "apiVersion": "string",
            "fields": {},
            "manager": "string",
            "operation": "string",
            "time": "string"
          },
          {
            "apiVersion": "string",
            "fields": {},
            "manager": "string",
            "operation": "string",
            "time": "string"
          },
          {
            "apiVersion": "string",
            "fields": {},
            "manager": "string",
            "operation": "string",
            "time": "string"
          },
          {
            "apiVersion": "string",
            "fields": {},
            "manager": "string",
            "operation": "string",
            "time": "string"
          },
          {
            "apiVersion": "string",
            "fields": {},
            "manager": "string",
            "operation": "string",
            "time": "string"
          },
          {
            "apiVersion": "string",
            "fields": {},
            "manager": "string",
            "operation": "string",
            "time": "string"
          },
          {
            "apiVersion": "string",
            "fields": {},
            "manager": "string",
            "operation": "string",
            "time": "string"
          },
          {
            "apiVersion": "string",
            "fields": {},
            "manager": "string",
            "operation": "string",
            "time": "string"
          },
          {
            "apiVersion": "string",
            "fields": {},
            "manager": "string",
            "operation": "string",
            "time": "string"
          }
        ],
        "name": "string",
        "namespace": "string",
        "ownerReferences": [
          {
            "apiVersion": "string",
            "blockOwnerDeletion": false,
            "controller": true,
            "kind": "string",
            "name": "string",
            "uid": "string"
          },
          {
            "apiVersion": "string",
            "blockOwnerDeletion": true,
            "controller": false,
            "kind": "string",
            "name": "string",
            "uid": "string"
          },
          {
            "apiVersion": "string",
            "blockOwnerDeletion": true,
            "controller": false,
            "kind": "string",
            "name": "string",
            "uid": "string"
          },
          {
            "apiVersion": "string",
            "blockOwnerDeletion": false,
            "controller": true,
            "kind": "string",
            "name": "string",
            "uid": "string"
          },
          {
            "apiVersion": "string",
            "blockOwnerDeletion": true,
            "controller": true,
            "kind": "string",
            "name": "string",
            "uid": "string"
          },
          {
            "apiVersion": "string",
            "blockOwnerDeletion": true,
            "controller": false,
            "kind": "string",
            "name": "string",
            "uid": "string"
          }
        ],
        "resourceVersion": "string",
        "selfLink": "string",
        "uid": "string"
      },
      "spec": {
        "env": [
          {
            "name": "string",
            "value": "string",
            "valueFrom": {
              "configMapKeyRef": {
                "key": "string",
                "name": "string",
                "optional": true
              },
              "fieldRef": {
                "apiVersion": "string",
                "fieldPath": "string"
              },
              "resourceFieldRef": {
                "containerName": "string",
                "divisor": "string",
                "resource": "string"
              },
              "secretKeyRef": {
                "key": "string",
                "name": "string",
                "optional": false
              }
            }
          },
          {
            "name": "string",
            "value": "string",
            "valueFrom": {
              "configMapKeyRef": {
                "key": "string",
                "name": "string",
                "optional": false
              },
              "fieldRef": {
                "apiVersion": "string",
                "fieldPath": "string"
              },
              "resourceFieldRef": {
                "containerName": "string",
                "divisor": "string",
                "resource": "string"
              },
              "secretKeyRef": {
                "key": "string",
                "name": "string",
                "optional": false
              }
            }
          },
          {
            "name": "string",
            "value": "string",
            "valueFrom": {
              "configMapKeyRef": {
                "key": "string",
                "name": "string",
                "optional": false
              },
              "fieldRef": {
                "apiVersion": "string",
                "fieldPath": "string"
              },
              "resourceFieldRef": {
                "containerName": "string",
                "divisor": "string",
                "resource": "string"
              },
              "secretKeyRef": {
                "key": "string",
                "name": "string",
                "optional": true
              }
            }
          }
        ],
        "envFrom": [
          {
            "configMapRef": {
              "name": "string",
              "optional": false
            },
            "prefix": "string",
            "secretRef": {
              "name": "string",
              "optional": false
            }
          }
        ],
        "selector": {
          "matchExpressions": [
            {
              "key": "string",
              "operator": "string",
              "values": [
                "string",
                "string",
                "string",
                "string"
              ]
            },
            {
              "key": "string",
              "operator": "string",
              "values": [
                "string"
              ]
            },
            {
              "key": "string",
              "operator": "string",
              "values": [
                "string",
                "string",
                "string"
              ]
            }
          ],
          "matchLabels": {}
        },
        "volumeMounts": [
          {
            "mountPath": "string",
            "mountPropagation": "string",
            "name": "string",
            "readOnly": false,
            "subPath": "string",
            "subPathExpr": "string"
          },
          {
            "mountPath": "string",
            "mountPropagation": "string",
            "name": "string",
            "readOnly": false,
            "subPath": "string",
            "subPathExpr": "string"
          },
          {
            "mountPath": "string",
            "mountPropagation": "string",
            "name": "string",
            "readOnly": true,
            "subPath": "string",
            "subPathExpr": "string"
          }
        ],
        "volumes": [
          {
            "awsElasticBlockStore": {
              "fsType": "string",
              "partition": 3,
              "readOnly": true,
              "volumeID": "string"
            },
            "azureDisk": {
              "cachingMode": "string",
              "diskName": "string",
              "diskURI": "string",
              "fsType": "string",
              "kind": "string",
              "readOnly": true
            },
            "azureFile": {
              "readOnly": false,
              "secretName": "string",
              "shareName": "string"
            },
            "cephfs": {
              "monitors": [
                "string",
                "string",
                "string",
                "string",
                "string",
                "string",
                "string",
                "string"
              ],
              "path": "string",
              "readOnly": true,
              "secretFile": "string",
              "secretRef": {
                "name": "string"
              },
              "user": "string"
            },
            "cinder": {
              "fsType": "string",
              "readOnly": true,
              "secretRef": {
                "name": "string"
              },
              "volumeID": "string"
            },
            "configMap": {
              "defaultMode": 1,
              "items": [
                {
                  "key": "string",
                  "mode": 2,
                  "path": "string"
                },
                {
                  "key": "string",
                  "mode": 6,
                  "path": "string"
                },
                {
                  "key": "string",
                  "mode": 1,
                  "path": "string"
                },
                {
                  "key": "string",
                  "mode": 3,
                  "path": "string"
                },
                {
                  "key": "string",
                  "mode": 6,
                  "path": "string"
                },
                {
                  "key": "string",
                  "mode": 6,
                  "path": "string"
                },
                {
                  "key": "string",
                  "mode": 10,
                  "path": "string"
                },
                {
                  "key": "string",
                  "mode": 6,
                  "path": "string"
                },
                {
                  "key": "string",
                  "mode": 1,
                  "path": "string"
                },
                {
                  "key": "string",
                  "mode": 5,
                  "path": "string"
                }
              ],
              "name": "string",
              "optional": false
            },
            "csi": {
              "driver": "string",
              "fsType": "string",
              "nodePublishSecretRef": {
                "name": "string"
              },
              "readOnly": true,
              "volumeAttributes": {}
            },
            "downwardAPI": {
              "defaultMode": 5,
              "items": [
                {
                  "fieldRef": {
                    "apiVersion": "string",
                    "fieldPath": "string"
                  },
                  "mode": 4,
                  "path": "string",
                  "resourceFieldRef": {
                    "containerName": "string",
                    "divisor": "string",
                    "resource": "string"
                  }
                },
                {
                  "fieldRef": {
                    "apiVersion": "string",
                    "fieldPath": "string"
                  },
                  "mode": 4,
                  "path": "string",
                  "resourceFieldRef": {
                    "containerName": "string",
                    "divisor": "string",
                    "resource": "string"
                  }
                },
                {
                  "fieldRef": {
                    "apiVersion": "string",
                    "fieldPath": "string"
                  },
                  "mode": 6,
                  "path": "string",
                  "resourceFieldRef": {
                    "containerName": "string",
                    "divisor": "string",
                    "resource": "string"
                  }
                },
                {
                  "fieldRef": {
                    "apiVersion": "string",
                    "fieldPath": "string"
                  },
                  "mode": 5,
                  "path": "string",
                  "resourceFieldRef": {
                    "containerName": "string",
                    "divisor": "string",
                    "resource": "string"
                  }
                },
                {
                  "fieldRef": {
                    "apiVersion": "string",
                    "fieldPath": "string"
                  },
                  "mode": 7,
                  "path": "string",
                  "resourceFieldRef": {
                    "containerName": "string",
                    "divisor": "string",
                    "resource": "string"
                  }
                },
                {
                  "fieldRef": {
                    "apiVersion": "string",
                    "fieldPath": "string"
                  },
                  "mode": 7,
                  "path": "string",
                  "resourceFieldRef": {
                    "containerName": "string",
                    "divisor": "string",
                    "resource": "string"
                  }
                },
                {
                  "fieldRef": {
                    "apiVersion": "string",
                    "fieldPath": "string"
                  },
                  "mode": 2,
                  "path": "string",
                  "resourceFieldRef": {
                    "containerName": "string",
                    "divisor": "string",
                    "resource": "string"
                  }
                },
                {
                  "fieldRef": {
                    "apiVersion": "string",
                    "fieldPath": "string"
                  },
                  "mode": 7,
                  "path": "string",
                  "resourceFieldRef": {
                    "containerName": "string",
                    "divisor": "string",
                    "resource": "string"
                  }
                },
                {
                  "fieldRef": {
                    "apiVersion": "string",
                    "fieldPath": "string"
                  },
                  "mode": 1,
                  "path": "string",
                  "resourceFieldRef": {
                    "containerName": "string",
                    "divisor": "string",
                    "resource": "string"
                  }
                },
                {
                  "fieldRef": {
                    "apiVersion": "string",
                    "fieldPath": "string"
                  },
                  "mode": 2,
                  "path": "string",
                  "resourceFieldRef": {
                    "containerName": "string",
                    "divisor": "string",
                    "resource": "string"
                  }
                }
              ]
            },
            "emptyDir": {
              "medium": "string",
              "sizeLimit": "string"
            },
            "fc": {
              "fsType": "string",
              "lun": 10,
              "readOnly": true,
              "targetWWNs": [
                "string",
                "string",
                "string",
                "string"
              ],
              "wwids": [
                "string",
                "string"
              ]
            },
            "flexVolume": {
              "driver": "string",
              "fsType": "string",
              "options": {},
              "readOnly": false,
              "secretRef": {
                "name": "string"
              }
            },
            "flocker": {
              "datasetName": "string",
              "datasetUUID": "string"
            },
            "gcePersistentDisk": {
              "fsType": "string",
              "partition": 10,
              "pdName": "string",
              "readOnly": false
            },
            "gitRepo": {
              "directory": "string",
              "repository": "string",
              "revision": "string"
            },
            "glusterfs": {
              "endpoints": "string",
              "path": "string",
              "readOnly": false
            },
            "hostPath": {
              "path": "string",
              "type": "string"
            },
            "iscsi": {
              "chapAuthDiscovery": false,
              "chapAuthSession": true,
              "fsType": "string",
              "initiatorName": "string",
              "iqn": "string",
              "iscsiInterface": "string",
              "lun": 7,
              "portals": [
                "string",
                "string",
                "string",
                "string",
                "string",
                "string"
              ],
              "readOnly": true,
              "secretRef": {
                "name": "string"
              },
              "targetPortal": "string"
            },
            "name": "string",
            "nfs": {
              "path": "string",
              "readOnly": true,
              "server": "string"
            },
            "persistentVolumeClaim": {
              "claimName": "string",
              "readOnly": true
            },
            "photonPersistentDisk": {
              "fsType": "string",
              "pdID": "string"
            },
            "portworxVolume": {
              "fsType": "string",
              "readOnly": false,
              "volumeID": "string"
            },
            "projected": {
              "defaultMode": 9,
              "sources": [
                {
                  "configMap": {
                    "items": [
                      {
                        "key": "string",
                        "mode": 3,
                        "path": "string"
                      },
                      {
                        "key": "string",
                        "mode": 6,
                        "path": "string"
                      },
                      {
                        "key": "string",
                        "mode": 7,
                        "path": "string"
                      },
                      {
                        "key": "string",
                        "mode": 9,
                        "path": "string"
                      },
                      {
                        "key": "string",
                        "mode": 9,
                        "path": "string"
                      },
                      {
                        "key": "string",
                        "mode": 10,
                        "path": "string"
                      },
                      {
                        "key": "string",
                        "mode": 5,
                        "path": "string"
                      },
                      {
                        "key": "string",
                        "mode": 3,
                        "path": "string"
                      },
                      {
                        "key": "string",
                        "mode": 8,
                        "path": "string"
                      }
                    ],
                    "name": "string",
                    "optional": true
                  },
                  "downwardAPI": {
                    "items": [
                      {
                        "fieldRef": {
                          "apiVersion": "string",
                          "fieldPath": "string"
                        },
                        "mode": 7,
                        "path": "string",
                        "resourceFieldRef": {
                          "containerName": "string",
                          "divisor": "string",
                          "resource": "string"
                        }
                      },
                      {
                        "fieldRef": {
                          "apiVersion": "string",
                          "fieldPath": "string"
                        },
                        "mode": 4,
                        "path": "string",
                        "resourceFieldRef": {
                          "containerName": "string",
                          "divisor": "string",
                          "resource": "string"
                        }
                      },
                      {
                        "fieldRef": {
                          "apiVersion": "string",
                          "fieldPath": "string"
                        },
                        "mode": 10,
                        "path": "string",
                        "resourceFieldRef": {
                          "containerName": "string",
                          "divisor": "string",
                          "resource": "string"
                        }
                      }
                    ]
                  },
                  "secret": {
                    "items": [
                      {
                        "key": "string",
                        "mode": 4,
                        "path": "string"
                      },
                      {
                        "key": "string",
                        "mode": 8,
                        "path": "string"
                      },
                      {
                        "key": "string",
                        "mode": 7,
                        "path": "string"
                      },
                      {
                        "key": "string",
                        "mode": 4,
                        "path": "string"
                      },
                      {
                        "key": "string",
                        "mode": 7,
                        "path": "string"
                      },
                      {
                        "key": "string",
                        "mode": 3,
                        "path": "string"
                      },
                      {
                        "key": "string",
                        "mode": 6,
                        "path": "string"
                      }
                    ],
                    "name": "string",
                    "optional": false
                  },
                  "serviceAccountToken": {
                    "audience": "string",
                    "expirationSeconds": 2,
                    "path": "string"
                  }
                },
                {
                  "configMap": {
                    "items": [
                      {
                        "key": "string",
                        "mode": 3,
                        "path": "string"
                      },
                      {
                        "key": "string",
                        "mode": 2,
                        "path": "string"
                      },
                      {
                        "key": "string",
                        "mode": 9,
                        "path": "string"
                      },
                      {
                        "key": "string",
                        "mode": 9,
                        "path": "string"
                      },
                      {
                        "key": "string",
                        "mode": 6,
                        "path": "string"
                      },
                      {
                        "key": "string",
                        "mode": 3,
                        "path": "string"
                      }
                    ],
                    "name": "string",
                    "optional": false
                  },
                  "downwardAPI": {
                    "items": [
                      {
                        "fieldRef": {
                          "apiVersion": "string",
                          "fieldPath": "string"
                        },
                        "mode": 4,
                        "path": "string",
                        "resourceFieldRef": {
                          "containerName": "string",
                          "divisor": "string",
                          "resource": "string"
                        }
                      },
                      {
                        "fieldRef": {
                          "apiVersion": "string",
                          "fieldPath": "string"
                        },
                        "mode": 1,
                        "path": "string",
                        "resourceFieldRef": {
                          "containerName": "string",
                          "divisor": "string",
                          "resource": "string"
                        }
                      }
                    ]
                  },
                  "secret": {
                    "items": [
                      {
                        "key": "string",
                        "mode": 6,
                        "path": "string"
                      },
                      {
                        "key": "string",
                        "mode": 5,
                        "path": "string"
                      },
                      {
                        "key": "string",
                        "mode": 6,
                        "path": "string"
                      },
                      {
                        "key": "string",
                        "mode": 9,
                        "path": "string"
                      },
                      {
                        "key": "string",
                        "mode": 9,
                        "path": "string"
                      },
                      {
                        "key": "string",
                        "mode": 6,
                        "path": "string"
                      },
                      {
                        "key": "string",
                        "mode": 6,
                        "path": "string"
                      },
                      {
                        "key": "string",
                        "mode": 7,
                        "path": "string"
                      },
                      {
                        "key": "string",
                        "mode": 3,
                        "path": "string"
                      },
                      {
                        "key": "string",
                        "mode": 4,
                        "path": "string"
                      }
                    ],
                    "name": "string",
                    "optional": true
                  },
                  "serviceAccountToken": {
                    "audience": "string",
                    "expirationSeconds": 7,
                    "path": "string"
                  }
                },
                {
                  "configMap": {
                    "items": [
                      {
                        "key": "string",
                        "mode": 4,
                        "path": "string"
                      },
                      {
                        "key": "string",
                        "mode": 9,
                        "path": "string"
                      },
                      {
                        "key": "string",
                        "mode": 8,
                        "path": "string"
                      },
                      {
                        "key": "string",
                        "mode": 10,
                        "path": "string"
                      },
                      {
                        "key": "string",
                        "mode": 4,
                        "path": "string"
                      },
                      {
                        "key": "string",
                        "mode": 4,
                        "path": "string"
                      }
                    ],
                    "name": "string",
                    "optional": false
                  },
                  "downwardAPI": {
                    "items": [
                      {
                        "fieldRef": {
                          "apiVersion": "string",
                          "fieldPath": "string"
                        },
                        "mode": 9,
                        "path": "string",
                        "resourceFieldRef": {
                          "containerName": "string",
                          "divisor": "string",
                          "resource": "string"
                        }
                      },
                      {
                        "fieldRef": {
                          "apiVersion": "string",
                          "fieldPath": "string"
                        },
                        "mode": 9,
                        "path": "string",
                        "resourceFieldRef": {
                          "containerName": "string",
                          "divisor": "string",
                          "resource": "string"
                        }
                      },
                      {
                        "fieldRef": {
                          "apiVersion": "string",
                          "fieldPath": "string"
                        },
                        "mode": 1,
                        "path": "string",
                        "resourceFieldRef": {
                          "containerName": "string",
                          "divisor": "string",
                          "resource": "string"
                        }
                      }
                    ]
                  },
                  "secret": {
                    "items": [
                      {
                        "key": "string",
                        "mode": 7,
                        "path": "string"
                      }
                    ],
                    "name": "string",
                    "optional": false
                  },
                  "serviceAccountToken": {
                    "audience": "string",
                    "expirationSeconds": 9,
                    "path": "string"
                  }
                },
                {
                  "configMap": {
                    "items": [
                      {
                        "key": "string",
                        "mode": 2,
                        "path": "string"
                      },
                      {
                        "key": "string",
                        "mode": 4,
                        "path": "string"
                      },
                      {
                        "key": "string",
                        "mode": 1,
                        "path": "string"
                      },
                      {
                        "key": "string",
                        "mode": 4,
                        "path": "string"
                      },
                      {
                        "key": "string",
                        "mode": 10,
                        "path": "string"
                      },
                      {
                        "key": "string",
                        "mode": 2,
                        "path": "string"
                      }
                    ],
                    "name": "string",
                    "optional": true
                  },
                  "downwardAPI": {
                    "items": [
                      {
                        "fieldRef": {
                          "apiVersion": "string",
                          "fieldPath": "string"
                        },
                        "mode": 8,
                        "path": "string",
                        "resourceFieldRef": {
                          "containerName": "string",
                          "divisor": "string",
                          "resource": "string"
                        }
                      }
                    ]
                  },
                  "secret": {
                    "items": [
                      {
                        "key": "string",
                        "mode": 2,
                        "path": "string"
                      }
                    ],
                    "name": "string",
                    "optional": true
                  },
                  "serviceAccountToken": {
                    "audience": "string",
                    "expirationSeconds": 2,
                    "path": "string"
                  }
                }
              ]
            },
            "quobyte": {
              "group": "string",
              "readOnly": true,
              "registry": "string",
              "tenant": "string",
              "user": "string",
              "volume": "string"
            },
            "rbd": {
              "fsType": "string",
              "image": "string",
              "keyring": "string",
              "monitors": [
                "string",
                "string",
                "string",
                "string",
                "string",
                "string",
                "string"
              ],
              "pool": "string",
              "readOnly": false,
              "secretRef": {
                "name": "string"
              },
              "user": "string"
            },
            "scaleIO": {
              "fsType": "string",
              "gateway": "string",
              "protectionDomain": "string",
              "readOnly": false,
              "secretRef": {
                "name": "string"
              },
              "sslEnabled": false,
              "storageMode": "string",
              "storagePool": "string",
              "system": "string",
              "volumeName": "string"
            },
            "secret": {
              "defaultMode": 3,
              "items": [
                {
                  "key": "string",
                  "mode": 2,
                  "path": "string"
                }
              ],
              "optional": true,
              "secretName": "string"
            },
            "storageos": {
              "fsType": "string",
              "readOnly": false,
              "secretRef": {
                "name": "string"
              },
              "volumeName": "string",
              "volumeNamespace": "string"
            },
            "vsphereVolume": {
              "fsType": "string",
              "storagePolicyID": "string",
              "storagePolicyName": "string",
              "volumePath": "string"
            }
          },
          {
            "awsElasticBlockStore": {
              "fsType": "string",
              "partition": 8,
              "readOnly": false,
              "volumeID": "string"
            },
            "azureDisk": {
              "cachingMode": "string",
              "diskName": "string",
              "diskURI": "string",
              "fsType": "string",
              "kind": "string",
              "readOnly": true
            },
            "azureFile": {
              "readOnly": true,
              "secretName": "string",
              "shareName": "string"
            },
            "cephfs": {
              "monitors": [
                "string",
                "string",
                "string",
                "string",
                "string",
                "string",
                "string",
                "string"
              ],
              "path": "string",
              "readOnly": false,
              "secretFile": "string",
              "secretRef": {
                "name": "string"
              },
              "user": "string"
            },
            "cinder": {
              "fsType": "string",
              "readOnly": true,
              "secretRef": {
                "name": "string"
              },
              "volumeID": "string"
            },
            "configMap": {
              "defaultMode": 7,
              "items": [
                {
                  "key": "string",
                  "mode": 6,
                  "path": "string"
                },
                {
                  "key": "string",
                  "mode": 7,
                  "path": "string"
                },
                {
                  "key": "string",
                  "mode": 2,
                  "path": "string"
                },
                {
                  "key": "string",
                  "mode": 4,
                  "path": "string"
                }
              ],
              "name": "string",
              "optional": false
            },
            "csi": {
              "driver": "string",
              "fsType": "string",
              "nodePublishSecretRef": {
                "name": "string"
              },
              "readOnly": true,
              "volumeAttributes": {}
            },
            "downwardAPI": {
              "defaultMode": 7,
              "items": [
                {
                  "fieldRef": {
                    "apiVersion": "string",
                    "fieldPath": "string"
                  },
                  "mode": 2,
                  "path": "string",
                  "resourceFieldRef": {
                    "containerName": "string",
                    "divisor": "string",
                    "resource": "string"
                  }
                },
                {
                  "fieldRef": {
                    "apiVersion": "string",
                    "fieldPath": "string"
                  },
                  "mode": 4,
                  "path": "string",
                  "resourceFieldRef": {
                    "containerName": "string",
                    "divisor": "string",
                    "resource": "string"
                  }
                },
                {
                  "fieldRef": {
                    "apiVersion": "string",
                    "fieldPath": "string"
                  },
                  "mode": 3,
                  "path": "string",
                  "resourceFieldRef": {
                    "containerName": "string",
                    "divisor": "string",
                    "resource": "string"
                  }
                },
                {
                  "fieldRef": {
                    "apiVersion": "string",
                    "fieldPath": "string"
                  },
                  "mode": 2,
                  "path": "string",
                  "resourceFieldRef": {
                    "containerName": "string",
                    "divisor": "string",
                    "resource": "string"
                  }
                },
                {
                  "fieldRef": {
                    "apiVersion": "string",
                    "fieldPath": "string"
                  },
                  "mode": 5,
                  "path": "string",
                  "resourceFieldRef": {
                    "containerName": "string",
                    "divisor": "string",
                    "resource": "string"
                  }
                },
                {
                  "fieldRef": {
                    "apiVersion": "string",
                    "fieldPath": "string"
                  },
                  "mode": 6,
                  "path": "string",
                  "resourceFieldRef": {
                    "containerName": "string",
                    "divisor": "string",
                    "resource": "string"
                  }
                },
                {
                  "fieldRef": {
                    "apiVersion": "string",
                    "fieldPath": "string"
                  },
                  "mode": 3,
                  "path": "string",
                  "resourceFieldRef": {
                    "containerName": "string",
                    "divisor": "string",
                    "resource": "string"
                  }
                },
                {
                  "fieldRef": {
                    "apiVersion": "string",
                    "fieldPath": "string"
                  },
                  "mode": 1,
                  "path": "string",
                  "resourceFieldRef": {
                    "containerName": "string",
                    "divisor": "string",
                    "resource": "string"
                  }
                },
                {
                  "fieldRef": {
                    "apiVersion": "string",
                    "fieldPath": "string"
                  },
                  "mode": 8,
                  "path": "string",
                  "resourceFieldRef": {
                    "containerName": "string",
                    "divisor": "string",
                    "resource": "string"
                  }
                },
                {
                  "fieldRef": {
                    "apiVersion": "string",
                    "fieldPath": "string"
                  },
                  "mode": 5,
                  "path": "string",
                  "resourceFieldRef": {
                    "containerName": "string",
                    "divisor": "string",
                    "resource": "string"
                  }
                }
              ]
            },
            "emptyDir": {
              "medium": "string",
              "sizeLimit": "string"
            },
            "fc": {
              "fsType": "string",
              "lun": 7,
              "readOnly": true,
              "targetWWNs": [
                "string",
                "string",
                "string",
                "string",
                "string",
                "string",
                "string"
              ],
              "wwids": [
                "string",
                "string",
                "string",
                "string",
                "string",
                "string"
              ]
            },
            "flexVolume": {
              "driver": "string",
              "fsType": "string",
              "options": {},
              "readOnly": false,
              "secretRef": {
                "name": "string"
              }
            },
            "flocker": {
              "datasetName": "string",
              "datasetUUID": "string"
            },
            "gcePersistentDisk": {
              "fsType": "string",
              "partition": 6,
              "pdName": "string",
              "readOnly": false
            },
            "gitRepo": {
              "directory": "string",
              "repository": "string",
              "revision": "string"
            },
            "glusterfs": {
              "endpoints": "string",
              "path": "string",
              "readOnly": true
            },
            "hostPath": {
              "path": "string",
              "type": "string"
            },
            "iscsi": {
              "chapAuthDiscovery": false,
              "chapAuthSession": true,
              "fsType": "string",
              "initiatorName": "string",
              "iqn": "string",
              "iscsiInterface": "string",
              "lun": 4,
              "portals": [
                "string"
              ],
              "readOnly": true,
              "secretRef": {
                "name": "string"
              },
              "targetPortal": "string"
            },
            "name": "string",
            "nfs": {
              "path": "string",
              "readOnly": false,
              "server": "string"
            },
            "persistentVolumeClaim": {
              "claimName": "string",
              "readOnly": false
            },
            "photonPersistentDisk": {
              "fsType": "string",
              "pdID": "string"
            },
            "portworxVolume": {
              "fsType": "string",
              "readOnly": true,
              "volumeID": "string"
            },
            "projected": {
              "defaultMode": 3,
              "sources": [
                {
                  "configMap": {
                    "items": [
                      {
                        "key": "string",
                        "mode": 5,
                        "path": "string"
                      },
                      {
                        "key": "string",
                        "mode": 7,
                        "path": "string"
                      },
                      {
                        "key": "string",
                        "mode": 5,
                        "path": "string"
                      },
                      {
                        "key": "string",
                        "mode": 10,
                        "path": "string"
                      },
                      {
                        "key": "string",
                        "mode": 3,
                        "path": "string"
                      },
                      {
                        "key": "string",
                        "mode": 1,
                        "path": "string"
                      },
                      {
                        "key": "string",
                        "mode": 5,
                        "path": "string"
                      }
                    ],
                    "name": "string",
                    "optional": false
                  },
                  "downwardAPI": {
                    "items": [
                      {
                        "fieldRef": {
                          "apiVersion": "string",
                          "fieldPath": "string"
                        },
                        "mode": 2,
                        "path": "string",
                        "resourceFieldRef": {
                          "containerName": "string",
                          "divisor": "string",
                          "resource": "string"
                        }
                      },
                      {
                        "fieldRef": {
                          "apiVersion": "string",
                          "fieldPath": "string"
                        },
                        "mode": 9,
                        "path": "string",
                        "resourceFieldRef": {
                          "containerName": "string",
                          "divisor": "string",
                          "resource": "string"
                        }
                      },
                      {
                        "fieldRef": {
                          "apiVersion": "string",
                          "fieldPath": "string"
                        },
                        "mode": 7,
                        "path": "string",
                        "resourceFieldRef": {
                          "containerName": "string",
                          "divisor": "string",
                          "resource": "string"
                        }
                      },
                      {
                        "fieldRef": {
                          "apiVersion": "string",
                          "fieldPath": "string"
                        },
                        "mode": 3,
                        "path": "string",
                        "resourceFieldRef": {
                          "containerName": "string",
                          "divisor": "string",
                          "resource": "string"
                        }
                      },
                      {
                        "fieldRef": {
                          "apiVersion": "string",
                          "fieldPath": "string"
                        },
                        "mode": 8,
                        "path": "string",
                        "resourceFieldRef": {
                          "containerName": "string",
                          "divisor": "string",
                          "resource": "string"
                        }
                      },
                      {
                        "fieldRef": {
                          "apiVersion": "string",
                          "fieldPath": "string"
                        },
                        "mode": 3,
                        "path": "string",
                        "resourceFieldRef": {
                          "containerName": "string",
                          "divisor": "string",
                          "resource": "string"
                        }
                      }
                    ]
                  },
                  "secret": {
                    "items": [
                      {
                        "key": "string",
                        "mode": 9,
                        "path": "string"
                      },
                      {
                        "key": "string",
                        "mode": 3,
                        "path": "string"
                      },
                      {
                        "key": "string",
                        "mode": 4,
                        "path": "string"
                      },
                      {
                        "key": "string",
                        "mode": 9,
                        "path": "string"
                      },
                      {
                        "key": "string",
                        "mode": 5,
                        "path": "string"
                      }
                    ],
                    "name": "string",
                    "optional": true
                  },
                  "serviceAccountToken": {
                    "audience": "string",
                    "expirationSeconds": 10,
                    "path": "string"
                  }
                },
                {
                  "configMap": {
                    "items": [
                      {
                        "key": "string",
                        "mode": 3,
                        "path": "string"
                      },
                      {
                        "key": "string",
                        "mode": 5,
                        "path": "string"
                      },
                      {
                        "key": "string",
                        "mode": 3,
                        "path": "string"
                      },
                      {
                        "key": "string",
                        "mode": 5,
                        "path": "string"
                      },
                      {
                        "key": "string",
                        "mode": 5,
                        "path": "string"
                      },
                      {
                        "key": "string",
                        "mode": 6,
                        "path": "string"
                      },
                      {
                        "key": "string",
                        "mode": 9,
                        "path": "string"
                      },
                      {
                        "key": "string",
                        "mode": 5,
                        "path": "string"
                      }
                    ],
                    "name": "string",
                    "optional": true
                  },
                  "downwardAPI": {
                    "items": [
                      {
                        "fieldRef": {
                          "apiVersion": "string",
                          "fieldPath": "string"
                        },
                        "mode": 2,
                        "path": "string",
                        "resourceFieldRef": {
                          "containerName": "string",
                          "divisor": "string",
                          "resource": "string"
                        }
                      },
                      {
                        "fieldRef": {
                          "apiVersion": "string",
                          "fieldPath": "string"
                        },
                        "mode": 3,
                        "path": "string",
                        "resourceFieldRef": {
                          "containerName": "string",
                          "divisor": "string",
                          "resource": "string"
                        }
                      },
                      {
                        "fieldRef": {
                          "apiVersion": "string",
                          "fieldPath": "string"
                        },
                        "mode": 7,
                        "path": "string",
                        "resourceFieldRef": {
                          "containerName": "string",
                          "divisor": "string",
                          "resource": "string"
                        }
                      },
                      {
                        "fieldRef": {
                          "apiVersion": "string",
                          "fieldPath": "string"
                        },
                        "mode": 7,
                        "path": "string",
                        "resourceFieldRef": {
                          "containerName": "string",
                          "divisor": "string",
                          "resource": "string"
                        }
                      },
                      {
                        "fieldRef": {
                          "apiVersion": "string",
                          "fieldPath": "string"
                        },
                        "mode": 7,
                        "path": "string",
                        "resourceFieldRef": {
                          "containerName": "string",
                          "divisor": "string",
                          "resource": "string"
                        }
                      },
                      {
                        "fieldRef": {
                          "apiVersion": "string",
                          "fieldPath": "string"
                        },
                        "mode": 2,
                        "path": "string",
                        "resourceFieldRef": {
                          "containerName": "string",
                          "divisor": "string",
                          "resource": "string"
                        }
                      },
                      {
                        "fieldRef": {
                          "apiVersion": "string",
                          "fieldPath": "string"
                        },
                        "mode": 6,
                        "path": "string",
                        "resourceFieldRef": {
                          "containerName": "string",
                          "divisor": "string",
                          "resource": "string"
                        }
                      },
                      {
                        "fieldRef": {
                          "apiVersion": "string",
                          "fieldPath": "string"
                        },
                        "mode": 7,
                        "path": "string",
                        "resourceFieldRef": {
                          "containerName": "string",
                          "divisor": "string",
                          "resource": "string"
                        }
                      },
                      {
                        "fieldRef": {
                          "apiVersion": "string",
                          "fieldPath": "string"
                        },
                        "mode": 7,
                        "path": "string",
                        "resourceFieldRef": {
                          "containerName": "string",
                          "divisor": "string",
                          "resource": "string"
                        }
                      }
                    ]
                  },
                  "secret": {
                    "items": [
                      {
                        "key": "string",
                        "mode": 7,
                        "path": "string"
                      },
                      {
                        "key": "string",
                        "mode": 7,
                        "path": "string"
                      }
                    ],
                    "name": "string",
                    "optional": false
                  },
                  "serviceAccountToken": {
                    "audience": "string",
                    "expirationSeconds": 2,
                    "path": "string"
                  }
                },
                {
                  "configMap": {
                    "items": [
                      {
                        "key": "string",
                        "mode": 1,
                        "path": "string"
                      }
                    ],
                    "name": "string",
                    "optional": true
                  },
                  "downwardAPI": {
                    "items": [
                      {
                        "fieldRef": {
                          "apiVersion": "string",
                          "fieldPath": "string"
                        },
                        "mode": 1,
                        "path": "string",
                        "resourceFieldRef": {
                          "containerName": "string",
                          "divisor": "string",
                          "resource": "string"
                        }
                      },
                      {
                        "fieldRef": {
                          "apiVersion": "string",
                          "fieldPath": "string"
                        },
                        "mode": 7,
                        "path": "string",
                        "resourceFieldRef": {
                          "containerName": "string",
                          "divisor": "string",
                          "resource": "string"
                        }
                      },
                      {
                        "fieldRef": {
                          "apiVersion": "string",
                          "fieldPath": "string"
                        },
                        "mode": 2,
                        "path": "string",
                        "resourceFieldRef": {
                          "containerName": "string",
                          "divisor": "string",
                          "resource": "string"
                        }
                      },
                      {
                        "fieldRef": {
                          "apiVersion": "string",
                          "fieldPath": "string"
                        },
                        "mode": 6,
                        "path": "string",
                        "resourceFieldRef": {
                          "containerName": "string",
                          "divisor": "string",
                          "resource": "string"
                        }
                      },
                      {
                        "fieldRef": {
                          "apiVersion": "string",
                          "fieldPath": "string"
                        },
                        "mode": 5,
                        "path": "string",
                        "resourceFieldRef": {
                          "containerName": "string",
                          "divisor": "string",
                          "resource": "string"
                        }
                      },
                      {
                        "fieldRef": {
                          "apiVersion": "string",
                          "fieldPath": "string"
                        },
                        "mode": 4,
                        "path": "string",
                        "resourceFieldRef": {
                          "containerName": "string",
                          "divisor": "string",
                          "resource": "string"
                        }
                      }
                    ]
                  },
                  "secret": {
                    "items": [
                      {
                        "key": "string",
                        "mode": 3,
                        "path": "string"
                      },
                      {
                        "key": "string",
                        "mode": 7,
                        "path": "string"
                      },
                      {
                        "key": "string",
                        "mode": 8,
                        "path": "string"
                      },
                      {
                        "key": "string",
                        "mode": 1,
                        "path": "string"
                      },
                      {
                        "key": "string",
                        "mode": 2,
                        "path": "string"
                      },
                      {
                        "key": "string",
                        "mode": 9,
                        "path": "string"
                      },
                      {
                        "key": "string",
                        "mode": 9,
                        "path": "string"
                      },
                      {
                        "key": "string",
                        "mode": 8,
                        "path": "string"
                      },
                      {
                        "key": "string",
                        "mode": 10,
                        "path": "string"
                      }
                    ],
                    "name": "string",
                    "optional": false
                  },
                  "serviceAccountToken": {
                    "audience": "string",
                    "expirationSeconds": 4,
                    "path": "string"
                  }
                },
                {
                  "configMap": {
                    "items": [
                      {
                        "key": "string",
                        "mode": 9,
                        "path": "string"
                      },
                      {
                        "key": "string",
                        "mode": 6,
                        "path": "string"
                      }
                    ],
                    "name": "string",
                    "optional": false
                  },
                  "downwardAPI": {
                    "items": [
                      {
                        "fieldRef": {
                          "apiVersion": "string",
                          "fieldPath": "string"
                        },
                        "mode": 8,
                        "path": "string",
                        "resourceFieldRef": {
                          "containerName": "string",
                          "divisor": "string",
                          "resource": "string"
                        }
                      },
                      {
                        "fieldRef": {
                          "apiVersion": "string",
                          "fieldPath": "string"
                        },
                        "mode": 4,
                        "path": "string",
                        "resourceFieldRef": {
                          "containerName": "string",
                          "divisor": "string",
                          "resource": "string"
                        }
                      },
                      {
                        "fieldRef": {
                          "apiVersion": "string",
                          "fieldPath": "string"
                        },
                        "mode": 6,
                        "path": "string",
                        "resourceFieldRef": {
                          "containerName": "string",
                          "divisor": "string",
                          "resource": "string"
                        }
                      },
                      {
                        "fieldRef": {
                          "apiVersion": "string",
                          "fieldPath": "string"
                        },
                        "mode": 1,
                        "path": "string",
                        "resourceFieldRef": {
                          "containerName": "string",
                          "divisor": "string",
                          "resource": "string"
                        }
                      },
                      {
                        "fieldRef": {
                          "apiVersion": "string",
                          "fieldPath": "string"
                        },
                        "mode": 5,
                        "path": "string",
                        "resourceFieldRef": {
                          "containerName": "string",
                          "divisor": "string",
                          "resource": "string"
                        }
                      },
                      {
                        "fieldRef": {
                          "apiVersion": "string",
                          "fieldPath": "string"
                        },
                        "mode": 6,
                        "path": "string",
                        "resourceFieldRef": {
                          "containerName": "string",
                          "divisor": "string",
                          "resource": "string"
                        }
                      },
                      {
                        "fieldRef": {
                          "apiVersion": "string",
                          "fieldPath": "string"
                        },
                        "mode": 10,
                        "path": "string",
                        "resourceFieldRef": {
                          "containerName": "string",
                          "divisor": "string",
                          "resource": "string"
                        }
                      },
                      {
                        "fieldRef": {
                          "apiVersion": "string",
                          "fieldPath": "string"
                        },
                        "mode": 4,
                        "path": "string",
                        "resourceFieldRef": {
                          "containerName": "string",
                          "divisor": "string",
                          "resource": "string"
                        }
                      },
                      {
                        "fieldRef": {
                          "apiVersion": "string",
                          "fieldPath": "string"
                        },
                        "mode": 8,
                        "path": "string",
                        "resourceFieldRef": {
                          "containerName": "string",
                          "divisor": "string",
                          "resource": "string"
                        }
                      },
                      {
                        "fieldRef": {
                          "apiVersion": "string",
                          "fieldPath": "string"
                        },
                        "mode": 7,
                        "path": "string",
                        "resourceFieldRef": {
                          "containerName": "string",
                          "divisor": "string",
                          "resource": "string"
                        }
                      }
                    ]
                  },
                  "secret": {
                    "items": [
                      {
                        "key": "string",
                        "mode": 4,
                        "path": "string"
                      }
                    ],
                    "name": "string",
                    "optional": true
                  },
                  "serviceAccountToken": {
                    "audience": "string",
                    "expirationSeconds": 3,
                    "path": "string"
                  }
                },
                {
                  "configMap": {
                    "items": [
                      {
                        "key": "string",
                        "mode": 2,
                        "path": "string"
                      },
                      {
                        "key": "string",
                        "mode": 7,
                        "path": "string"
                      },
                      {
                        "key": "string",
                        "mode": 10,
                        "path": "string"
                      },
                      {
                        "key": "string",
                        "mode": 10,
                        "path": "string"
                      },
                      {
                        "key": "string",
                        "mode": 2,
                        "path": "string"
                      },
                      {
                        "key": "string",
                        "mode": 2,
                        "path": "string"
                      },
                      {
                        "key": "string",
                        "mode": 6,
                        "path": "string"
                      }
                    ],
                    "name": "string",
                    "optional": false
                  },
                  "downwardAPI": {
                    "items": [
                      {
                        "fieldRef": {
                          "apiVersion": "string",
                          "fieldPath": "string"
                        },
                        "mode": 5,
                        "path": "string",
                        "resourceFieldRef": {
                          "containerName": "string",
                          "divisor": "string",
                          "resource": "string"
                        }
                      },
                      {
                        "fieldRef": {
                          "apiVersion": "string",
                          "fieldPath": "string"
                        },
                        "mode": 7,
                        "path": "string",
                        "resourceFieldRef": {
                          "containerName": "string",
                          "divisor": "string",
                          "resource": "string"
                        }
                      },
                      {
                        "fieldRef": {
                          "apiVersion": "string",
                          "fieldPath": "string"
                        },
                        "mode": 9,
                        "path": "string",
                        "resourceFieldRef": {
                          "containerName": "string",
                          "divisor": "string",
                          "resource": "string"
                        }
                      },
                      {
                        "fieldRef": {
                          "apiVersion": "string",
                          "fieldPath": "string"
                        },
                        "mode": 2,
                        "path": "string",
                        "resourceFieldRef": {
                          "containerName": "string",
                          "divisor": "string",
                          "resource": "string"
                        }
                      },
                      {
                        "fieldRef": {
                          "apiVersion": "string",
                          "fieldPath": "string"
                        },
                        "mode": 7,
                        "path": "string",
                        "resourceFieldRef": {
                          "containerName": "string",
                          "divisor": "string",
                          "resource": "string"
                        }
                      }
                    ]
                  },
                  "secret": {
                    "items": [
                      {
                        "key": "string",
                        "mode": 5,
                        "path": "string"
                      },
                      {
                        "key": "string",
                        "mode": 10,
                        "path": "string"
                      },
                      {
                        "key": "string",
                        "mode": 8,
                        "path": "string"
                      },
                      {
                        "key": "string",
                        "mode": 10,
                        "path": "string"
                      },
                      {
                        "key": "string",
                        "mode": 2,
                        "path": "string"
                      },
                      {
                        "key": "string",
                        "mode": 5,
                        "path": "string"
                      },
                      {
                        "key": "string",
                        "mode": 3,
                        "path": "string"
                      },
                      {
                        "key": "string",
                        "mode": 7,
                        "path": "string"
                      },
                      {
                        "key": "string",
                        "mode": 4,
                        "path": "string"
                      }
                    ],
                    "name": "string",
                    "optional": false
                  },
                  "serviceAccountToken": {
                    "audience": "string",
                    "expirationSeconds": 10,
                    "path": "string"
                  }
                },
                {
                  "configMap": {
                    "items": [
                      {
                        "key": "string",
                        "mode": 6,
                        "path": "string"
                      },
                      {
                        "key": "string",
                        "mode": 4,
                        "path": "string"
                      }
                    ],
                    "name": "string",
                    "optional": false
                  },
                  "downwardAPI": {
                    "items": [
                      {
                        "fieldRef": {
                          "apiVersion": "string",
                          "fieldPath": "string"
                        },
                        "mode": 5,
                        "path": "string",
                        "resourceFieldRef": {
                          "containerName": "string",
                          "divisor": "string",
                          "resource": "string"
                        }
                      },
                      {
                        "fieldRef": {
                          "apiVersion": "string",
                          "fieldPath": "string"
                        },
                        "mode": 1,
                        "path": "string",
                        "resourceFieldRef": {
                          "containerName": "string",
                          "divisor": "string",
                          "resource": "string"
                        }
                      },
                      {
                        "fieldRef": {
                          "apiVersion": "string",
                          "fieldPath": "string"
                        },
                        "mode": 5,
                        "path": "string",
                        "resourceFieldRef": {
                          "containerName": "string",
                          "divisor": "string",
                          "resource": "string"
                        }
                      },
                      {
                        "fieldRef": {
                          "apiVersion": "string",
                          "fieldPath": "string"
                        },
                        "mode": 6,
                        "path": "string",
                        "resourceFieldRef": {
                          "containerName": "string",
                          "divisor": "string",
                          "resource": "string"
                        }
                      },
                      {
                        "fieldRef": {
                          "apiVersion": "string",
                          "fieldPath": "string"
                        },
                        "mode": 4,
                        "path": "string",
                        "resourceFieldRef": {
                          "containerName": "string",
                          "divisor": "string",
                          "resource": "string"
                        }
                      },
                      {
                        "fieldRef": {
                          "apiVersion": "string",
                          "fieldPath": "string"
                        },
                        "mode": 6,
                        "path": "string",
                        "resourceFieldRef": {
                          "containerName": "string",
                          "divisor": "string",
                          "resource": "string"
                        }
                      },
                      {
                        "fieldRef": {
                          "apiVersion": "string",
                          "fieldPath": "string"
                        },
                        "mode": 4,
                        "path": "string",
                        "resourceFieldRef": {
                          "containerName": "string",
                          "divisor": "string",
                          "resource": "string"
                        }
                      },
                      {
                        "fieldRef": {
                          "apiVersion": "string",
                          "fieldPath": "string"
                        },
                        "mode": 3,
                        "path": "string",
                        "resourceFieldRef": {
                          "containerName": "string",
                          "divisor": "string",
                          "resource": "string"
                        }
                      }
                    ]
                  },
                  "secret": {
                    "items": [
                      {
                        "key": "string",
                        "mode": 1,
                        "path": "string"
                      },
                      {
                        "key": "string",
                        "mode": 9,
                        "path": "string"
                      },
                      {
                        "key": "string",
                        "mode": 5,
                        "path": "string"
                      },
                      {
                        "key": "string",
                        "mode": 1,
                        "path": "string"
                      },
                      {
                        "key": "string",
                        "mode": 1,
                        "path": "string"
                      },
                      {
                        "key": "string",
                        "mode": 8,
                        "path": "string"
                      }
                    ],
                    "name": "string",
                    "optional": false
                  },
                  "serviceAccountToken": {
                    "audience": "string",
                    "expirationSeconds": 10,
                    "path": "string"
                  }
                }
              ]
            },
            "quobyte": {
              "group": "string",
              "readOnly": false,
              "registry": "string",
              "tenant": "string",
              "user": "string",
              "volume": "string"
            },
            "rbd": {
              "fsType": "string",
              "image": "string",
              "keyring": "string",
              "monitors": [
                "string",
                "string",
                "string",
                "string",
                "string",
                "string",
                "string",
                "string"
              ],
              "pool": "string",
              "readOnly": true,
              "secretRef": {
                "name": "string"
              },
              "user": "string"
            },
            "scaleIO": {
              "fsType": "string",
              "gateway": "string",
              "protectionDomain": "string",
              "readOnly": true,
              "secretRef": {
                "name": "string"
              },
              "sslEnabled": false,
              "storageMode": "string",
              "storagePool": "string",
              "system": "string",
              "volumeName": "string"
            },
            "secret": {
              "defaultMode": 3,
              "items": [
                {
                  "key": "string",
                  "mode": 8,
                  "path": "string"
                },
                {
                  "key": "string",
                  "mode": 4,
                  "path": "string"
                },
                {
                  "key": "string",
                  "mode": 8,
                  "path": "string"
                },
                {
                  "key": "string",
                  "mode": 1,
                  "path": "string"
                },
                {
                  "key": "string",
                  "mode": 9,
                  "path": "string"
                },
                {
                  "key": "string",
                  "mode": 1,
                  "path": "string"
                },
                {
                  "key": "string",
                  "mode": 5,
                  "path": "string"
                },
                {
                  "key": "string",
                  "mode": 1,
                  "path": "string"
                }
              ],
              "optional": false,
              "secretName": "string"
            },
            "storageos": {
              "fsType": "string",
              "readOnly": false,
              "secretRef": {
                "name": "string"
              },
              "volumeName": "string",
              "volumeNamespace": "string"
            },
            "vsphereVolume": {
              "fsType": "string",
              "storagePolicyID": "string",
              "storagePolicyName": "string",
              "volumePath": "string"
            }
          }
        ]
      }
    }
  ],
  "kind": "string",
  "metadata": {
    "continue": "string",
    "remainingItemCount": 5,
    "resourceVersion": "string",
    "selfLink": "string"
  }
}