{
  "apiVersion": "string",
  "kind": "string",
  "metadata": {
    "annotations": {},
    "clusterName": "string",
    "creationTimestamp": "string",
    "deletionGracePeriodSeconds": 3,
    "deletionTimestamp": "string",
    "finalizers": [
      "string",
      "string",
      "string",
      "string",
      "string",
      "string",
      "string",
      "string",
      "string"
    ],
    "generateName": "string",
    "generation": 1,
    "initializers": {
      "pending": [
        {
          "name": "string"
        },
        {
          "name": "string"
        },
        {
          "name": "string"
        }
      ],
      "result": {
        "apiVersion": "string",
        "code": 5,
        "details": {
          "causes": [
            {
              "field": "string",
              "message": "string",
              "reason": "string"
            },
            {
              "field": "string",
              "message": "string",
              "reason": "string"
            },
            {
              "field": "string",
              "message": "string",
              "reason": "string"
            },
            {
              "field": "string",
              "message": "string",
              "reason": "string"
            },
            {
              "field": "string",
              "message": "string",
              "reason": "string"
            },
            {
              "field": "string",
              "message": "string",
              "reason": "string"
            },
            {
              "field": "string",
              "message": "string",
              "reason": "string"
            },
            {
              "field": "string",
              "message": "string",
              "reason": "string"
            },
            {
              "field": "string",
              "message": "string",
              "reason": "string"
            }
          ],
          "group": "string",
          "kind": "string",
          "name": "string",
          "retryAfterSeconds": 6,
          "uid": "string"
        },
        "kind": "string",
        "message": "string",
        "metadata": {
          "continue": "string",
          "remainingItemCount": 1,
          "resourceVersion": "string",
          "selfLink": "string"
        },
        "reason": "string",
        "status": "string"
      }
    },
    "labels": {},
    "managedFields": [
      {
        "apiVersion": "string",
        "fields": {},
        "manager": "string",
        "operation": "string",
        "time": "string"
      },
      {
        "apiVersion": "string",
        "fields": {},
        "manager": "string",
        "operation": "string",
        "time": "string"
      },
      {
        "apiVersion": "string",
        "fields": {},
        "manager": "string",
        "operation": "string",
        "time": "string"
      }
    ],
    "name": "string",
    "namespace": "string",
    "ownerReferences": [
      {
        "apiVersion": "string",
        "blockOwnerDeletion": false,
        "controller": true,
        "kind": "string",
        "name": "string",
        "uid": "string"
      }
    ],
    "resourceVersion": "string",
    "selfLink": "string",
    "uid": "string"
  },
  "spec": {
    "accessModes": [
      "string",
      "string",
      "string",
      "string",
      "string",
      "string"
    ],
    "dataSource": {
      "apiGroup": "string",
      "kind": "string",
      "name": "string"
    },
    "resources": {
      "limits": {},
      "requests": {}
    },
    "selector": {
      "matchExpressions": [
        {
          "key": "string",
          "operator": "string",
          "values": [
            "string"
          ]
        },
        {
          "key": "string",
          "operator": "string",
          "values": [
            "string",
            "string",
            "string",
            "string",
            "string",
            "string",
            "string"
          ]
        }
      ],
      "matchLabels": {}
    },
    "storageClassName": "string",
    "volumeMode": "string",
    "volumeName": "string"
  },
  "status": {
    "accessModes": [
      "string",
      "string",
      "string",
      "string",
      "string",
      "string",
      "string"
    ],
    "capacity": {},
    "conditions": [
      {
        "lastProbeTime": "string",
        "lastTransitionTime": "string",
        "message": "string",
        "reason": "string",
        "status": "string",
        "type": "string"
      }
    ],
    "phase": "string"
  }
}