{
  "apiVersion": "string",
  "kind": "string",
  "metadata": {
    "annotations": {},
    "clusterName": "string",
    "creationTimestamp": "string",
    "deletionGracePeriodSeconds": 6,
    "deletionTimestamp": "string",
    "finalizers": [
      "string",
      "string",
      "string",
      "string"
    ],
    "generateName": "string",
    "generation": 5,
    "initializers": {
      "pending": [
        {
          "name": "string"
        },
        {
          "name": "string"
        },
        {
          "name": "string"
        },
        {
          "name": "string"
        },
        {
          "name": "string"
        },
        {
          "name": "string"
        },
        {
          "name": "string"
        },
        {
          "name": "string"
        },
        {
          "name": "string"
        },
        {
          "name": "string"
        }
      ],
      "result": {
        "apiVersion": "string",
        "code": 6,
        "details": {
          "causes": [
            {
              "field": "string",
              "message": "string",
              "reason": "string"
            },
            {
              "field": "string",
              "message": "string",
              "reason": "string"
            },
            {
              "field": "string",
              "message": "string",
              "reason": "string"
            },
            {
              "field": "string",
              "message": "string",
              "reason": "string"
            },
            {
              "field": "string",
              "message": "string",
              "reason": "string"
            },
            {
              "field": "string",
              "message": "string",
              "reason": "string"
            },
            {
              "field": "string",
              "message": "string",
              "reason": "string"
            }
          ],
          "group": "string",
          "kind": "string",
          "name": "string",
          "retryAfterSeconds": 6,
          "uid": "string"
        },
        "kind": "string",
        "message": "string",
        "metadata": {
          "continue": "string",
          "remainingItemCount": 8,
          "resourceVersion": "string",
          "selfLink": "string"
        },
        "reason": "string",
        "status": "string"
      }
    },
    "labels": {},
    "managedFields": [
      {
        "apiVersion": "string",
        "fields": {},
        "manager": "string",
        "operation": "string",
        "time": "string"
      },
      {
        "apiVersion": "string",
        "fields": {},
        "manager": "string",
        "operation": "string",
        "time": "string"
      },
      {
        "apiVersion": "string",
        "fields": {},
        "manager": "string",
        "operation": "string",
        "time": "string"
      },
      {
        "apiVersion": "string",
        "fields": {},
        "manager": "string",
        "operation": "string",
        "time": "string"
      },
      {
        "apiVersion": "string",
        "fields": {},
        "manager": "string",
        "operation": "string",
        "time": "string"
      },
      {
        "apiVersion": "string",
        "fields": {},
        "manager": "string",
        "operation": "string",
        "time": "string"
      },
      {
        "apiVersion": "string",
        "fields": {},
        "manager": "string",
        "operation": "string",
        "time": "string"
      },
      {
        "apiVersion": "string",
        "fields": {},
        "manager": "string",
        "operation": "string",
        "time": "string"
      },
      {
        "apiVersion": "string",
        "fields": {},
        "manager": "string",
        "operation": "string",
        "time": "string"
      }
    ],
    "name": "string",
    "namespace": "string",
    "ownerReferences": [
      {
        "apiVersion": "string",
        "blockOwnerDeletion": false,
        "controller": true,
        "kind": "string",
        "name": "string",
        "uid": "string"
      },
      {
        "apiVersion": "string",
        "blockOwnerDeletion": true,
        "controller": false,
        "kind": "string",
        "name": "string",
        "uid": "string"
      }
    ],
    "resourceVersion": "string",
    "selfLink": "string",
    "uid": "string"
  },
  "spec": {
    "maxUnavailable": "string",
    "minAvailable": "string",
    "selector": {
      "matchExpressions": [
        {
          "key": "string",
          "operator": "string",
          "values": [
            "string"
          ]
        }
      ],
      "matchLabels": {}
    }
  },
  "status": {
    "currentHealthy": 8,
    "desiredHealthy": 3,
    "disruptedPods": {},
    "disruptionsAllowed": 2,
    "expectedPods": 8,
    "observedGeneration": 7
  }
}