{
  "$id": "schema.json",
  "type": "object",
  "schema": "http://json-schema.org/draft-07/schema#",
  "translate": false,
  "dynamicfields": true,
  "properties": {
    "ph_request_type": {
      "type": "string",
      "description": "type of request (internal to adapter)",
      "default": "getSchedulingV1beta1APIResources",
      "enum": [
        "getSchedulingV1beta1APIResources",
        "deleteSchedulingV1beta1CollectionPriorityClass",
        "listSchedulingV1beta1PriorityClass",
        "createSchedulingV1beta1PriorityClass",
        "deleteSchedulingV1beta1PriorityClass",
        "readSchedulingV1beta1PriorityClass",
        "patchSchedulingV1beta1PriorityClass",
        "replaceSchedulingV1beta1PriorityClass",
        "watchSchedulingV1beta1PriorityClassList",
        "watchSchedulingV1beta1PriorityClass"
      ],
      "external_name": "ph_request_type"
    }
  },
  "definitions": {}
}