{
  "actions": [
    {
      "name": "getPolicyV1beta1APIResources",
      "protocol": "REST",
      "method": "GET",
      "entitypath": "{base_path}/{version}/apis/policy/v1beta1/?{query}",
      "requestSchema": "schema.json",
      "responseSchema": "schema.json",
      "timeout": 0,
      "sendEmpty": false,
      "sendGetBody": false,
      "requestDatatype": "JSON",
      "responseDatatype": "JSON",
      "headers": {},
      "responseObjects": [
        {
          "type": "default",
          "key": "",
          "mockFile": "mockdatafiles/getPolicyV1beta1APIResources-default.json"
        }
      ]
    },
    {
      "name": "deletePolicyV1beta1CollectionNamespacedPodDisruptionBudget",
      "protocol": "REST",
      "method": "DELETE",
      "entitypath": "{base_path}/{version}/apis/policy/v1beta1/namespaces/{pathv1}/poddisruptionbudgets?{query}",
      "requestSchema": "schema.json",
      "responseSchema": "schema.json",
      "timeout": 0,
      "sendEmpty": false,
      "sendGetBody": false,
      "requestDatatype": "JSON",
      "responseDatatype": "JSON",
      "headers": {},
      "responseObjects": [
        {
          "type": "default",
          "key": "",
          "mockFile": "mockdatafiles/deletePolicyV1beta1CollectionNamespacedPodDisruptionBudget-default.json"
        }
      ]
    },
    {
      "name": "listPolicyV1beta1NamespacedPodDisruptionBudget",
      "protocol": "REST",
      "method": "GET",
      "entitypath": "{base_path}/{version}/apis/policy/v1beta1/namespaces/{pathv1}/poddisruptionbudgets?{query}",
      "requestSchema": "schema.json",
      "responseSchema": "schema.json",
      "timeout": 0,
      "sendEmpty": false,
      "sendGetBody": false,
      "requestDatatype": "JSON",
      "responseDatatype": "JSON",
      "headers": {},
      "responseObjects": [
        {
          "type": "default",
          "key": "",
          "mockFile": "mockdatafiles/listPolicyV1beta1NamespacedPodDisruptionBudget-default.json"
        }
      ]
    },
    {
      "name": "createPolicyV1beta1NamespacedPodDisruptionBudget",
      "protocol": "REST",
      "method": "POST",
      "entitypath": "{base_path}/{version}/apis/policy/v1beta1/namespaces/{pathv1}/poddisruptionbudgets?{query}",
      "requestSchema": "schema.json",
      "responseSchema": "schema.json",
      "timeout": 0,
      "sendEmpty": false,
      "sendGetBody": false,
      "requestDatatype": "JSON",
      "responseDatatype": "JSON",
      "headers": {},
      "responseObjects": [
        {
          "type": "default",
          "key": "",
          "mockFile": "mockdatafiles/createPolicyV1beta1NamespacedPodDisruptionBudget-default.json"
        }
      ]
    },
    {
      "name": "deletePolicyV1beta1NamespacedPodDisruptionBudget",
      "protocol": "REST",
      "method": "DELETE",
      "entitypath": "{base_path}/{version}/apis/policy/v1beta1/namespaces/{pathv1}/poddisruptionbudgets/{pathv2}?{query}",
      "requestSchema": "schema.json",
      "responseSchema": "schema.json",
      "timeout": 0,
      "sendEmpty": false,
      "sendGetBody": false,
      "requestDatatype": "JSON",
      "responseDatatype": "JSON",
      "headers": {},
      "responseObjects": [
        {
          "type": "default",
          "key": "",
          "mockFile": "mockdatafiles/deletePolicyV1beta1NamespacedPodDisruptionBudget-default.json"
        }
      ]
    },
    {
      "name": "readPolicyV1beta1NamespacedPodDisruptionBudget",
      "protocol": "REST",
      "method": "GET",
      "entitypath": "{base_path}/{version}/apis/policy/v1beta1/namespaces/{pathv1}/poddisruptionbudgets/{pathv2}?{query}",
      "requestSchema": "schema.json",
      "responseSchema": "schema.json",
      "timeout": 0,
      "sendEmpty": false,
      "sendGetBody": false,
      "requestDatatype": "JSON",
      "responseDatatype": "JSON",
      "headers": {},
      "responseObjects": [
        {
          "type": "default",
          "key": "",
          "mockFile": "mockdatafiles/readPolicyV1beta1NamespacedPodDisruptionBudget-default.json"
        }
      ]
    },
    {
      "name": "patchPolicyV1beta1NamespacedPodDisruptionBudget",
      "protocol": "REST",
      "method": "PATCH",
      "entitypath": "{base_path}/{version}/apis/policy/v1beta1/namespaces/{pathv1}/poddisruptionbudgets/{pathv2}?{query}",
      "requestSchema": "schema.json",
      "responseSchema": "schema.json",
      "timeout": 0,
      "sendEmpty": false,
      "sendGetBody": false,
      "requestDatatype": "JSON",
      "responseDatatype": "JSON",
      "headers": {},
      "responseObjects": [
        {
          "type": "default",
          "key": "",
          "mockFile": "mockdatafiles/patchPolicyV1beta1NamespacedPodDisruptionBudget-default.json"
        }
      ]
    },
    {
      "name": "replacePolicyV1beta1NamespacedPodDisruptionBudget",
      "protocol": "REST",
      "method": "PUT",
      "entitypath": "{base_path}/{version}/apis/policy/v1beta1/namespaces/{pathv1}/poddisruptionbudgets/{pathv2}?{query}",
      "requestSchema": "schema.json",
      "responseSchema": "schema.json",
      "timeout": 0,
      "sendEmpty": false,
      "sendGetBody": false,
      "requestDatatype": "JSON",
      "responseDatatype": "JSON",
      "headers": {},
      "responseObjects": [
        {
          "type": "default",
          "key": "",
          "mockFile": "mockdatafiles/replacePolicyV1beta1NamespacedPodDisruptionBudget-default.json"
        }
      ]
    },
    {
      "name": "readPolicyV1beta1NamespacedPodDisruptionBudgetStatus",
      "protocol": "REST",
      "method": "GET",
      "entitypath": "{base_path}/{version}/apis/policy/v1beta1/namespaces/{pathv1}/poddisruptionbudgets/{pathv2}/status?{query}",
      "requestSchema": "schema.json",
      "responseSchema": "schema.json",
      "timeout": 0,
      "sendEmpty": false,
      "sendGetBody": false,
      "requestDatatype": "JSON",
      "responseDatatype": "JSON",
      "headers": {},
      "responseObjects": [
        {
          "type": "default",
          "key": "",
          "mockFile": "mockdatafiles/readPolicyV1beta1NamespacedPodDisruptionBudgetStatus-default.json"
        }
      ]
    },
    {
      "name": "patchPolicyV1beta1NamespacedPodDisruptionBudgetStatus",
      "protocol": "REST",
      "method": "PATCH",
      "entitypath": "{base_path}/{version}/apis/policy/v1beta1/namespaces/{pathv1}/poddisruptionbudgets/{pathv2}/status?{query}",
      "requestSchema": "schema.json",
      "responseSchema": "schema.json",
      "timeout": 0,
      "sendEmpty": false,
      "sendGetBody": false,
      "requestDatatype": "JSON",
      "responseDatatype": "JSON",
      "headers": {},
      "responseObjects": [
        {
          "type": "default",
          "key": "",
          "mockFile": "mockdatafiles/patchPolicyV1beta1NamespacedPodDisruptionBudgetStatus-default.json"
        }
      ]
    },
    {
      "name": "replacePolicyV1beta1NamespacedPodDisruptionBudgetStatus",
      "protocol": "REST",
      "method": "PUT",
      "entitypath": "{base_path}/{version}/apis/policy/v1beta1/namespaces/{pathv1}/poddisruptionbudgets/{pathv2}/status?{query}",
      "requestSchema": "schema.json",
      "responseSchema": "schema.json",
      "timeout": 0,
      "sendEmpty": false,
      "sendGetBody": false,
      "requestDatatype": "JSON",
      "responseDatatype": "JSON",
      "headers": {},
      "responseObjects": [
        {
          "type": "default",
          "key": "",
          "mockFile": "mockdatafiles/replacePolicyV1beta1NamespacedPodDisruptionBudgetStatus-default.json"
        }
      ]
    },
    {
      "name": "listPolicyV1beta1PodDisruptionBudgetForAllNamespaces",
      "protocol": "REST",
      "method": "GET",
      "entitypath": "{base_path}/{version}/apis/policy/v1beta1/poddisruptionbudgets?{query}",
      "requestSchema": "schema.json",
      "responseSchema": "schema.json",
      "timeout": 0,
      "sendEmpty": false,
      "sendGetBody": false,
      "requestDatatype": "JSON",
      "responseDatatype": "JSON",
      "headers": {},
      "responseObjects": [
        {
          "type": "default",
          "key": "",
          "mockFile": "mockdatafiles/listPolicyV1beta1PodDisruptionBudgetForAllNamespaces-default.json"
        }
      ]
    },
    {
      "name": "deletePolicyV1beta1CollectionPodSecurityPolicy",
      "protocol": "REST",
      "method": "DELETE",
      "entitypath": "{base_path}/{version}/apis/policy/v1beta1/podsecuritypolicies?{query}",
      "requestSchema": "schema.json",
      "responseSchema": "schema.json",
      "timeout": 0,
      "sendEmpty": false,
      "sendGetBody": false,
      "requestDatatype": "JSON",
      "responseDatatype": "JSON",
      "headers": {},
      "responseObjects": [
        {
          "type": "default",
          "key": "",
          "mockFile": "mockdatafiles/deletePolicyV1beta1CollectionPodSecurityPolicy-default.json"
        }
      ]
    },
    {
      "name": "listPolicyV1beta1PodSecurityPolicy",
      "protocol": "REST",
      "method": "GET",
      "entitypath": "{base_path}/{version}/apis/policy/v1beta1/podsecuritypolicies?{query}",
      "requestSchema": "schema.json",
      "responseSchema": "schema.json",
      "timeout": 0,
      "sendEmpty": false,
      "sendGetBody": false,
      "requestDatatype": "JSON",
      "responseDatatype": "JSON",
      "headers": {},
      "responseObjects": [
        {
          "type": "default",
          "key": "",
          "mockFile": "mockdatafiles/listPolicyV1beta1PodSecurityPolicy-default.json"
        }
      ]
    },
    {
      "name": "createPolicyV1beta1PodSecurityPolicy",
      "protocol": "REST",
      "method": "POST",
      "entitypath": "{base_path}/{version}/apis/policy/v1beta1/podsecuritypolicies?{query}",
      "requestSchema": "schema.json",
      "responseSchema": "schema.json",
      "timeout": 0,
      "sendEmpty": false,
      "sendGetBody": false,
      "requestDatatype": "JSON",
      "responseDatatype": "JSON",
      "headers": {},
      "responseObjects": [
        {
          "type": "default",
          "key": "",
          "mockFile": "mockdatafiles/createPolicyV1beta1PodSecurityPolicy-default.json"
        }
      ]
    },
    {
      "name": "deletePolicyV1beta1PodSecurityPolicy",
      "protocol": "REST",
      "method": "DELETE",
      "entitypath": "{base_path}/{version}/apis/policy/v1beta1/podsecuritypolicies/{pathv1}?{query}",
      "requestSchema": "schema.json",
      "responseSchema": "schema.json",
      "timeout": 0,
      "sendEmpty": false,
      "sendGetBody": false,
      "requestDatatype": "JSON",
      "responseDatatype": "JSON",
      "headers": {},
      "responseObjects": [
        {
          "type": "default",
          "key": "",
          "mockFile": "mockdatafiles/deletePolicyV1beta1PodSecurityPolicy-default.json"
        }
      ]
    },
    {
      "name": "readPolicyV1beta1PodSecurityPolicy",
      "protocol": "REST",
      "method": "GET",
      "entitypath": "{base_path}/{version}/apis/policy/v1beta1/podsecuritypolicies/{pathv1}?{query}",
      "requestSchema": "schema.json",
      "responseSchema": "schema.json",
      "timeout": 0,
      "sendEmpty": false,
      "sendGetBody": false,
      "requestDatatype": "JSON",
      "responseDatatype": "JSON",
      "headers": {},
      "responseObjects": [
        {
          "type": "default",
          "key": "",
          "mockFile": "mockdatafiles/readPolicyV1beta1PodSecurityPolicy-default.json"
        }
      ]
    },
    {
      "name": "patchPolicyV1beta1PodSecurityPolicy",
      "protocol": "REST",
      "method": "PATCH",
      "entitypath": "{base_path}/{version}/apis/policy/v1beta1/podsecuritypolicies/{pathv1}?{query}",
      "requestSchema": "schema.json",
      "responseSchema": "schema.json",
      "timeout": 0,
      "sendEmpty": false,
      "sendGetBody": false,
      "requestDatatype": "JSON",
      "responseDatatype": "JSON",
      "headers": {},
      "responseObjects": [
        {
          "type": "default",
          "key": "",
          "mockFile": "mockdatafiles/patchPolicyV1beta1PodSecurityPolicy-default.json"
        }
      ]
    },
    {
      "name": "replacePolicyV1beta1PodSecurityPolicy",
      "protocol": "REST",
      "method": "PUT",
      "entitypath": "{base_path}/{version}/apis/policy/v1beta1/podsecuritypolicies/{pathv1}?{query}",
      "requestSchema": "schema.json",
      "responseSchema": "schema.json",
      "timeout": 0,
      "sendEmpty": false,
      "sendGetBody": false,
      "requestDatatype": "JSON",
      "responseDatatype": "JSON",
      "headers": {},
      "responseObjects": [
        {
          "type": "default",
          "key": "",
          "mockFile": "mockdatafiles/replacePolicyV1beta1PodSecurityPolicy-default.json"
        }
      ]
    },
    {
      "name": "watchPolicyV1beta1NamespacedPodDisruptionBudgetList",
      "protocol": "REST",
      "method": "GET",
      "entitypath": "{base_path}/{version}/apis/policy/v1beta1/watch/namespaces/{pathv1}/poddisruptionbudgets?{query}",
      "requestSchema": "schema.json",
      "responseSchema": "schema.json",
      "timeout": 0,
      "sendEmpty": false,
      "sendGetBody": false,
      "requestDatatype": "JSON",
      "responseDatatype": "JSON",
      "headers": {},
      "responseObjects": [
        {
          "type": "default",
          "key": "",
          "mockFile": "mockdatafiles/watchPolicyV1beta1NamespacedPodDisruptionBudgetList-default.json"
        }
      ]
    },
    {
      "name": "watchPolicyV1beta1NamespacedPodDisruptionBudget",
      "protocol": "REST",
      "method": "GET",
      "entitypath": "{base_path}/{version}/apis/policy/v1beta1/watch/namespaces/{pathv1}/poddisruptionbudgets/{pathv2}?{query}",
      "requestSchema": "schema.json",
      "responseSchema": "schema.json",
      "timeout": 0,
      "sendEmpty": false,
      "sendGetBody": false,
      "requestDatatype": "JSON",
      "responseDatatype": "JSON",
      "headers": {},
      "responseObjects": [
        {
          "type": "default",
          "key": "",
          "mockFile": "mockdatafiles/watchPolicyV1beta1NamespacedPodDisruptionBudget-default.json"
        }
      ]
    },
    {
      "name": "watchPolicyV1beta1PodDisruptionBudgetListForAllNamespaces",
      "protocol": "REST",
      "method": "GET",
      "entitypath": "{base_path}/{version}/apis/policy/v1beta1/watch/poddisruptionbudgets?{query}",
      "requestSchema": "schema.json",
      "responseSchema": "schema.json",
      "timeout": 0,
      "sendEmpty": false,
      "sendGetBody": false,
      "requestDatatype": "JSON",
      "responseDatatype": "JSON",
      "headers": {},
      "responseObjects": [
        {
          "type": "default",
          "key": "",
          "mockFile": "mockdatafiles/watchPolicyV1beta1PodDisruptionBudgetListForAllNamespaces-default.json"
        }
      ]
    },
    {
      "name": "watchPolicyV1beta1PodSecurityPolicyList",
      "protocol": "REST",
      "method": "GET",
      "entitypath": "{base_path}/{version}/apis/policy/v1beta1/watch/podsecuritypolicies?{query}",
      "requestSchema": "schema.json",
      "responseSchema": "schema.json",
      "timeout": 0,
      "sendEmpty": false,
      "sendGetBody": false,
      "requestDatatype": "JSON",
      "responseDatatype": "JSON",
      "headers": {},
      "responseObjects": [
        {
          "type": "default",
          "key": "",
          "mockFile": "mockdatafiles/watchPolicyV1beta1PodSecurityPolicyList-default.json"
        }
      ]
    },
    {
      "name": "watchPolicyV1beta1PodSecurityPolicy",
      "protocol": "REST",
      "method": "GET",
      "entitypath": "{base_path}/{version}/apis/policy/v1beta1/watch/podsecuritypolicies/{pathv1}?{query}",
      "requestSchema": "schema.json",
      "responseSchema": "schema.json",
      "timeout": 0,
      "sendEmpty": false,
      "sendGetBody": false,
      "requestDatatype": "JSON",
      "responseDatatype": "JSON",
      "headers": {},
      "responseObjects": [
        {
          "type": "default",
          "key": "",
          "mockFile": "mockdatafiles/watchPolicyV1beta1PodSecurityPolicy-default.json"
        }
      ]
    }
  ]
}