{
  "actions": [
    {
      "name": "getCoordinationV1APIResources",
      "protocol": "REST",
      "method": "GET",
      "entitypath": "{base_path}/{version}/apis/coordination.k8s.io/v1/?{query}",
      "requestSchema": "schema.json",
      "responseSchema": "schema.json",
      "timeout": 0,
      "sendEmpty": false,
      "sendGetBody": false,
      "requestDatatype": "JSON",
      "responseDatatype": "JSON",
      "headers": {},
      "responseObjects": [
        {
          "type": "default",
          "key": "",
          "mockFile": "mockdatafiles/getCoordinationV1APIResources-default.json"
        }
      ]
    },
    {
      "name": "listCoordinationV1LeaseForAllNamespaces",
      "protocol": "REST",
      "method": "GET",
      "entitypath": "{base_path}/{version}/apis/coordination.k8s.io/v1/leases?{query}",
      "requestSchema": "schema.json",
      "responseSchema": "schema.json",
      "timeout": 0,
      "sendEmpty": false,
      "sendGetBody": false,
      "requestDatatype": "JSON",
      "responseDatatype": "JSON",
      "headers": {},
      "responseObjects": [
        {
          "type": "default",
          "key": "",
          "mockFile": "mockdatafiles/listCoordinationV1LeaseForAllNamespaces-default.json"
        }
      ]
    },
    {
      "name": "deleteCoordinationV1CollectionNamespacedLease",
      "protocol": "REST",
      "method": "DELETE",
      "entitypath": "{base_path}/{version}/apis/coordination.k8s.io/v1/namespaces/{pathv1}/leases?{query}",
      "requestSchema": "schema.json",
      "responseSchema": "schema.json",
      "timeout": 0,
      "sendEmpty": false,
      "sendGetBody": false,
      "requestDatatype": "JSON",
      "responseDatatype": "JSON",
      "headers": {},
      "responseObjects": [
        {
          "type": "default",
          "key": "",
          "mockFile": "mockdatafiles/deleteCoordinationV1CollectionNamespacedLease-default.json"
        }
      ]
    },
    {
      "name": "listCoordinationV1NamespacedLease",
      "protocol": "REST",
      "method": "GET",
      "entitypath": "{base_path}/{version}/apis/coordination.k8s.io/v1/namespaces/{pathv1}/leases?{query}",
      "requestSchema": "schema.json",
      "responseSchema": "schema.json",
      "timeout": 0,
      "sendEmpty": false,
      "sendGetBody": false,
      "requestDatatype": "JSON",
      "responseDatatype": "JSON",
      "headers": {},
      "responseObjects": [
        {
          "type": "default",
          "key": "",
          "mockFile": "mockdatafiles/listCoordinationV1NamespacedLease-default.json"
        }
      ]
    },
    {
      "name": "createCoordinationV1NamespacedLease",
      "protocol": "REST",
      "method": "POST",
      "entitypath": "{base_path}/{version}/apis/coordination.k8s.io/v1/namespaces/{pathv1}/leases?{query}",
      "requestSchema": "schema.json",
      "responseSchema": "schema.json",
      "timeout": 0,
      "sendEmpty": false,
      "sendGetBody": false,
      "requestDatatype": "JSON",
      "responseDatatype": "JSON",
      "headers": {},
      "responseObjects": [
        {
          "type": "default",
          "key": "",
          "mockFile": "mockdatafiles/createCoordinationV1NamespacedLease-default.json"
        }
      ]
    },
    {
      "name": "deleteCoordinationV1NamespacedLease",
      "protocol": "REST",
      "method": "DELETE",
      "entitypath": "{base_path}/{version}/apis/coordination.k8s.io/v1/namespaces/{pathv1}/leases/{pathv2}?{query}",
      "requestSchema": "schema.json",
      "responseSchema": "schema.json",
      "timeout": 0,
      "sendEmpty": false,
      "sendGetBody": false,
      "requestDatatype": "JSON",
      "responseDatatype": "JSON",
      "headers": {},
      "responseObjects": [
        {
          "type": "default",
          "key": "",
          "mockFile": "mockdatafiles/deleteCoordinationV1NamespacedLease-default.json"
        }
      ]
    },
    {
      "name": "readCoordinationV1NamespacedLease",
      "protocol": "REST",
      "method": "GET",
      "entitypath": "{base_path}/{version}/apis/coordination.k8s.io/v1/namespaces/{pathv1}/leases/{pathv2}?{query}",
      "requestSchema": "schema.json",
      "responseSchema": "schema.json",
      "timeout": 0,
      "sendEmpty": false,
      "sendGetBody": false,
      "requestDatatype": "JSON",
      "responseDatatype": "JSON",
      "headers": {},
      "responseObjects": [
        {
          "type": "default",
          "key": "",
          "mockFile": "mockdatafiles/readCoordinationV1NamespacedLease-default.json"
        }
      ]
    },
    {
      "name": "patchCoordinationV1NamespacedLease",
      "protocol": "REST",
      "method": "PATCH",
      "entitypath": "{base_path}/{version}/apis/coordination.k8s.io/v1/namespaces/{pathv1}/leases/{pathv2}?{query}",
      "requestSchema": "schema.json",
      "responseSchema": "schema.json",
      "timeout": 0,
      "sendEmpty": false,
      "sendGetBody": false,
      "requestDatatype": "JSON",
      "responseDatatype": "JSON",
      "headers": {},
      "responseObjects": [
        {
          "type": "default",
          "key": "",
          "mockFile": "mockdatafiles/patchCoordinationV1NamespacedLease-default.json"
        }
      ]
    },
    {
      "name": "replaceCoordinationV1NamespacedLease",
      "protocol": "REST",
      "method": "PUT",
      "entitypath": "{base_path}/{version}/apis/coordination.k8s.io/v1/namespaces/{pathv1}/leases/{pathv2}?{query}",
      "requestSchema": "schema.json",
      "responseSchema": "schema.json",
      "timeout": 0,
      "sendEmpty": false,
      "sendGetBody": false,
      "requestDatatype": "JSON",
      "responseDatatype": "JSON",
      "headers": {},
      "responseObjects": [
        {
          "type": "default",
          "key": "",
          "mockFile": "mockdatafiles/replaceCoordinationV1NamespacedLease-default.json"
        }
      ]
    },
    {
      "name": "watchCoordinationV1LeaseListForAllNamespaces",
      "protocol": "REST",
      "method": "GET",
      "entitypath": "{base_path}/{version}/apis/coordination.k8s.io/v1/watch/leases?{query}",
      "requestSchema": "schema.json",
      "responseSchema": "schema.json",
      "timeout": 0,
      "sendEmpty": false,
      "sendGetBody": false,
      "requestDatatype": "JSON",
      "responseDatatype": "JSON",
      "headers": {},
      "responseObjects": [
        {
          "type": "default",
          "key": "",
          "mockFile": "mockdatafiles/watchCoordinationV1LeaseListForAllNamespaces-default.json"
        }
      ]
    },
    {
      "name": "watchCoordinationV1NamespacedLeaseList",
      "protocol": "REST",
      "method": "GET",
      "entitypath": "{base_path}/{version}/apis/coordination.k8s.io/v1/watch/namespaces/{pathv1}/leases?{query}",
      "requestSchema": "schema.json",
      "responseSchema": "schema.json",
      "timeout": 0,
      "sendEmpty": false,
      "sendGetBody": false,
      "requestDatatype": "JSON",
      "responseDatatype": "JSON",
      "headers": {},
      "responseObjects": [
        {
          "type": "default",
          "key": "",
          "mockFile": "mockdatafiles/watchCoordinationV1NamespacedLeaseList-default.json"
        }
      ]
    },
    {
      "name": "watchCoordinationV1NamespacedLease",
      "protocol": "REST",
      "method": "GET",
      "entitypath": "{base_path}/{version}/apis/coordination.k8s.io/v1/watch/namespaces/{pathv1}/leases/{pathv2}?{query}",
      "requestSchema": "schema.json",
      "responseSchema": "schema.json",
      "timeout": 0,
      "sendEmpty": false,
      "sendGetBody": false,
      "requestDatatype": "JSON",
      "responseDatatype": "JSON",
      "headers": {},
      "responseObjects": [
        {
          "type": "default",
          "key": "",
          "mockFile": "mockdatafiles/watchCoordinationV1NamespacedLease-default.json"
        }
      ]
    }
  ]
}