{
  "apiVersion": "string",
  "groupVersion": "string",
  "kind": "string",
  "resources": [
    {
      "categories": [
        "string",
        "string",
        "string",
        "string",
        "string",
        "string"
      ],
      "group": "string",
      "kind": "string",
      "name": "string",
      "namespaced": true,
      "shortNames": [
        "string",
        "string",
        "string"
      ],
      "singularName": "string",
      "storageVersionHash": "string",
      "verbs": [
        "string",
        "string",
        "string",
        "string",
        "string",
        "string",
        "string",
        "string",
        "string"
      ],
      "version": "string"
    },
    {
      "categories": [
        "string",
        "string",
        "string",
        "string",
        "string",
        "string",
        "string",
        "string",
        "string"
      ],
      "group": "string",
      "kind": "string",
      "name": "string",
      "namespaced": false,
      "shortNames": [
        "string",
        "string",
        "string",
        "string",
        "string",
        "string",
        "string",
        "string",
        "string",
        "string"
      ],
      "singularName": "string",
      "storageVersionHash": "string",
      "verbs": [
        "string",
        "string",
        "string"
      ],
      "version": "string"
    },
    {
      "categories": [
        "string",
        "string",
        "string",
        "string"
      ],
      "group": "string",
      "kind": "string",
      "name": "string",
      "namespaced": false,
      "shortNames": [
        "string",
        "string",
        "string",
        "string",
        "string",
        "string",
        "string",
        "string"
      ],
      "singularName": "string",
      "storageVersionHash": "string",
      "verbs": [
        "string",
        "string",
        "string",
        "string",
        "string",
        "string",
        "string",
        "string"
      ],
      "version": "string"
    },
    {
      "categories": [
        "string",
        "string",
        "string",
        "string",
        "string"
      ],
      "group": "string",
      "kind": "string",
      "name": "string",
      "namespaced": false,
      "shortNames": [
        "string",
        "string",
        "string",
        "string",
        "string",
        "string",
        "string",
        "string",
        "string"
      ],
      "singularName": "string",
      "storageVersionHash": "string",
      "verbs": [
        "string",
        "string",
        "string",
        "string",
        "string",
        "string",
        "string",
        "string"
      ],
      "version": "string"
    }
  ]
}