{
  "aggregationRule": {
    "clusterRoleSelectors": [
      {
        "matchExpressions": [
          {
            "key": "string",
            "operator": "string",
            "values": [
              "string"
            ]
          },
          {
            "key": "string",
            "operator": "string",
            "values": [
              "string",
              "string",
              "string",
              "string",
              "string",
              "string",
              "string"
            ]
          },
          {
            "key": "string",
            "operator": "string",
            "values": [
              "string",
              "string",
              "string",
              "string",
              "string",
              "string",
              "string",
              "string"
            ]
          },
          {
            "key": "string",
            "operator": "string",
            "values": [
              "string",
              "string",
              "string",
              "string",
              "string"
            ]
          },
          {
            "key": "string",
            "operator": "string",
            "values": [
              "string",
              "string",
              "string",
              "string",
              "string",
              "string",
              "string"
            ]
          },
          {
            "key": "string",
            "operator": "string",
            "values": [
              "string",
              "string"
            ]
          }
        ],
        "matchLabels": {}
      },
      {
        "matchExpressions": [
          {
            "key": "string",
            "operator": "string",
            "values": [
              "string",
              "string",
              "string",
              "string",
              "string"
            ]
          },
          {
            "key": "string",
            "operator": "string",
            "values": [
              "string",
              "string",
              "string",
              "string",
              "string",
              "string",
              "string",
              "string",
              "string"
            ]
          },
          {
            "key": "string",
            "operator": "string",
            "values": [
              "string",
              "string",
              "string",
              "string",
              "string",
              "string",
              "string"
            ]
          },
          {
            "key": "string",
            "operator": "string",
            "values": [
              "string",
              "string",
              "string",
              "string",
              "string",
              "string",
              "string",
              "string"
            ]
          }
        ],
        "matchLabels": {}
      },
      {
        "matchExpressions": [
          {
            "key": "string",
            "operator": "string",
            "values": [
              "string",
              "string"
            ]
          },
          {
            "key": "string",
            "operator": "string",
            "values": [
              "string",
              "string",
              "string",
              "string",
              "string",
              "string"
            ]
          },
          {
            "key": "string",
            "operator": "string",
            "values": [
              "string",
              "string",
              "string",
              "string",
              "string",
              "string",
              "string",
              "string"
            ]
          },
          {
            "key": "string",
            "operator": "string",
            "values": [
              "string",
              "string",
              "string",
              "string",
              "string",
              "string",
              "string",
              "string",
              "string",
              "string"
            ]
          },
          {
            "key": "string",
            "operator": "string",
            "values": [
              "string",
              "string",
              "string",
              "string",
              "string",
              "string"
            ]
          },
          {
            "key": "string",
            "operator": "string",
            "values": [
              "string"
            ]
          },
          {
            "key": "string",
            "operator": "string",
            "values": [
              "string",
              "string",
              "string",
              "string",
              "string"
            ]
          }
        ],
        "matchLabels": {}
      },
      {
        "matchExpressions": [
          {
            "key": "string",
            "operator": "string",
            "values": [
              "string",
              "string",
              "string",
              "string",
              "string",
              "string",
              "string",
              "string",
              "string",
              "string"
            ]
          },
          {
            "key": "string",
            "operator": "string",
            "values": [
              "string",
              "string",
              "string",
              "string",
              "string",
              "string",
              "string",
              "string",
              "string"
            ]
          }
        ],
        "matchLabels": {}
      },
      {
        "matchExpressions": [
          {
            "key": "string",
            "operator": "string",
            "values": [
              "string",
              "string",
              "string",
              "string",
              "string",
              "string",
              "string"
            ]
          },
          {
            "key": "string",
            "operator": "string",
            "values": [
              "string",
              "string",
              "string",
              "string",
              "string",
              "string"
            ]
          },
          {
            "key": "string",
            "operator": "string",
            "values": [
              "string",
              "string"
            ]
          },
          {
            "key": "string",
            "operator": "string",
            "values": [
              "string",
              "string",
              "string",
              "string",
              "string"
            ]
          },
          {
            "key": "string",
            "operator": "string",
            "values": [
              "string",
              "string",
              "string",
              "string",
              "string",
              "string",
              "string",
              "string",
              "string"
            ]
          },
          {
            "key": "string",
            "operator": "string",
            "values": [
              "string",
              "string",
              "string",
              "string",
              "string",
              "string",
              "string",
              "string",
              "string",
              "string"
            ]
          },
          {
            "key": "string",
            "operator": "string",
            "values": [
              "string",
              "string",
              "string",
              "string",
              "string",
              "string",
              "string",
              "string",
              "string"
            ]
          },
          {
            "key": "string",
            "operator": "string",
            "values": [
              "string",
              "string",
              "string",
              "string",
              "string",
              "string",
              "string",
              "string",
              "string"
            ]
          }
        ],
        "matchLabels": {}
      },
      {
        "matchExpressions": [
          {
            "key": "string",
            "operator": "string",
            "values": [
              "string",
              "string",
              "string",
              "string",
              "string",
              "string",
              "string"
            ]
          },
          {
            "key": "string",
            "operator": "string",
            "values": [
              "string",
              "string",
              "string",
              "string",
              "string",
              "string",
              "string",
              "string",
              "string"
            ]
          },
          {
            "key": "string",
            "operator": "string",
            "values": [
              "string",
              "string",
              "string",
              "string",
              "string",
              "string",
              "string",
              "string",
              "string",
              "string"
            ]
          },
          {
            "key": "string",
            "operator": "string",
            "values": [
              "string",
              "string",
              "string",
              "string",
              "string",
              "string",
              "string",
              "string"
            ]
          },
          {
            "key": "string",
            "operator": "string",
            "values": [
              "string",
              "string",
              "string"
            ]
          },
          {
            "key": "string",
            "operator": "string",
            "values": [
              "string",
              "string",
              "string",
              "string",
              "string",
              "string",
              "string",
              "string",
              "string"
            ]
          },
          {
            "key": "string",
            "operator": "string",
            "values": [
              "string"
            ]
          },
          {
            "key": "string",
            "operator": "string",
            "values": [
              "string",
              "string",
              "string",
              "string",
              "string",
              "string",
              "string",
              "string",
              "string",
              "string"
            ]
          },
          {
            "key": "string",
            "operator": "string",
            "values": [
              "string",
              "string",
              "string",
              "string"
            ]
          },
          {
            "key": "string",
            "operator": "string",
            "values": [
              "string",
              "string",
              "string",
              "string"
            ]
          }
        ],
        "matchLabels": {}
      },
      {
        "matchExpressions": [
          {
            "key": "string",
            "operator": "string",
            "values": [
              "string"
            ]
          }
        ],
        "matchLabels": {}
      },
      {
        "matchExpressions": [
          {
            "key": "string",
            "operator": "string",
            "values": [
              "string",
              "string",
              "string",
              "string",
              "string",
              "string"
            ]
          },
          {
            "key": "string",
            "operator": "string",
            "values": [
              "string",
              "string",
              "string",
              "string",
              "string",
              "string"
            ]
          },
          {
            "key": "string",
            "operator": "string",
            "values": [
              "string",
              "string",
              "string",
              "string",
              "string"
            ]
          },
          {
            "key": "string",
            "operator": "string",
            "values": [
              "string",
              "string",
              "string"
            ]
          },
          {
            "key": "string",
            "operator": "string",
            "values": [
              "string",
              "string",
              "string"
            ]
          },
          {
            "key": "string",
            "operator": "string",
            "values": [
              "string",
              "string",
              "string"
            ]
          },
          {
            "key": "string",
            "operator": "string",
            "values": [
              "string",
              "string"
            ]
          },
          {
            "key": "string",
            "operator": "string",
            "values": [
              "string",
              "string",
              "string"
            ]
          },
          {
            "key": "string",
            "operator": "string",
            "values": [
              "string"
            ]
          },
          {
            "key": "string",
            "operator": "string",
            "values": [
              "string",
              "string",
              "string",
              "string",
              "string",
              "string",
              "string",
              "string",
              "string"
            ]
          }
        ],
        "matchLabels": {}
      },
      {
        "matchExpressions": [
          {
            "key": "string",
            "operator": "string",
            "values": [
              "string",
              "string",
              "string",
              "string",
              "string",
              "string",
              "string",
              "string",
              "string"
            ]
          },
          {
            "key": "string",
            "operator": "string",
            "values": [
              "string",
              "string",
              "string",
              "string"
            ]
          },
          {
            "key": "string",
            "operator": "string",
            "values": [
              "string"
            ]
          },
          {
            "key": "string",
            "operator": "string",
            "values": [
              "string",
              "string",
              "string",
              "string",
              "string",
              "string",
              "string",
              "string",
              "string",
              "string"
            ]
          },
          {
            "key": "string",
            "operator": "string",
            "values": [
              "string",
              "string",
              "string",
              "string",
              "string",
              "string",
              "string",
              "string",
              "string",
              "string"
            ]
          },
          {
            "key": "string",
            "operator": "string",
            "values": [
              "string",
              "string",
              "string",
              "string",
              "string",
              "string",
              "string",
              "string",
              "string",
              "string"
            ]
          },
          {
            "key": "string",
            "operator": "string",
            "values": [
              "string"
            ]
          }
        ],
        "matchLabels": {}
      }
    ]
  },
  "apiVersion": "string",
  "kind": "string",
  "metadata": {
    "annotations": {},
    "clusterName": "string",
    "creationTimestamp": "string",
    "deletionGracePeriodSeconds": 7,
    "deletionTimestamp": "string",
    "finalizers": [
      "string",
      "string",
      "string",
      "string",
      "string",
      "string",
      "string",
      "string",
      "string",
      "string"
    ],
    "generateName": "string",
    "generation": 10,
    "initializers": {
      "pending": [
        {
          "name": "string"
        },
        {
          "name": "string"
        },
        {
          "name": "string"
        },
        {
          "name": "string"
        },
        {
          "name": "string"
        },
        {
          "name": "string"
        },
        {
          "name": "string"
        }
      ],
      "result": {
        "apiVersion": "string",
        "code": 3,
        "details": {
          "causes": [
            {
              "field": "string",
              "message": "string",
              "reason": "string"
            },
            {
              "field": "string",
              "message": "string",
              "reason": "string"
            },
            {
              "field": "string",
              "message": "string",
              "reason": "string"
            },
            {
              "field": "string",
              "message": "string",
              "reason": "string"
            },
            {
              "field": "string",
              "message": "string",
              "reason": "string"
            },
            {
              "field": "string",
              "message": "string",
              "reason": "string"
            },
            {
              "field": "string",
              "message": "string",
              "reason": "string"
            },
            {
              "field": "string",
              "message": "string",
              "reason": "string"
            },
            {
              "field": "string",
              "message": "string",
              "reason": "string"
            },
            {
              "field": "string",
              "message": "string",
              "reason": "string"
            }
          ],
          "group": "string",
          "kind": "string",
          "name": "string",
          "retryAfterSeconds": 6,
          "uid": "string"
        },
        "kind": "string",
        "message": "string",
        "metadata": {
          "continue": "string",
          "remainingItemCount": 9,
          "resourceVersion": "string",
          "selfLink": "string"
        },
        "reason": "string",
        "status": "string"
      }
    },
    "labels": {},
    "managedFields": [
      {
        "apiVersion": "string",
        "fields": {},
        "manager": "string",
        "operation": "string",
        "time": "string"
      },
      {
        "apiVersion": "string",
        "fields": {},
        "manager": "string",
        "operation": "string",
        "time": "string"
      },
      {
        "apiVersion": "string",
        "fields": {},
        "manager": "string",
        "operation": "string",
        "time": "string"
      }
    ],
    "name": "string",
    "namespace": "string",
    "ownerReferences": [
      {
        "apiVersion": "string",
        "blockOwnerDeletion": true,
        "controller": true,
        "kind": "string",
        "name": "string",
        "uid": "string"
      }
    ],
    "resourceVersion": "string",
    "selfLink": "string",
    "uid": "string"
  },
  "rules": [
    {
      "apiGroups": [
        "string",
        "string",
        "string"
      ],
      "nonResourceURLs": [
        "string",
        "string",
        "string",
        "string",
        "string",
        "string",
        "string",
        "string"
      ],
      "resourceNames": [
        "string",
        "string",
        "string"
      ],
      "resources": [
        "string",
        "string"
      ],
      "verbs": [
        "string",
        "string"
      ]
    },
    {
      "apiGroups": [
        "string",
        "string",
        "string",
        "string",
        "string",
        "string"
      ],
      "nonResourceURLs": [
        "string",
        "string",
        "string",
        "string",
        "string"
      ],
      "resourceNames": [
        "string",
        "string",
        "string",
        "string",
        "string",
        "string",
        "string"
      ],
      "resources": [
        "string",
        "string",
        "string",
        "string",
        "string",
        "string",
        "string",
        "string",
        "string"
      ],
      "verbs": [
        "string",
        "string",
        "string",
        "string",
        "string",
        "string"
      ]
    },
    {
      "apiGroups": [
        "string",
        "string",
        "string",
        "string",
        "string",
        "string",
        "string",
        "string",
        "string",
        "string"
      ],
      "nonResourceURLs": [
        "string",
        "string",
        "string"
      ],
      "resourceNames": [
        "string",
        "string",
        "string",
        "string",
        "string",
        "string",
        "string",
        "string",
        "string"
      ],
      "resources": [
        "string"
      ],
      "verbs": [
        "string"
      ]
    },
    {
      "apiGroups": [
        "string",
        "string",
        "string",
        "string",
        "string",
        "string",
        "string",
        "string",
        "string",
        "string"
      ],
      "nonResourceURLs": [
        "string",
        "string"
      ],
      "resourceNames": [
        "string",
        "string",
        "string"
      ],
      "resources": [
        "string",
        "string",
        "string",
        "string",
        "string"
      ],
      "verbs": [
        "string",
        "string",
        "string"
      ]
    },
    {
      "apiGroups": [
        "string",
        "string",
        "string",
        "string",
        "string",
        "string",
        "string",
        "string"
      ],
      "nonResourceURLs": [
        "string",
        "string",
        "string",
        "string",
        "string",
        "string"
      ],
      "resourceNames": [
        "string",
        "string",
        "string",
        "string",
        "string",
        "string",
        "string",
        "string",
        "string"
      ],
      "resources": [
        "string",
        "string",
        "string",
        "string"
      ],
      "verbs": [
        "string",
        "string",
        "string"
      ]
    },
    {
      "apiGroups": [
        "string",
        "string",
        "string",
        "string",
        "string",
        "string",
        "string",
        "string"
      ],
      "nonResourceURLs": [
        "string",
        "string"
      ],
      "resourceNames": [
        "string",
        "string",
        "string",
        "string"
      ],
      "resources": [
        "string",
        "string",
        "string",
        "string",
        "string",
        "string",
        "string",
        "string",
        "string",
        "string"
      ],
      "verbs": [
        "string",
        "string",
        "string"
      ]
    },
    {
      "apiGroups": [
        "string",
        "string",
        "string",
        "string",
        "string",
        "string",
        "string"
      ],
      "nonResourceURLs": [
        "string",
        "string",
        "string",
        "string",
        "string"
      ],
      "resourceNames": [
        "string",
        "string",
        "string",
        "string",
        "string"
      ],
      "resources": [
        "string",
        "string",
        "string",
        "string"
      ],
      "verbs": [
        "string",
        "string",
        "string",
        "string",
        "string",
        "string",
        "string",
        "string",
        "string",
        "string"
      ]
    },
    {
      "apiGroups": [
        "string",
        "string",
        "string",
        "string",
        "string",
        "string",
        "string",
        "string",
        "string"
      ],
      "nonResourceURLs": [
        "string",
        "string",
        "string",
        "string",
        "string",
        "string",
        "string",
        "string"
      ],
      "resourceNames": [
        "string"
      ],
      "resources": [
        "string",
        "string",
        "string",
        "string",
        "string",
        "string"
      ],
      "verbs": [
        "string",
        "string",
        "string",
        "string",
        "string",
        "string",
        "string",
        "string",
        "string",
        "string"
      ]
    }
  ]
}