{
  "apiVersion": "string",
  "items": [
    {
      "apiVersion": "string",
      "kind": "string",
      "metadata": {
        "annotations": {},
        "clusterName": "string",
        "creationTimestamp": "string",
        "deletionGracePeriodSeconds": 1,
        "deletionTimestamp": "string",
        "finalizers": [
          "string",
          "string",
          "string",
          "string",
          "string"
        ],
        "generateName": "string",
        "generation": 8,
        "initializers": {
          "pending": [
            {
              "name": "string"
            },
            {
              "name": "string"
            },
            {
              "name": "string"
            },
            {
              "name": "string"
            },
            {
              "name": "string"
            },
            {
              "name": "string"
            }
          ],
          "result": {
            "apiVersion": "string",
            "code": 2,
            "details": {
              "causes": [
                {
                  "field": "string",
                  "message": "string",
                  "reason": "string"
                },
                {
                  "field": "string",
                  "message": "string",
                  "reason": "string"
                },
                {
                  "field": "string",
                  "message": "string",
                  "reason": "string"
                },
                {
                  "field": "string",
                  "message": "string",
                  "reason": "string"
                },
                {
                  "field": "string",
                  "message": "string",
                  "reason": "string"
                },
                {
                  "field": "string",
                  "message": "string",
                  "reason": "string"
                }
              ],
              "group": "string",
              "kind": "string",
              "name": "string",
              "retryAfterSeconds": 4,
              "uid": "string"
            },
            "kind": "string",
            "message": "string",
            "metadata": {
              "continue": "string",
              "remainingItemCount": 3,
              "resourceVersion": "string",
              "selfLink": "string"
            },
            "reason": "string",
            "status": "string"
          }
        },
        "labels": {},
        "managedFields": [
          {
            "apiVersion": "string",
            "fields": {},
            "manager": "string",
            "operation": "string",
            "time": "string"
          },
          {
            "apiVersion": "string",
            "fields": {},
            "manager": "string",
            "operation": "string",
            "time": "string"
          },
          {
            "apiVersion": "string",
            "fields": {},
            "manager": "string",
            "operation": "string",
            "time": "string"
          }
        ],
        "name": "string",
        "namespace": "string",
        "ownerReferences": [
          {
            "apiVersion": "string",
            "blockOwnerDeletion": true,
            "controller": true,
            "kind": "string",
            "name": "string",
            "uid": "string"
          },
          {
            "apiVersion": "string",
            "blockOwnerDeletion": true,
            "controller": false,
            "kind": "string",
            "name": "string",
            "uid": "string"
          },
          {
            "apiVersion": "string",
            "blockOwnerDeletion": false,
            "controller": true,
            "kind": "string",
            "name": "string",
            "uid": "string"
          },
          {
            "apiVersion": "string",
            "blockOwnerDeletion": false,
            "controller": false,
            "kind": "string",
            "name": "string",
            "uid": "string"
          },
          {
            "apiVersion": "string",
            "blockOwnerDeletion": true,
            "controller": true,
            "kind": "string",
            "name": "string",
            "uid": "string"
          },
          {
            "apiVersion": "string",
            "blockOwnerDeletion": false,
            "controller": false,
            "kind": "string",
            "name": "string",
            "uid": "string"
          },
          {
            "apiVersion": "string",
            "blockOwnerDeletion": true,
            "controller": true,
            "kind": "string",
            "name": "string",
            "uid": "string"
          }
        ],
        "resourceVersion": "string",
        "selfLink": "string",
        "uid": "string"
      },
      "spec": {
        "attachRequired": true,
        "podInfoOnMount": false
      }
    }
  ],
  "kind": "string",
  "metadata": {
    "continue": "string",
    "remainingItemCount": 3,
    "resourceVersion": "string",
    "selfLink": "string"
  }
}