{
  "apiVersion": "string",
  "items": [
    {
      "apiVersion": "string",
      "kind": "string",
      "metadata": {
        "annotations": {},
        "clusterName": "string",
        "creationTimestamp": "string",
        "deletionGracePeriodSeconds": 3,
        "deletionTimestamp": "string",
        "finalizers": [
          "string",
          "string",
          "string",
          "string",
          "string"
        ],
        "generateName": "string",
        "generation": 3,
        "initializers": {
          "pending": [
            {
              "name": "string"
            },
            {
              "name": "string"
            },
            {
              "name": "string"
            },
            {
              "name": "string"
            },
            {
              "name": "string"
            },
            {
              "name": "string"
            },
            {
              "name": "string"
            }
          ],
          "result": {
            "apiVersion": "string",
            "code": 2,
            "details": {
              "causes": [
                {
                  "field": "string",
                  "message": "string",
                  "reason": "string"
                },
                {
                  "field": "string",
                  "message": "string",
                  "reason": "string"
                },
                {
                  "field": "string",
                  "message": "string",
                  "reason": "string"
                }
              ],
              "group": "string",
              "kind": "string",
              "name": "string",
              "retryAfterSeconds": 8,
              "uid": "string"
            },
            "kind": "string",
            "message": "string",
            "metadata": {
              "continue": "string",
              "remainingItemCount": 2,
              "resourceVersion": "string",
              "selfLink": "string"
            },
            "reason": "string",
            "status": "string"
          }
        },
        "labels": {},
        "managedFields": [
          {
            "apiVersion": "string",
            "fields": {},
            "manager": "string",
            "operation": "string",
            "time": "string"
          },
          {
            "apiVersion": "string",
            "fields": {},
            "manager": "string",
            "operation": "string",
            "time": "string"
          },
          {
            "apiVersion": "string",
            "fields": {},
            "manager": "string",
            "operation": "string",
            "time": "string"
          }
        ],
        "name": "string",
        "namespace": "string",
        "ownerReferences": [
          {
            "apiVersion": "string",
            "blockOwnerDeletion": true,
            "controller": false,
            "kind": "string",
            "name": "string",
            "uid": "string"
          },
          {
            "apiVersion": "string",
            "blockOwnerDeletion": false,
            "controller": false,
            "kind": "string",
            "name": "string",
            "uid": "string"
          },
          {
            "apiVersion": "string",
            "blockOwnerDeletion": true,
            "controller": false,
            "kind": "string",
            "name": "string",
            "uid": "string"
          },
          {
            "apiVersion": "string",
            "blockOwnerDeletion": true,
            "controller": true,
            "kind": "string",
            "name": "string",
            "uid": "string"
          },
          {
            "apiVersion": "string",
            "blockOwnerDeletion": false,
            "controller": true,
            "kind": "string",
            "name": "string",
            "uid": "string"
          }
        ],
        "resourceVersion": "string",
        "selfLink": "string",
        "uid": "string"
      },
      "rules": [
        {
          "apiGroups": [
            "string",
            "string",
            "string",
            "string",
            "string",
            "string",
            "string"
          ],
          "nonResourceURLs": [
            "string",
            "string",
            "string",
            "string",
            "string",
            "string",
            "string",
            "string",
            "string",
            "string"
          ],
          "resourceNames": [
            "string",
            "string",
            "string"
          ],
          "resources": [
            "string",
            "string",
            "string",
            "string",
            "string"
          ],
          "verbs": [
            "string",
            "string",
            "string"
          ]
        },
        {
          "apiGroups": [
            "string",
            "string"
          ],
          "nonResourceURLs": [
            "string",
            "string",
            "string",
            "string",
            "string",
            "string",
            "string",
            "string"
          ],
          "resourceNames": [
            "string",
            "string"
          ],
          "resources": [
            "string",
            "string",
            "string",
            "string",
            "string"
          ],
          "verbs": [
            "string",
            "string",
            "string",
            "string",
            "string"
          ]
        },
        {
          "apiGroups": [
            "string",
            "string",
            "string",
            "string",
            "string",
            "string",
            "string"
          ],
          "nonResourceURLs": [
            "string",
            "string",
            "string",
            "string"
          ],
          "resourceNames": [
            "string",
            "string",
            "string",
            "string",
            "string"
          ],
          "resources": [
            "string",
            "string",
            "string",
            "string",
            "string",
            "string"
          ],
          "verbs": [
            "string"
          ]
        },
        {
          "apiGroups": [
            "string",
            "string",
            "string",
            "string"
          ],
          "nonResourceURLs": [
            "string"
          ],
          "resourceNames": [
            "string",
            "string",
            "string",
            "string",
            "string",
            "string"
          ],
          "resources": [
            "string",
            "string",
            "string",
            "string",
            "string",
            "string",
            "string",
            "string",
            "string",
            "string"
          ],
          "verbs": [
            "string",
            "string",
            "string",
            "string",
            "string",
            "string",
            "string",
            "string"
          ]
        },
        {
          "apiGroups": [
            "string",
            "string",
            "string",
            "string",
            "string",
            "string",
            "string",
            "string",
            "string",
            "string"
          ],
          "nonResourceURLs": [
            "string",
            "string",
            "string",
            "string"
          ],
          "resourceNames": [
            "string",
            "string",
            "string",
            "string",
            "string"
          ],
          "resources": [
            "string",
            "string",
            "string"
          ],
          "verbs": [
            "string",
            "string",
            "string",
            "string",
            "string",
            "string",
            "string",
            "string",
            "string",
            "string"
          ]
        },
        {
          "apiGroups": [
            "string",
            "string",
            "string",
            "string"
          ],
          "nonResourceURLs": [
            "string",
            "string",
            "string",
            "string",
            "string",
            "string",
            "string",
            "string"
          ],
          "resourceNames": [
            "string",
            "string",
            "string",
            "string",
            "string",
            "string"
          ],
          "resources": [
            "string",
            "string",
            "string",
            "string",
            "string",
            "string",
            "string",
            "string",
            "string",
            "string"
          ],
          "verbs": [
            "string",
            "string",
            "string",
            "string",
            "string",
            "string",
            "string"
          ]
        },
        {
          "apiGroups": [
            "string",
            "string",
            "string",
            "string",
            "string",
            "string",
            "string",
            "string",
            "string",
            "string"
          ],
          "nonResourceURLs": [
            "string",
            "string",
            "string",
            "string",
            "string",
            "string",
            "string"
          ],
          "resourceNames": [
            "string",
            "string",
            "string",
            "string"
          ],
          "resources": [
            "string"
          ],
          "verbs": [
            "string",
            "string",
            "string",
            "string"
          ]
        },
        {
          "apiGroups": [
            "string",
            "string",
            "string",
            "string",
            "string",
            "string",
            "string",
            "string",
            "string",
            "string"
          ],
          "nonResourceURLs": [
            "string",
            "string",
            "string",
            "string"
          ],
          "resourceNames": [
            "string",
            "string",
            "string",
            "string",
            "string",
            "string",
            "string",
            "string",
            "string"
          ],
          "resources": [
            "string",
            "string",
            "string",
            "string",
            "string",
            "string",
            "string",
            "string"
          ],
          "verbs": [
            "string",
            "string",
            "string",
            "string"
          ]
        },
        {
          "apiGroups": [
            "string",
            "string"
          ],
          "nonResourceURLs": [
            "string",
            "string",
            "string"
          ],
          "resourceNames": [
            "string",
            "string",
            "string",
            "string",
            "string",
            "string",
            "string",
            "string"
          ],
          "resources": [
            "string"
          ],
          "verbs": [
            "string",
            "string",
            "string"
          ]
        },
        {
          "apiGroups": [
            "string",
            "string",
            "string",
            "string"
          ],
          "nonResourceURLs": [
            "string",
            "string",
            "string"
          ],
          "resourceNames": [
            "string",
            "string",
            "string",
            "string",
            "string",
            "string",
            "string"
          ],
          "resources": [
            "string",
            "string",
            "string",
            "string"
          ],
          "verbs": [
            "string",
            "string",
            "string",
            "string",
            "string",
            "string",
            "string"
          ]
        }
      ]
    },
    {
      "apiVersion": "string",
      "kind": "string",
      "metadata": {
        "annotations": {},
        "clusterName": "string",
        "creationTimestamp": "string",
        "deletionGracePeriodSeconds": 7,
        "deletionTimestamp": "string",
        "finalizers": [
          "string",
          "string",
          "string",
          "string",
          "string",
          "string",
          "string",
          "string"
        ],
        "generateName": "string",
        "generation": 2,
        "initializers": {
          "pending": [
            {
              "name": "string"
            },
            {
              "name": "string"
            },
            {
              "name": "string"
            },
            {
              "name": "string"
            }
          ],
          "result": {
            "apiVersion": "string",
            "code": 3,
            "details": {
              "causes": [
                {
                  "field": "string",
                  "message": "string",
                  "reason": "string"
                },
                {
                  "field": "string",
                  "message": "string",
                  "reason": "string"
                },
                {
                  "field": "string",
                  "message": "string",
                  "reason": "string"
                }
              ],
              "group": "string",
              "kind": "string",
              "name": "string",
              "retryAfterSeconds": 2,
              "uid": "string"
            },
            "kind": "string",
            "message": "string",
            "metadata": {
              "continue": "string",
              "remainingItemCount": 3,
              "resourceVersion": "string",
              "selfLink": "string"
            },
            "reason": "string",
            "status": "string"
          }
        },
        "labels": {},
        "managedFields": [
          {
            "apiVersion": "string",
            "fields": {},
            "manager": "string",
            "operation": "string",
            "time": "string"
          },
          {
            "apiVersion": "string",
            "fields": {},
            "manager": "string",
            "operation": "string",
            "time": "string"
          },
          {
            "apiVersion": "string",
            "fields": {},
            "manager": "string",
            "operation": "string",
            "time": "string"
          },
          {
            "apiVersion": "string",
            "fields": {},
            "manager": "string",
            "operation": "string",
            "time": "string"
          },
          {
            "apiVersion": "string",
            "fields": {},
            "manager": "string",
            "operation": "string",
            "time": "string"
          },
          {
            "apiVersion": "string",
            "fields": {},
            "manager": "string",
            "operation": "string",
            "time": "string"
          },
          {
            "apiVersion": "string",
            "fields": {},
            "manager": "string",
            "operation": "string",
            "time": "string"
          }
        ],
        "name": "string",
        "namespace": "string",
        "ownerReferences": [
          {
            "apiVersion": "string",
            "blockOwnerDeletion": true,
            "controller": false,
            "kind": "string",
            "name": "string",
            "uid": "string"
          },
          {
            "apiVersion": "string",
            "blockOwnerDeletion": true,
            "controller": false,
            "kind": "string",
            "name": "string",
            "uid": "string"
          },
          {
            "apiVersion": "string",
            "blockOwnerDeletion": true,
            "controller": true,
            "kind": "string",
            "name": "string",
            "uid": "string"
          },
          {
            "apiVersion": "string",
            "blockOwnerDeletion": true,
            "controller": false,
            "kind": "string",
            "name": "string",
            "uid": "string"
          },
          {
            "apiVersion": "string",
            "blockOwnerDeletion": false,
            "controller": true,
            "kind": "string",
            "name": "string",
            "uid": "string"
          }
        ],
        "resourceVersion": "string",
        "selfLink": "string",
        "uid": "string"
      },
      "rules": [
        {
          "apiGroups": [
            "string",
            "string",
            "string",
            "string",
            "string",
            "string"
          ],
          "nonResourceURLs": [
            "string",
            "string",
            "string",
            "string",
            "string",
            "string",
            "string"
          ],
          "resourceNames": [
            "string",
            "string",
            "string",
            "string",
            "string",
            "string",
            "string",
            "string"
          ],
          "resources": [
            "string",
            "string",
            "string",
            "string",
            "string",
            "string",
            "string"
          ],
          "verbs": [
            "string"
          ]
        },
        {
          "apiGroups": [
            "string",
            "string",
            "string",
            "string",
            "string",
            "string",
            "string",
            "string",
            "string",
            "string"
          ],
          "nonResourceURLs": [
            "string",
            "string",
            "string",
            "string",
            "string",
            "string",
            "string",
            "string",
            "string"
          ],
          "resourceNames": [
            "string",
            "string",
            "string",
            "string",
            "string"
          ],
          "resources": [
            "string",
            "string",
            "string"
          ],
          "verbs": [
            "string",
            "string"
          ]
        },
        {
          "apiGroups": [
            "string",
            "string",
            "string",
            "string",
            "string",
            "string",
            "string",
            "string",
            "string"
          ],
          "nonResourceURLs": [
            "string"
          ],
          "resourceNames": [
            "string",
            "string",
            "string",
            "string",
            "string",
            "string"
          ],
          "resources": [
            "string",
            "string",
            "string",
            "string",
            "string",
            "string",
            "string",
            "string",
            "string",
            "string"
          ],
          "verbs": [
            "string",
            "string",
            "string",
            "string"
          ]
        },
        {
          "apiGroups": [
            "string",
            "string",
            "string",
            "string",
            "string",
            "string",
            "string",
            "string",
            "string",
            "string"
          ],
          "nonResourceURLs": [
            "string",
            "string",
            "string",
            "string",
            "string",
            "string",
            "string",
            "string",
            "string"
          ],
          "resourceNames": [
            "string",
            "string"
          ],
          "resources": [
            "string"
          ],
          "verbs": [
            "string",
            "string",
            "string",
            "string",
            "string",
            "string",
            "string",
            "string",
            "string",
            "string"
          ]
        },
        {
          "apiGroups": [
            "string",
            "string",
            "string",
            "string",
            "string"
          ],
          "nonResourceURLs": [
            "string",
            "string",
            "string",
            "string",
            "string",
            "string",
            "string"
          ],
          "resourceNames": [
            "string",
            "string",
            "string",
            "string",
            "string",
            "string",
            "string"
          ],
          "resources": [
            "string"
          ],
          "verbs": [
            "string",
            "string",
            "string",
            "string",
            "string",
            "string",
            "string"
          ]
        },
        {
          "apiGroups": [
            "string",
            "string",
            "string",
            "string",
            "string",
            "string"
          ],
          "nonResourceURLs": [
            "string",
            "string",
            "string",
            "string",
            "string",
            "string",
            "string",
            "string"
          ],
          "resourceNames": [
            "string",
            "string",
            "string",
            "string",
            "string",
            "string",
            "string",
            "string"
          ],
          "resources": [
            "string",
            "string",
            "string",
            "string",
            "string",
            "string",
            "string",
            "string",
            "string"
          ],
          "verbs": [
            "string",
            "string",
            "string"
          ]
        },
        {
          "apiGroups": [
            "string",
            "string",
            "string",
            "string",
            "string",
            "string"
          ],
          "nonResourceURLs": [
            "string",
            "string",
            "string",
            "string",
            "string",
            "string",
            "string",
            "string",
            "string",
            "string"
          ],
          "resourceNames": [
            "string",
            "string",
            "string",
            "string",
            "string"
          ],
          "resources": [
            "string",
            "string",
            "string",
            "string",
            "string",
            "string",
            "string",
            "string",
            "string"
          ],
          "verbs": [
            "string",
            "string",
            "string",
            "string",
            "string",
            "string",
            "string",
            "string",
            "string",
            "string"
          ]
        },
        {
          "apiGroups": [
            "string",
            "string",
            "string",
            "string",
            "string",
            "string"
          ],
          "nonResourceURLs": [
            "string"
          ],
          "resourceNames": [
            "string",
            "string",
            "string",
            "string",
            "string"
          ],
          "resources": [
            "string",
            "string",
            "string"
          ],
          "verbs": [
            "string",
            "string",
            "string",
            "string"
          ]
        },
        {
          "apiGroups": [
            "string"
          ],
          "nonResourceURLs": [
            "string",
            "string",
            "string",
            "string",
            "string"
          ],
          "resourceNames": [
            "string",
            "string",
            "string",
            "string",
            "string",
            "string",
            "string",
            "string",
            "string"
          ],
          "resources": [
            "string",
            "string",
            "string",
            "string",
            "string",
            "string",
            "string",
            "string"
          ],
          "verbs": [
            "string",
            "string"
          ]
        }
      ]
    }
  ],
  "kind": "string",
  "metadata": {
    "continue": "string",
    "remainingItemCount": 1,
    "resourceVersion": "string",
    "selfLink": "string"
  }
}