{
  "apiVersion": "string",
  "items": [
    {
      "apiVersion": "string",
      "kind": "string",
      "metadata": {
        "annotations": {},
        "clusterName": "string",
        "creationTimestamp": "string",
        "deletionGracePeriodSeconds": 6,
        "deletionTimestamp": "string",
        "finalizers": [
          "string"
        ],
        "generateName": "string",
        "generation": 2,
        "initializers": {
          "pending": [
            {
              "name": "string"
            },
            {
              "name": "string"
            },
            {
              "name": "string"
            },
            {
              "name": "string"
            },
            {
              "name": "string"
            },
            {
              "name": "string"
            },
            {
              "name": "string"
            }
          ],
          "result": {
            "apiVersion": "string",
            "code": 2,
            "details": {
              "causes": [
                {
                  "field": "string",
                  "message": "string",
                  "reason": "string"
                },
                {
                  "field": "string",
                  "message": "string",
                  "reason": "string"
                }
              ],
              "group": "string",
              "kind": "string",
              "name": "string",
              "retryAfterSeconds": 2,
              "uid": "string"
            },
            "kind": "string",
            "message": "string",
            "metadata": {
              "continue": "string",
              "remainingItemCount": 7,
              "resourceVersion": "string",
              "selfLink": "string"
            },
            "reason": "string",
            "status": "string"
          }
        },
        "labels": {},
        "managedFields": [
          {
            "apiVersion": "string",
            "fields": {},
            "manager": "string",
            "operation": "string",
            "time": "string"
          },
          {
            "apiVersion": "string",
            "fields": {},
            "manager": "string",
            "operation": "string",
            "time": "string"
          },
          {
            "apiVersion": "string",
            "fields": {},
            "manager": "string",
            "operation": "string",
            "time": "string"
          },
          {
            "apiVersion": "string",
            "fields": {},
            "manager": "string",
            "operation": "string",
            "time": "string"
          },
          {
            "apiVersion": "string",
            "fields": {},
            "manager": "string",
            "operation": "string",
            "time": "string"
          }
        ],
        "name": "string",
        "namespace": "string",
        "ownerReferences": [
          {
            "apiVersion": "string",
            "blockOwnerDeletion": false,
            "controller": false,
            "kind": "string",
            "name": "string",
            "uid": "string"
          },
          {
            "apiVersion": "string",
            "blockOwnerDeletion": true,
            "controller": false,
            "kind": "string",
            "name": "string",
            "uid": "string"
          },
          {
            "apiVersion": "string",
            "blockOwnerDeletion": false,
            "controller": false,
            "kind": "string",
            "name": "string",
            "uid": "string"
          }
        ],
        "resourceVersion": "string",
        "selfLink": "string",
        "uid": "string"
      },
      "spec": {
        "accessModes": [
          "string",
          "string",
          "string",
          "string",
          "string"
        ],
        "dataSource": {
          "apiGroup": "string",
          "kind": "string",
          "name": "string"
        },
        "resources": {
          "limits": {},
          "requests": {}
        },
        "selector": {
          "matchExpressions": [
            {
              "key": "string",
              "operator": "string",
              "values": [
                "string",
                "string",
                "string"
              ]
            },
            {
              "key": "string",
              "operator": "string",
              "values": [
                "string",
                "string",
                "string",
                "string",
                "string",
                "string",
                "string",
                "string",
                "string",
                "string"
              ]
            },
            {
              "key": "string",
              "operator": "string",
              "values": [
                "string"
              ]
            },
            {
              "key": "string",
              "operator": "string",
              "values": [
                "string",
                "string",
                "string",
                "string",
                "string",
                "string",
                "string",
                "string",
                "string",
                "string"
              ]
            }
          ],
          "matchLabels": {}
        },
        "storageClassName": "string",
        "volumeMode": "string",
        "volumeName": "string"
      },
      "status": {
        "accessModes": [
          "string",
          "string",
          "string",
          "string",
          "string",
          "string",
          "string",
          "string"
        ],
        "capacity": {},
        "conditions": [
          {
            "lastProbeTime": "string",
            "lastTransitionTime": "string",
            "message": "string",
            "reason": "string",
            "status": "string",
            "type": "string"
          },
          {
            "lastProbeTime": "string",
            "lastTransitionTime": "string",
            "message": "string",
            "reason": "string",
            "status": "string",
            "type": "string"
          },
          {
            "lastProbeTime": "string",
            "lastTransitionTime": "string",
            "message": "string",
            "reason": "string",
            "status": "string",
            "type": "string"
          },
          {
            "lastProbeTime": "string",
            "lastTransitionTime": "string",
            "message": "string",
            "reason": "string",
            "status": "string",
            "type": "string"
          }
        ],
        "phase": "string"
      }
    },
    {
      "apiVersion": "string",
      "kind": "string",
      "metadata": {
        "annotations": {},
        "clusterName": "string",
        "creationTimestamp": "string",
        "deletionGracePeriodSeconds": 1,
        "deletionTimestamp": "string",
        "finalizers": [
          "string",
          "string"
        ],
        "generateName": "string",
        "generation": 7,
        "initializers": {
          "pending": [
            {
              "name": "string"
            }
          ],
          "result": {
            "apiVersion": "string",
            "code": 4,
            "details": {
              "causes": [
                {
                  "field": "string",
                  "message": "string",
                  "reason": "string"
                },
                {
                  "field": "string",
                  "message": "string",
                  "reason": "string"
                },
                {
                  "field": "string",
                  "message": "string",
                  "reason": "string"
                },
                {
                  "field": "string",
                  "message": "string",
                  "reason": "string"
                },
                {
                  "field": "string",
                  "message": "string",
                  "reason": "string"
                },
                {
                  "field": "string",
                  "message": "string",
                  "reason": "string"
                },
                {
                  "field": "string",
                  "message": "string",
                  "reason": "string"
                }
              ],
              "group": "string",
              "kind": "string",
              "name": "string",
              "retryAfterSeconds": 9,
              "uid": "string"
            },
            "kind": "string",
            "message": "string",
            "metadata": {
              "continue": "string",
              "remainingItemCount": 4,
              "resourceVersion": "string",
              "selfLink": "string"
            },
            "reason": "string",
            "status": "string"
          }
        },
        "labels": {},
        "managedFields": [
          {
            "apiVersion": "string",
            "fields": {},
            "manager": "string",
            "operation": "string",
            "time": "string"
          },
          {
            "apiVersion": "string",
            "fields": {},
            "manager": "string",
            "operation": "string",
            "time": "string"
          },
          {
            "apiVersion": "string",
            "fields": {},
            "manager": "string",
            "operation": "string",
            "time": "string"
          },
          {
            "apiVersion": "string",
            "fields": {},
            "manager": "string",
            "operation": "string",
            "time": "string"
          },
          {
            "apiVersion": "string",
            "fields": {},
            "manager": "string",
            "operation": "string",
            "time": "string"
          },
          {
            "apiVersion": "string",
            "fields": {},
            "manager": "string",
            "operation": "string",
            "time": "string"
          }
        ],
        "name": "string",
        "namespace": "string",
        "ownerReferences": [
          {
            "apiVersion": "string",
            "blockOwnerDeletion": true,
            "controller": false,
            "kind": "string",
            "name": "string",
            "uid": "string"
          },
          {
            "apiVersion": "string",
            "blockOwnerDeletion": false,
            "controller": true,
            "kind": "string",
            "name": "string",
            "uid": "string"
          },
          {
            "apiVersion": "string",
            "blockOwnerDeletion": false,
            "controller": true,
            "kind": "string",
            "name": "string",
            "uid": "string"
          },
          {
            "apiVersion": "string",
            "blockOwnerDeletion": false,
            "controller": true,
            "kind": "string",
            "name": "string",
            "uid": "string"
          },
          {
            "apiVersion": "string",
            "blockOwnerDeletion": true,
            "controller": false,
            "kind": "string",
            "name": "string",
            "uid": "string"
          }
        ],
        "resourceVersion": "string",
        "selfLink": "string",
        "uid": "string"
      },
      "spec": {
        "accessModes": [
          "string",
          "string"
        ],
        "dataSource": {
          "apiGroup": "string",
          "kind": "string",
          "name": "string"
        },
        "resources": {
          "limits": {},
          "requests": {}
        },
        "selector": {
          "matchExpressions": [
            {
              "key": "string",
              "operator": "string",
              "values": [
                "string",
                "string",
                "string",
                "string",
                "string",
                "string",
                "string",
                "string"
              ]
            },
            {
              "key": "string",
              "operator": "string",
              "values": [
                "string",
                "string",
                "string",
                "string",
                "string",
                "string",
                "string",
                "string",
                "string",
                "string"
              ]
            }
          ],
          "matchLabels": {}
        },
        "storageClassName": "string",
        "volumeMode": "string",
        "volumeName": "string"
      },
      "status": {
        "accessModes": [
          "string",
          "string"
        ],
        "capacity": {},
        "conditions": [
          {
            "lastProbeTime": "string",
            "lastTransitionTime": "string",
            "message": "string",
            "reason": "string",
            "status": "string",
            "type": "string"
          },
          {
            "lastProbeTime": "string",
            "lastTransitionTime": "string",
            "message": "string",
            "reason": "string",
            "status": "string",
            "type": "string"
          },
          {
            "lastProbeTime": "string",
            "lastTransitionTime": "string",
            "message": "string",
            "reason": "string",
            "status": "string",
            "type": "string"
          },
          {
            "lastProbeTime": "string",
            "lastTransitionTime": "string",
            "message": "string",
            "reason": "string",
            "status": "string",
            "type": "string"
          },
          {
            "lastProbeTime": "string",
            "lastTransitionTime": "string",
            "message": "string",
            "reason": "string",
            "status": "string",
            "type": "string"
          }
        ],
        "phase": "string"
      }
    },
    {
      "apiVersion": "string",
      "kind": "string",
      "metadata": {
        "annotations": {},
        "clusterName": "string",
        "creationTimestamp": "string",
        "deletionGracePeriodSeconds": 9,
        "deletionTimestamp": "string",
        "finalizers": [
          "string",
          "string",
          "string",
          "string"
        ],
        "generateName": "string",
        "generation": 5,
        "initializers": {
          "pending": [
            {
              "name": "string"
            },
            {
              "name": "string"
            },
            {
              "name": "string"
            },
            {
              "name": "string"
            },
            {
              "name": "string"
            },
            {
              "name": "string"
            }
          ],
          "result": {
            "apiVersion": "string",
            "code": 9,
            "details": {
              "causes": [
                {
                  "field": "string",
                  "message": "string",
                  "reason": "string"
                },
                {
                  "field": "string",
                  "message": "string",
                  "reason": "string"
                },
                {
                  "field": "string",
                  "message": "string",
                  "reason": "string"
                },
                {
                  "field": "string",
                  "message": "string",
                  "reason": "string"
                },
                {
                  "field": "string",
                  "message": "string",
                  "reason": "string"
                }
              ],
              "group": "string",
              "kind": "string",
              "name": "string",
              "retryAfterSeconds": 6,
              "uid": "string"
            },
            "kind": "string",
            "message": "string",
            "metadata": {
              "continue": "string",
              "remainingItemCount": 6,
              "resourceVersion": "string",
              "selfLink": "string"
            },
            "reason": "string",
            "status": "string"
          }
        },
        "labels": {},
        "managedFields": [
          {
            "apiVersion": "string",
            "fields": {},
            "manager": "string",
            "operation": "string",
            "time": "string"
          },
          {
            "apiVersion": "string",
            "fields": {},
            "manager": "string",
            "operation": "string",
            "time": "string"
          },
          {
            "apiVersion": "string",
            "fields": {},
            "manager": "string",
            "operation": "string",
            "time": "string"
          },
          {
            "apiVersion": "string",
            "fields": {},
            "manager": "string",
            "operation": "string",
            "time": "string"
          },
          {
            "apiVersion": "string",
            "fields": {},
            "manager": "string",
            "operation": "string",
            "time": "string"
          },
          {
            "apiVersion": "string",
            "fields": {},
            "manager": "string",
            "operation": "string",
            "time": "string"
          }
        ],
        "name": "string",
        "namespace": "string",
        "ownerReferences": [
          {
            "apiVersion": "string",
            "blockOwnerDeletion": false,
            "controller": true,
            "kind": "string",
            "name": "string",
            "uid": "string"
          },
          {
            "apiVersion": "string",
            "blockOwnerDeletion": true,
            "controller": true,
            "kind": "string",
            "name": "string",
            "uid": "string"
          }
        ],
        "resourceVersion": "string",
        "selfLink": "string",
        "uid": "string"
      },
      "spec": {
        "accessModes": [
          "string",
          "string",
          "string"
        ],
        "dataSource": {
          "apiGroup": "string",
          "kind": "string",
          "name": "string"
        },
        "resources": {
          "limits": {},
          "requests": {}
        },
        "selector": {
          "matchExpressions": [
            {
              "key": "string",
              "operator": "string",
              "values": [
                "string",
                "string"
              ]
            },
            {
              "key": "string",
              "operator": "string",
              "values": [
                "string",
                "string",
                "string",
                "string",
                "string",
                "string",
                "string"
              ]
            },
            {
              "key": "string",
              "operator": "string",
              "values": [
                "string",
                "string",
                "string",
                "string",
                "string",
                "string",
                "string",
                "string",
                "string",
                "string"
              ]
            },
            {
              "key": "string",
              "operator": "string",
              "values": [
                "string",
                "string",
                "string"
              ]
            },
            {
              "key": "string",
              "operator": "string",
              "values": [
                "string",
                "string",
                "string",
                "string",
                "string",
                "string",
                "string",
                "string",
                "string"
              ]
            },
            {
              "key": "string",
              "operator": "string",
              "values": [
                "string",
                "string",
                "string",
                "string"
              ]
            },
            {
              "key": "string",
              "operator": "string",
              "values": [
                "string",
                "string",
                "string",
                "string",
                "string",
                "string"
              ]
            },
            {
              "key": "string",
              "operator": "string",
              "values": [
                "string",
                "string",
                "string",
                "string",
                "string",
                "string",
                "string",
                "string",
                "string"
              ]
            },
            {
              "key": "string",
              "operator": "string",
              "values": [
                "string",
                "string",
                "string",
                "string",
                "string",
                "string"
              ]
            }
          ],
          "matchLabels": {}
        },
        "storageClassName": "string",
        "volumeMode": "string",
        "volumeName": "string"
      },
      "status": {
        "accessModes": [
          "string",
          "string",
          "string",
          "string",
          "string",
          "string",
          "string",
          "string",
          "string",
          "string"
        ],
        "capacity": {},
        "conditions": [
          {
            "lastProbeTime": "string",
            "lastTransitionTime": "string",
            "message": "string",
            "reason": "string",
            "status": "string",
            "type": "string"
          },
          {
            "lastProbeTime": "string",
            "lastTransitionTime": "string",
            "message": "string",
            "reason": "string",
            "status": "string",
            "type": "string"
          },
          {
            "lastProbeTime": "string",
            "lastTransitionTime": "string",
            "message": "string",
            "reason": "string",
            "status": "string",
            "type": "string"
          },
          {
            "lastProbeTime": "string",
            "lastTransitionTime": "string",
            "message": "string",
            "reason": "string",
            "status": "string",
            "type": "string"
          }
        ],
        "phase": "string"
      }
    },
    {
      "apiVersion": "string",
      "kind": "string",
      "metadata": {
        "annotations": {},
        "clusterName": "string",
        "creationTimestamp": "string",
        "deletionGracePeriodSeconds": 7,
        "deletionTimestamp": "string",
        "finalizers": [
          "string",
          "string",
          "string",
          "string",
          "string",
          "string",
          "string",
          "string",
          "string"
        ],
        "generateName": "string",
        "generation": 4,
        "initializers": {
          "pending": [
            {
              "name": "string"
            },
            {
              "name": "string"
            },
            {
              "name": "string"
            },
            {
              "name": "string"
            }
          ],
          "result": {
            "apiVersion": "string",
            "code": 2,
            "details": {
              "causes": [
                {
                  "field": "string",
                  "message": "string",
                  "reason": "string"
                },
                {
                  "field": "string",
                  "message": "string",
                  "reason": "string"
                },
                {
                  "field": "string",
                  "message": "string",
                  "reason": "string"
                },
                {
                  "field": "string",
                  "message": "string",
                  "reason": "string"
                },
                {
                  "field": "string",
                  "message": "string",
                  "reason": "string"
                },
                {
                  "field": "string",
                  "message": "string",
                  "reason": "string"
                },
                {
                  "field": "string",
                  "message": "string",
                  "reason": "string"
                }
              ],
              "group": "string",
              "kind": "string",
              "name": "string",
              "retryAfterSeconds": 9,
              "uid": "string"
            },
            "kind": "string",
            "message": "string",
            "metadata": {
              "continue": "string",
              "remainingItemCount": 9,
              "resourceVersion": "string",
              "selfLink": "string"
            },
            "reason": "string",
            "status": "string"
          }
        },
        "labels": {},
        "managedFields": [
          {
            "apiVersion": "string",
            "fields": {},
            "manager": "string",
            "operation": "string",
            "time": "string"
          },
          {
            "apiVersion": "string",
            "fields": {},
            "manager": "string",
            "operation": "string",
            "time": "string"
          },
          {
            "apiVersion": "string",
            "fields": {},
            "manager": "string",
            "operation": "string",
            "time": "string"
          },
          {
            "apiVersion": "string",
            "fields": {},
            "manager": "string",
            "operation": "string",
            "time": "string"
          }
        ],
        "name": "string",
        "namespace": "string",
        "ownerReferences": [
          {
            "apiVersion": "string",
            "blockOwnerDeletion": true,
            "controller": false,
            "kind": "string",
            "name": "string",
            "uid": "string"
          },
          {
            "apiVersion": "string",
            "blockOwnerDeletion": false,
            "controller": true,
            "kind": "string",
            "name": "string",
            "uid": "string"
          },
          {
            "apiVersion": "string",
            "blockOwnerDeletion": true,
            "controller": true,
            "kind": "string",
            "name": "string",
            "uid": "string"
          },
          {
            "apiVersion": "string",
            "blockOwnerDeletion": false,
            "controller": true,
            "kind": "string",
            "name": "string",
            "uid": "string"
          },
          {
            "apiVersion": "string",
            "blockOwnerDeletion": true,
            "controller": false,
            "kind": "string",
            "name": "string",
            "uid": "string"
          },
          {
            "apiVersion": "string",
            "blockOwnerDeletion": true,
            "controller": true,
            "kind": "string",
            "name": "string",
            "uid": "string"
          },
          {
            "apiVersion": "string",
            "blockOwnerDeletion": false,
            "controller": false,
            "kind": "string",
            "name": "string",
            "uid": "string"
          },
          {
            "apiVersion": "string",
            "blockOwnerDeletion": true,
            "controller": true,
            "kind": "string",
            "name": "string",
            "uid": "string"
          },
          {
            "apiVersion": "string",
            "blockOwnerDeletion": true,
            "controller": true,
            "kind": "string",
            "name": "string",
            "uid": "string"
          }
        ],
        "resourceVersion": "string",
        "selfLink": "string",
        "uid": "string"
      },
      "spec": {
        "accessModes": [
          "string",
          "string",
          "string",
          "string",
          "string",
          "string",
          "string"
        ],
        "dataSource": {
          "apiGroup": "string",
          "kind": "string",
          "name": "string"
        },
        "resources": {
          "limits": {},
          "requests": {}
        },
        "selector": {
          "matchExpressions": [
            {
              "key": "string",
              "operator": "string",
              "values": [
                "string",
                "string",
                "string",
                "string",
                "string",
                "string",
                "string",
                "string",
                "string",
                "string"
              ]
            },
            {
              "key": "string",
              "operator": "string",
              "values": [
                "string",
                "string",
                "string",
                "string",
                "string",
                "string",
                "string",
                "string"
              ]
            },
            {
              "key": "string",
              "operator": "string",
              "values": [
                "string",
                "string",
                "string",
                "string",
                "string",
                "string"
              ]
            },
            {
              "key": "string",
              "operator": "string",
              "values": [
                "string",
                "string",
                "string",
                "string",
                "string",
                "string"
              ]
            },
            {
              "key": "string",
              "operator": "string",
              "values": [
                "string",
                "string"
              ]
            },
            {
              "key": "string",
              "operator": "string",
              "values": [
                "string",
                "string",
                "string",
                "string",
                "string",
                "string",
                "string",
                "string",
                "string"
              ]
            }
          ],
          "matchLabels": {}
        },
        "storageClassName": "string",
        "volumeMode": "string",
        "volumeName": "string"
      },
      "status": {
        "accessModes": [
          "string",
          "string"
        ],
        "capacity": {},
        "conditions": [
          {
            "lastProbeTime": "string",
            "lastTransitionTime": "string",
            "message": "string",
            "reason": "string",
            "status": "string",
            "type": "string"
          },
          {
            "lastProbeTime": "string",
            "lastTransitionTime": "string",
            "message": "string",
            "reason": "string",
            "status": "string",
            "type": "string"
          },
          {
            "lastProbeTime": "string",
            "lastTransitionTime": "string",
            "message": "string",
            "reason": "string",
            "status": "string",
            "type": "string"
          },
          {
            "lastProbeTime": "string",
            "lastTransitionTime": "string",
            "message": "string",
            "reason": "string",
            "status": "string",
            "type": "string"
          },
          {
            "lastProbeTime": "string",
            "lastTransitionTime": "string",
            "message": "string",
            "reason": "string",
            "status": "string",
            "type": "string"
          },
          {
            "lastProbeTime": "string",
            "lastTransitionTime": "string",
            "message": "string",
            "reason": "string",
            "status": "string",
            "type": "string"
          },
          {
            "lastProbeTime": "string",
            "lastTransitionTime": "string",
            "message": "string",
            "reason": "string",
            "status": "string",
            "type": "string"
          },
          {
            "lastProbeTime": "string",
            "lastTransitionTime": "string",
            "message": "string",
            "reason": "string",
            "status": "string",
            "type": "string"
          }
        ],
        "phase": "string"
      }
    },
    {
      "apiVersion": "string",
      "kind": "string",
      "metadata": {
        "annotations": {},
        "clusterName": "string",
        "creationTimestamp": "string",
        "deletionGracePeriodSeconds": 9,
        "deletionTimestamp": "string",
        "finalizers": [
          "string",
          "string",
          "string",
          "string",
          "string",
          "string",
          "string",
          "string"
        ],
        "generateName": "string",
        "generation": 1,
        "initializers": {
          "pending": [
            {
              "name": "string"
            },
            {
              "name": "string"
            },
            {
              "name": "string"
            },
            {
              "name": "string"
            },
            {
              "name": "string"
            },
            {
              "name": "string"
            },
            {
              "name": "string"
            },
            {
              "name": "string"
            },
            {
              "name": "string"
            },
            {
              "name": "string"
            }
          ],
          "result": {
            "apiVersion": "string",
            "code": 4,
            "details": {
              "causes": [
                {
                  "field": "string",
                  "message": "string",
                  "reason": "string"
                },
                {
                  "field": "string",
                  "message": "string",
                  "reason": "string"
                },
                {
                  "field": "string",
                  "message": "string",
                  "reason": "string"
                },
                {
                  "field": "string",
                  "message": "string",
                  "reason": "string"
                }
              ],
              "group": "string",
              "kind": "string",
              "name": "string",
              "retryAfterSeconds": 3,
              "uid": "string"
            },
            "kind": "string",
            "message": "string",
            "metadata": {
              "continue": "string",
              "remainingItemCount": 6,
              "resourceVersion": "string",
              "selfLink": "string"
            },
            "reason": "string",
            "status": "string"
          }
        },
        "labels": {},
        "managedFields": [
          {
            "apiVersion": "string",
            "fields": {},
            "manager": "string",
            "operation": "string",
            "time": "string"
          },
          {
            "apiVersion": "string",
            "fields": {},
            "manager": "string",
            "operation": "string",
            "time": "string"
          },
          {
            "apiVersion": "string",
            "fields": {},
            "manager": "string",
            "operation": "string",
            "time": "string"
          },
          {
            "apiVersion": "string",
            "fields": {},
            "manager": "string",
            "operation": "string",
            "time": "string"
          },
          {
            "apiVersion": "string",
            "fields": {},
            "manager": "string",
            "operation": "string",
            "time": "string"
          },
          {
            "apiVersion": "string",
            "fields": {},
            "manager": "string",
            "operation": "string",
            "time": "string"
          },
          {
            "apiVersion": "string",
            "fields": {},
            "manager": "string",
            "operation": "string",
            "time": "string"
          }
        ],
        "name": "string",
        "namespace": "string",
        "ownerReferences": [
          {
            "apiVersion": "string",
            "blockOwnerDeletion": false,
            "controller": true,
            "kind": "string",
            "name": "string",
            "uid": "string"
          },
          {
            "apiVersion": "string",
            "blockOwnerDeletion": false,
            "controller": true,
            "kind": "string",
            "name": "string",
            "uid": "string"
          },
          {
            "apiVersion": "string",
            "blockOwnerDeletion": true,
            "controller": false,
            "kind": "string",
            "name": "string",
            "uid": "string"
          },
          {
            "apiVersion": "string",
            "blockOwnerDeletion": false,
            "controller": true,
            "kind": "string",
            "name": "string",
            "uid": "string"
          },
          {
            "apiVersion": "string",
            "blockOwnerDeletion": false,
            "controller": false,
            "kind": "string",
            "name": "string",
            "uid": "string"
          },
          {
            "apiVersion": "string",
            "blockOwnerDeletion": true,
            "controller": true,
            "kind": "string",
            "name": "string",
            "uid": "string"
          },
          {
            "apiVersion": "string",
            "blockOwnerDeletion": false,
            "controller": true,
            "kind": "string",
            "name": "string",
            "uid": "string"
          },
          {
            "apiVersion": "string",
            "blockOwnerDeletion": true,
            "controller": false,
            "kind": "string",
            "name": "string",
            "uid": "string"
          },
          {
            "apiVersion": "string",
            "blockOwnerDeletion": false,
            "controller": true,
            "kind": "string",
            "name": "string",
            "uid": "string"
          }
        ],
        "resourceVersion": "string",
        "selfLink": "string",
        "uid": "string"
      },
      "spec": {
        "accessModes": [
          "string",
          "string",
          "string",
          "string",
          "string",
          "string"
        ],
        "dataSource": {
          "apiGroup": "string",
          "kind": "string",
          "name": "string"
        },
        "resources": {
          "limits": {},
          "requests": {}
        },
        "selector": {
          "matchExpressions": [
            {
              "key": "string",
              "operator": "string",
              "values": [
                "string",
                "string",
                "string"
              ]
            },
            {
              "key": "string",
              "operator": "string",
              "values": [
                "string",
                "string",
                "string",
                "string",
                "string"
              ]
            },
            {
              "key": "string",
              "operator": "string",
              "values": [
                "string",
                "string",
                "string",
                "string",
                "string",
                "string",
                "string",
                "string"
              ]
            },
            {
              "key": "string",
              "operator": "string",
              "values": [
                "string",
                "string"
              ]
            },
            {
              "key": "string",
              "operator": "string",
              "values": [
                "string",
                "string",
                "string",
                "string",
                "string"
              ]
            },
            {
              "key": "string",
              "operator": "string",
              "values": [
                "string",
                "string",
                "string",
                "string",
                "string",
                "string",
                "string",
                "string",
                "string",
                "string"
              ]
            },
            {
              "key": "string",
              "operator": "string",
              "values": [
                "string",
                "string",
                "string",
                "string",
                "string",
                "string"
              ]
            }
          ],
          "matchLabels": {}
        },
        "storageClassName": "string",
        "volumeMode": "string",
        "volumeName": "string"
      },
      "status": {
        "accessModes": [
          "string",
          "string",
          "string",
          "string",
          "string",
          "string",
          "string"
        ],
        "capacity": {},
        "conditions": [
          {
            "lastProbeTime": "string",
            "lastTransitionTime": "string",
            "message": "string",
            "reason": "string",
            "status": "string",
            "type": "string"
          },
          {
            "lastProbeTime": "string",
            "lastTransitionTime": "string",
            "message": "string",
            "reason": "string",
            "status": "string",
            "type": "string"
          },
          {
            "lastProbeTime": "string",
            "lastTransitionTime": "string",
            "message": "string",
            "reason": "string",
            "status": "string",
            "type": "string"
          },
          {
            "lastProbeTime": "string",
            "lastTransitionTime": "string",
            "message": "string",
            "reason": "string",
            "status": "string",
            "type": "string"
          },
          {
            "lastProbeTime": "string",
            "lastTransitionTime": "string",
            "message": "string",
            "reason": "string",
            "status": "string",
            "type": "string"
          },
          {
            "lastProbeTime": "string",
            "lastTransitionTime": "string",
            "message": "string",
            "reason": "string",
            "status": "string",
            "type": "string"
          },
          {
            "lastProbeTime": "string",
            "lastTransitionTime": "string",
            "message": "string",
            "reason": "string",
            "status": "string",
            "type": "string"
          },
          {
            "lastProbeTime": "string",
            "lastTransitionTime": "string",
            "message": "string",
            "reason": "string",
            "status": "string",
            "type": "string"
          },
          {
            "lastProbeTime": "string",
            "lastTransitionTime": "string",
            "message": "string",
            "reason": "string",
            "status": "string",
            "type": "string"
          }
        ],
        "phase": "string"
      }
    }
  ],
  "kind": "string",
  "metadata": {
    "continue": "string",
    "remainingItemCount": 7,
    "resourceVersion": "string",
    "selfLink": "string"
  }
}