{
  "apiVersion": "string",
  "kind": "string",
  "metadata": {
    "annotations": {},
    "clusterName": "string",
    "creationTimestamp": "string",
    "deletionGracePeriodSeconds": 4,
    "deletionTimestamp": "string",
    "finalizers": [
      "string",
      "string",
      "string",
      "string",
      "string",
      "string",
      "string",
      "string",
      "string"
    ],
    "generateName": "string",
    "generation": 7,
    "initializers": {
      "pending": [
        {
          "name": "string"
        },
        {
          "name": "string"
        },
        {
          "name": "string"
        },
        {
          "name": "string"
        },
        {
          "name": "string"
        },
        {
          "name": "string"
        },
        {
          "name": "string"
        },
        {
          "name": "string"
        }
      ],
      "result": {
        "apiVersion": "string",
        "code": 5,
        "details": {
          "causes": [
            {
              "field": "string",
              "message": "string",
              "reason": "string"
            },
            {
              "field": "string",
              "message": "string",
              "reason": "string"
            }
          ],
          "group": "string",
          "kind": "string",
          "name": "string",
          "retryAfterSeconds": 6,
          "uid": "string"
        },
        "kind": "string",
        "message": "string",
        "metadata": {
          "continue": "string",
          "remainingItemCount": 10,
          "resourceVersion": "string",
          "selfLink": "string"
        },
        "reason": "string",
        "status": "string"
      }
    },
    "labels": {},
    "managedFields": [
      {
        "apiVersion": "string",
        "fields": {},
        "manager": "string",
        "operation": "string",
        "time": "string"
      },
      {
        "apiVersion": "string",
        "fields": {},
        "manager": "string",
        "operation": "string",
        "time": "string"
      },
      {
        "apiVersion": "string",
        "fields": {},
        "manager": "string",
        "operation": "string",
        "time": "string"
      }
    ],
    "name": "string",
    "namespace": "string",
    "ownerReferences": [
      {
        "apiVersion": "string",
        "blockOwnerDeletion": false,
        "controller": true,
        "kind": "string",
        "name": "string",
        "uid": "string"
      },
      {
        "apiVersion": "string",
        "blockOwnerDeletion": true,
        "controller": true,
        "kind": "string",
        "name": "string",
        "uid": "string"
      },
      {
        "apiVersion": "string",
        "blockOwnerDeletion": true,
        "controller": true,
        "kind": "string",
        "name": "string",
        "uid": "string"
      }
    ],
    "resourceVersion": "string",
    "selfLink": "string",
    "uid": "string"
  },
  "subsets": [
    {
      "addresses": [
        {
          "hostname": "string",
          "ip": "string",
          "nodeName": "string",
          "targetRef": {
            "apiVersion": "string",
            "fieldPath": "string",
            "kind": "string",
            "name": "string",
            "namespace": "string",
            "resourceVersion": "string",
            "uid": "string"
          }
        },
        {
          "hostname": "string",
          "ip": "string",
          "nodeName": "string",
          "targetRef": {
            "apiVersion": "string",
            "fieldPath": "string",
            "kind": "string",
            "name": "string",
            "namespace": "string",
            "resourceVersion": "string",
            "uid": "string"
          }
        }
      ],
      "notReadyAddresses": [
        {
          "hostname": "string",
          "ip": "string",
          "nodeName": "string",
          "targetRef": {
            "apiVersion": "string",
            "fieldPath": "string",
            "kind": "string",
            "name": "string",
            "namespace": "string",
            "resourceVersion": "string",
            "uid": "string"
          }
        },
        {
          "hostname": "string",
          "ip": "string",
          "nodeName": "string",
          "targetRef": {
            "apiVersion": "string",
            "fieldPath": "string",
            "kind": "string",
            "name": "string",
            "namespace": "string",
            "resourceVersion": "string",
            "uid": "string"
          }
        },
        {
          "hostname": "string",
          "ip": "string",
          "nodeName": "string",
          "targetRef": {
            "apiVersion": "string",
            "fieldPath": "string",
            "kind": "string",
            "name": "string",
            "namespace": "string",
            "resourceVersion": "string",
            "uid": "string"
          }
        },
        {
          "hostname": "string",
          "ip": "string",
          "nodeName": "string",
          "targetRef": {
            "apiVersion": "string",
            "fieldPath": "string",
            "kind": "string",
            "name": "string",
            "namespace": "string",
            "resourceVersion": "string",
            "uid": "string"
          }
        },
        {
          "hostname": "string",
          "ip": "string",
          "nodeName": "string",
          "targetRef": {
            "apiVersion": "string",
            "fieldPath": "string",
            "kind": "string",
            "name": "string",
            "namespace": "string",
            "resourceVersion": "string",
            "uid": "string"
          }
        },
        {
          "hostname": "string",
          "ip": "string",
          "nodeName": "string",
          "targetRef": {
            "apiVersion": "string",
            "fieldPath": "string",
            "kind": "string",
            "name": "string",
            "namespace": "string",
            "resourceVersion": "string",
            "uid": "string"
          }
        },
        {
          "hostname": "string",
          "ip": "string",
          "nodeName": "string",
          "targetRef": {
            "apiVersion": "string",
            "fieldPath": "string",
            "kind": "string",
            "name": "string",
            "namespace": "string",
            "resourceVersion": "string",
            "uid": "string"
          }
        },
        {
          "hostname": "string",
          "ip": "string",
          "nodeName": "string",
          "targetRef": {
            "apiVersion": "string",
            "fieldPath": "string",
            "kind": "string",
            "name": "string",
            "namespace": "string",
            "resourceVersion": "string",
            "uid": "string"
          }
        },
        {
          "hostname": "string",
          "ip": "string",
          "nodeName": "string",
          "targetRef": {
            "apiVersion": "string",
            "fieldPath": "string",
            "kind": "string",
            "name": "string",
            "namespace": "string",
            "resourceVersion": "string",
            "uid": "string"
          }
        },
        {
          "hostname": "string",
          "ip": "string",
          "nodeName": "string",
          "targetRef": {
            "apiVersion": "string",
            "fieldPath": "string",
            "kind": "string",
            "name": "string",
            "namespace": "string",
            "resourceVersion": "string",
            "uid": "string"
          }
        }
      ],
      "ports": [
        {
          "name": "string",
          "port": 4,
          "protocol": "string"
        },
        {
          "name": "string",
          "port": 2,
          "protocol": "string"
        },
        {
          "name": "string",
          "port": 5,
          "protocol": "string"
        },
        {
          "name": "string",
          "port": 8,
          "protocol": "string"
        },
        {
          "name": "string",
          "port": 8,
          "protocol": "string"
        },
        {
          "name": "string",
          "port": 4,
          "protocol": "string"
        },
        {
          "name": "string",
          "port": 6,
          "protocol": "string"
        },
        {
          "name": "string",
          "port": 2,
          "protocol": "string"
        },
        {
          "name": "string",
          "port": 5,
          "protocol": "string"
        },
        {
          "name": "string",
          "port": 4,
          "protocol": "string"
        }
      ]
    },
    {
      "addresses": [
        {
          "hostname": "string",
          "ip": "string",
          "nodeName": "string",
          "targetRef": {
            "apiVersion": "string",
            "fieldPath": "string",
            "kind": "string",
            "name": "string",
            "namespace": "string",
            "resourceVersion": "string",
            "uid": "string"
          }
        },
        {
          "hostname": "string",
          "ip": "string",
          "nodeName": "string",
          "targetRef": {
            "apiVersion": "string",
            "fieldPath": "string",
            "kind": "string",
            "name": "string",
            "namespace": "string",
            "resourceVersion": "string",
            "uid": "string"
          }
        },
        {
          "hostname": "string",
          "ip": "string",
          "nodeName": "string",
          "targetRef": {
            "apiVersion": "string",
            "fieldPath": "string",
            "kind": "string",
            "name": "string",
            "namespace": "string",
            "resourceVersion": "string",
            "uid": "string"
          }
        },
        {
          "hostname": "string",
          "ip": "string",
          "nodeName": "string",
          "targetRef": {
            "apiVersion": "string",
            "fieldPath": "string",
            "kind": "string",
            "name": "string",
            "namespace": "string",
            "resourceVersion": "string",
            "uid": "string"
          }
        }
      ],
      "notReadyAddresses": [
        {
          "hostname": "string",
          "ip": "string",
          "nodeName": "string",
          "targetRef": {
            "apiVersion": "string",
            "fieldPath": "string",
            "kind": "string",
            "name": "string",
            "namespace": "string",
            "resourceVersion": "string",
            "uid": "string"
          }
        },
        {
          "hostname": "string",
          "ip": "string",
          "nodeName": "string",
          "targetRef": {
            "apiVersion": "string",
            "fieldPath": "string",
            "kind": "string",
            "name": "string",
            "namespace": "string",
            "resourceVersion": "string",
            "uid": "string"
          }
        }
      ],
      "ports": [
        {
          "name": "string",
          "port": 2,
          "protocol": "string"
        },
        {
          "name": "string",
          "port": 8,
          "protocol": "string"
        },
        {
          "name": "string",
          "port": 10,
          "protocol": "string"
        },
        {
          "name": "string",
          "port": 8,
          "protocol": "string"
        }
      ]
    }
  ]
}