{
  "action": "string",
  "apiVersion": "string",
  "deprecatedCount": 6,
  "deprecatedFirstTimestamp": "string",
  "deprecatedLastTimestamp": "string",
  "deprecatedSource": {
    "component": "string",
    "host": "string"
  },
  "eventTime": "string",
  "kind": "string",
  "metadata": {
    "annotations": {},
    "clusterName": "string",
    "creationTimestamp": "string",
    "deletionGracePeriodSeconds": 9,
    "deletionTimestamp": "string",
    "finalizers": [
      "string",
      "string",
      "string"
    ],
    "generateName": "string",
    "generation": 6,
    "initializers": {
      "pending": [
        {
          "name": "string"
        },
        {
          "name": "string"
        },
        {
          "name": "string"
        },
        {
          "name": "string"
        },
        {
          "name": "string"
        },
        {
          "name": "string"
        },
        {
          "name": "string"
        },
        {
          "name": "string"
        }
      ],
      "result": {
        "apiVersion": "string",
        "code": 3,
        "details": {
          "causes": [
            {
              "field": "string",
              "message": "string",
              "reason": "string"
            },
            {
              "field": "string",
              "message": "string",
              "reason": "string"
            }
          ],
          "group": "string",
          "kind": "string",
          "name": "string",
          "retryAfterSeconds": 10,
          "uid": "string"
        },
        "kind": "string",
        "message": "string",
        "metadata": {
          "continue": "string",
          "remainingItemCount": 6,
          "resourceVersion": "string",
          "selfLink": "string"
        },
        "reason": "string",
        "status": "string"
      }
    },
    "labels": {},
    "managedFields": [
      {
        "apiVersion": "string",
        "fields": {},
        "manager": "string",
        "operation": "string",
        "time": "string"
      },
      {
        "apiVersion": "string",
        "fields": {},
        "manager": "string",
        "operation": "string",
        "time": "string"
      },
      {
        "apiVersion": "string",
        "fields": {},
        "manager": "string",
        "operation": "string",
        "time": "string"
      },
      {
        "apiVersion": "string",
        "fields": {},
        "manager": "string",
        "operation": "string",
        "time": "string"
      },
      {
        "apiVersion": "string",
        "fields": {},
        "manager": "string",
        "operation": "string",
        "time": "string"
      },
      {
        "apiVersion": "string",
        "fields": {},
        "manager": "string",
        "operation": "string",
        "time": "string"
      },
      {
        "apiVersion": "string",
        "fields": {},
        "manager": "string",
        "operation": "string",
        "time": "string"
      },
      {
        "apiVersion": "string",
        "fields": {},
        "manager": "string",
        "operation": "string",
        "time": "string"
      },
      {
        "apiVersion": "string",
        "fields": {},
        "manager": "string",
        "operation": "string",
        "time": "string"
      }
    ],
    "name": "string",
    "namespace": "string",
    "ownerReferences": [
      {
        "apiVersion": "string",
        "blockOwnerDeletion": false,
        "controller": false,
        "kind": "string",
        "name": "string",
        "uid": "string"
      },
      {
        "apiVersion": "string",
        "blockOwnerDeletion": true,
        "controller": false,
        "kind": "string",
        "name": "string",
        "uid": "string"
      },
      {
        "apiVersion": "string",
        "blockOwnerDeletion": true,
        "controller": true,
        "kind": "string",
        "name": "string",
        "uid": "string"
      }
    ],
    "resourceVersion": "string",
    "selfLink": "string",
    "uid": "string"
  },
  "note": "string",
  "reason": "string",
  "regarding": {
    "apiVersion": "string",
    "fieldPath": "string",
    "kind": "string",
    "name": "string",
    "namespace": "string",
    "resourceVersion": "string",
    "uid": "string"
  },
  "related": {
    "apiVersion": "string",
    "fieldPath": "string",
    "kind": "string",
    "name": "string",
    "namespace": "string",
    "resourceVersion": "string",
    "uid": "string"
  },
  "reportingController": "string",
  "reportingInstance": "string",
  "series": {
    "count": 9,
    "lastObservedTime": "string",
    "state": "string"
  },
  "type": "string"
}