{
  "apiVersion": "string",
  "kind": "string",
  "name": "string",
  "preferredVersion": {
    "groupVersion": "string",
    "version": "string"
  },
  "serverAddressByClientCIDRs": [
    {
      "clientCIDR": "string",
      "serverAddress": "string"
    },
    {
      "clientCIDR": "string",
      "serverAddress": "string"
    },
    {
      "clientCIDR": "string",
      "serverAddress": "string"
    },
    {
      "clientCIDR": "string",
      "serverAddress": "string"
    },
    {
      "clientCIDR": "string",
      "serverAddress": "string"
    },
    {
      "clientCIDR": "string",
      "serverAddress": "string"
    },
    {
      "clientCIDR": "string",
      "serverAddress": "string"
    }
  ],
  "versions": [
    {
      "groupVersion": "string",
      "version": "string"
    },
    {
      "groupVersion": "string",
      "version": "string"
    }
  ]
}