{
  "apiVersion": "string",
  "kind": "string",
  "metadata": {
    "annotations": {},
    "clusterName": "string",
    "creationTimestamp": "string",
    "deletionGracePeriodSeconds": 6,
    "deletionTimestamp": "string",
    "finalizers": [
      "string",
      "string",
      "string"
    ],
    "generateName": "string",
    "generation": 5,
    "initializers": {
      "pending": [
        {
          "name": "string"
        },
        {
          "name": "string"
        },
        {
          "name": "string"
        },
        {
          "name": "string"
        },
        {
          "name": "string"
        },
        {
          "name": "string"
        },
        {
          "name": "string"
        },
        {
          "name": "string"
        }
      ],
      "result": {
        "apiVersion": "string",
        "code": 3,
        "details": {
          "causes": [
            {
              "field": "string",
              "message": "string",
              "reason": "string"
            },
            {
              "field": "string",
              "message": "string",
              "reason": "string"
            },
            {
              "field": "string",
              "message": "string",
              "reason": "string"
            },
            {
              "field": "string",
              "message": "string",
              "reason": "string"
            },
            {
              "field": "string",
              "message": "string",
              "reason": "string"
            },
            {
              "field": "string",
              "message": "string",
              "reason": "string"
            },
            {
              "field": "string",
              "message": "string",
              "reason": "string"
            },
            {
              "field": "string",
              "message": "string",
              "reason": "string"
            },
            {
              "field": "string",
              "message": "string",
              "reason": "string"
            },
            {
              "field": "string",
              "message": "string",
              "reason": "string"
            }
          ],
          "group": "string",
          "kind": "string",
          "name": "string",
          "retryAfterSeconds": 3,
          "uid": "string"
        },
        "kind": "string",
        "message": "string",
        "metadata": {
          "continue": "string",
          "remainingItemCount": 4,
          "resourceVersion": "string",
          "selfLink": "string"
        },
        "reason": "string",
        "status": "string"
      }
    },
    "labels": {},
    "managedFields": [
      {
        "apiVersion": "string",
        "fields": {},
        "manager": "string",
        "operation": "string",
        "time": "string"
      },
      {
        "apiVersion": "string",
        "fields": {},
        "manager": "string",
        "operation": "string",
        "time": "string"
      },
      {
        "apiVersion": "string",
        "fields": {},
        "manager": "string",
        "operation": "string",
        "time": "string"
      },
      {
        "apiVersion": "string",
        "fields": {},
        "manager": "string",
        "operation": "string",
        "time": "string"
      },
      {
        "apiVersion": "string",
        "fields": {},
        "manager": "string",
        "operation": "string",
        "time": "string"
      },
      {
        "apiVersion": "string",
        "fields": {},
        "manager": "string",
        "operation": "string",
        "time": "string"
      },
      {
        "apiVersion": "string",
        "fields": {},
        "manager": "string",
        "operation": "string",
        "time": "string"
      }
    ],
    "name": "string",
    "namespace": "string",
    "ownerReferences": [
      {
        "apiVersion": "string",
        "blockOwnerDeletion": false,
        "controller": false,
        "kind": "string",
        "name": "string",
        "uid": "string"
      },
      {
        "apiVersion": "string",
        "blockOwnerDeletion": true,
        "controller": false,
        "kind": "string",
        "name": "string",
        "uid": "string"
      },
      {
        "apiVersion": "string",
        "blockOwnerDeletion": false,
        "controller": true,
        "kind": "string",
        "name": "string",
        "uid": "string"
      },
      {
        "apiVersion": "string",
        "blockOwnerDeletion": false,
        "controller": true,
        "kind": "string",
        "name": "string",
        "uid": "string"
      },
      {
        "apiVersion": "string",
        "blockOwnerDeletion": false,
        "controller": false,
        "kind": "string",
        "name": "string",
        "uid": "string"
      },
      {
        "apiVersion": "string",
        "blockOwnerDeletion": true,
        "controller": false,
        "kind": "string",
        "name": "string",
        "uid": "string"
      }
    ],
    "resourceVersion": "string",
    "selfLink": "string",
    "uid": "string"
  },
  "spec": {
    "accessModes": [
      "string",
      "string",
      "string",
      "string",
      "string",
      "string",
      "string",
      "string",
      "string",
      "string"
    ],
    "awsElasticBlockStore": {
      "fsType": "string",
      "partition": 10,
      "readOnly": true,
      "volumeID": "string"
    },
    "azureDisk": {
      "cachingMode": "string",
      "diskName": "string",
      "diskURI": "string",
      "fsType": "string",
      "kind": "string",
      "readOnly": false
    },
    "azureFile": {
      "readOnly": true,
      "secretName": "string",
      "secretNamespace": "string",
      "shareName": "string"
    },
    "capacity": {},
    "cephfs": {
      "monitors": [
        "string",
        "string",
        "string",
        "string"
      ],
      "path": "string",
      "readOnly": false,
      "secretFile": "string",
      "secretRef": {
        "name": "string",
        "namespace": "string"
      },
      "user": "string"
    },
    "cinder": {
      "fsType": "string",
      "readOnly": true,
      "secretRef": {
        "name": "string",
        "namespace": "string"
      },
      "volumeID": "string"
    },
    "claimRef": {
      "apiVersion": "string",
      "fieldPath": "string",
      "kind": "string",
      "name": "string",
      "namespace": "string",
      "resourceVersion": "string",
      "uid": "string"
    },
    "csi": {
      "controllerExpandSecretRef": {
        "name": "string",
        "namespace": "string"
      },
      "controllerPublishSecretRef": {
        "name": "string",
        "namespace": "string"
      },
      "driver": "string",
      "fsType": "string",
      "nodePublishSecretRef": {
        "name": "string",
        "namespace": "string"
      },
      "nodeStageSecretRef": {
        "name": "string",
        "namespace": "string"
      },
      "readOnly": false,
      "volumeAttributes": {},
      "volumeHandle": "string"
    },
    "fc": {
      "fsType": "string",
      "lun": 6,
      "readOnly": false,
      "targetWWNs": [
        "string",
        "string",
        "string"
      ],
      "wwids": [
        "string",
        "string",
        "string",
        "string",
        "string",
        "string",
        "string"
      ]
    },
    "flexVolume": {
      "driver": "string",
      "fsType": "string",
      "options": {},
      "readOnly": true,
      "secretRef": {
        "name": "string",
        "namespace": "string"
      }
    },
    "flocker": {
      "datasetName": "string",
      "datasetUUID": "string"
    },
    "gcePersistentDisk": {
      "fsType": "string",
      "partition": 9,
      "pdName": "string",
      "readOnly": true
    },
    "glusterfs": {
      "endpoints": "string",
      "endpointsNamespace": "string",
      "path": "string",
      "readOnly": false
    },
    "hostPath": {
      "path": "string",
      "type": "string"
    },
    "iscsi": {
      "chapAuthDiscovery": false,
      "chapAuthSession": true,
      "fsType": "string",
      "initiatorName": "string",
      "iqn": "string",
      "iscsiInterface": "string",
      "lun": 5,
      "portals": [
        "string",
        "string",
        "string",
        "string",
        "string"
      ],
      "readOnly": false,
      "secretRef": {
        "name": "string",
        "namespace": "string"
      },
      "targetPortal": "string"
    },
    "local": {
      "fsType": "string",
      "path": "string"
    },
    "mountOptions": [
      "string",
      "string",
      "string",
      "string",
      "string",
      "string"
    ],
    "nfs": {
      "path": "string",
      "readOnly": true,
      "server": "string"
    },
    "nodeAffinity": {
      "required": {
        "nodeSelectorTerms": [
          {
            "matchExpressions": [
              {
                "key": "string",
                "operator": "string",
                "values": [
                  "string",
                  "string",
                  "string",
                  "string"
                ]
              },
              {
                "key": "string",
                "operator": "string",
                "values": [
                  "string",
                  "string",
                  "string"
                ]
              },
              {
                "key": "string",
                "operator": "string",
                "values": [
                  "string",
                  "string",
                  "string",
                  "string"
                ]
              },
              {
                "key": "string",
                "operator": "string",
                "values": [
                  "string",
                  "string",
                  "string"
                ]
              },
              {
                "key": "string",
                "operator": "string",
                "values": [
                  "string",
                  "string",
                  "string",
                  "string",
                  "string",
                  "string",
                  "string",
                  "string",
                  "string",
                  "string"
                ]
              }
            ],
            "matchFields": [
              {
                "key": "string",
                "operator": "string",
                "values": [
                  "string",
                  "string",
                  "string"
                ]
              },
              {
                "key": "string",
                "operator": "string",
                "values": [
                  "string",
                  "string",
                  "string"
                ]
              },
              {
                "key": "string",
                "operator": "string",
                "values": [
                  "string",
                  "string",
                  "string",
                  "string",
                  "string",
                  "string",
                  "string"
                ]
              }
            ]
          },
          {
            "matchExpressions": [
              {
                "key": "string",
                "operator": "string",
                "values": [
                  "string",
                  "string",
                  "string",
                  "string",
                  "string",
                  "string",
                  "string",
                  "string"
                ]
              },
              {
                "key": "string",
                "operator": "string",
                "values": [
                  "string",
                  "string",
                  "string",
                  "string"
                ]
              }
            ],
            "matchFields": [
              {
                "key": "string",
                "operator": "string",
                "values": [
                  "string"
                ]
              },
              {
                "key": "string",
                "operator": "string",
                "values": [
                  "string",
                  "string",
                  "string",
                  "string",
                  "string",
                  "string",
                  "string",
                  "string",
                  "string"
                ]
              },
              {
                "key": "string",
                "operator": "string",
                "values": [
                  "string",
                  "string",
                  "string",
                  "string"
                ]
              }
            ]
          },
          {
            "matchExpressions": [
              {
                "key": "string",
                "operator": "string",
                "values": [
                  "string",
                  "string",
                  "string"
                ]
              },
              {
                "key": "string",
                "operator": "string",
                "values": [
                  "string",
                  "string",
                  "string",
                  "string",
                  "string",
                  "string",
                  "string",
                  "string",
                  "string"
                ]
              },
              {
                "key": "string",
                "operator": "string",
                "values": [
                  "string",
                  "string",
                  "string",
                  "string",
                  "string",
                  "string",
                  "string"
                ]
              },
              {
                "key": "string",
                "operator": "string",
                "values": [
                  "string",
                  "string",
                  "string",
                  "string",
                  "string"
                ]
              },
              {
                "key": "string",
                "operator": "string",
                "values": [
                  "string",
                  "string",
                  "string",
                  "string",
                  "string"
                ]
              },
              {
                "key": "string",
                "operator": "string",
                "values": [
                  "string",
                  "string",
                  "string",
                  "string",
                  "string",
                  "string"
                ]
              },
              {
                "key": "string",
                "operator": "string",
                "values": [
                  "string",
                  "string",
                  "string",
                  "string",
                  "string",
                  "string",
                  "string"
                ]
              },
              {
                "key": "string",
                "operator": "string",
                "values": [
                  "string",
                  "string",
                  "string",
                  "string",
                  "string"
                ]
              }
            ],
            "matchFields": [
              {
                "key": "string",
                "operator": "string",
                "values": [
                  "string",
                  "string",
                  "string",
                  "string",
                  "string",
                  "string",
                  "string",
                  "string"
                ]
              },
              {
                "key": "string",
                "operator": "string",
                "values": [
                  "string",
                  "string",
                  "string",
                  "string",
                  "string",
                  "string",
                  "string"
                ]
              },
              {
                "key": "string",
                "operator": "string",
                "values": [
                  "string",
                  "string",
                  "string",
                  "string"
                ]
              },
              {
                "key": "string",
                "operator": "string",
                "values": [
                  "string",
                  "string",
                  "string"
                ]
              },
              {
                "key": "string",
                "operator": "string",
                "values": [
                  "string",
                  "string"
                ]
              },
              {
                "key": "string",
                "operator": "string",
                "values": [
                  "string",
                  "string",
                  "string",
                  "string",
                  "string",
                  "string",
                  "string",
                  "string",
                  "string",
                  "string"
                ]
              },
              {
                "key": "string",
                "operator": "string",
                "values": [
                  "string",
                  "string",
                  "string",
                  "string",
                  "string",
                  "string",
                  "string",
                  "string",
                  "string"
                ]
              },
              {
                "key": "string",
                "operator": "string",
                "values": [
                  "string",
                  "string",
                  "string",
                  "string",
                  "string"
                ]
              },
              {
                "key": "string",
                "operator": "string",
                "values": [
                  "string",
                  "string",
                  "string",
                  "string",
                  "string",
                  "string",
                  "string",
                  "string",
                  "string"
                ]
              }
            ]
          }
        ]
      }
    },
    "persistentVolumeReclaimPolicy": "string",
    "photonPersistentDisk": {
      "fsType": "string",
      "pdID": "string"
    },
    "portworxVolume": {
      "fsType": "string",
      "readOnly": true,
      "volumeID": "string"
    },
    "quobyte": {
      "group": "string",
      "readOnly": false,
      "registry": "string",
      "tenant": "string",
      "user": "string",
      "volume": "string"
    },
    "rbd": {
      "fsType": "string",
      "image": "string",
      "keyring": "string",
      "monitors": [
        "string",
        "string",
        "string"
      ],
      "pool": "string",
      "readOnly": true,
      "secretRef": {
        "name": "string",
        "namespace": "string"
      },
      "user": "string"
    },
    "scaleIO": {
      "fsType": "string",
      "gateway": "string",
      "protectionDomain": "string",
      "readOnly": true,
      "secretRef": {
        "name": "string",
        "namespace": "string"
      },
      "sslEnabled": false,
      "storageMode": "string",
      "storagePool": "string",
      "system": "string",
      "volumeName": "string"
    },
    "storageClassName": "string",
    "storageos": {
      "fsType": "string",
      "readOnly": true,
      "secretRef": {
        "apiVersion": "string",
        "fieldPath": "string",
        "kind": "string",
        "name": "string",
        "namespace": "string",
        "resourceVersion": "string",
        "uid": "string"
      },
      "volumeName": "string",
      "volumeNamespace": "string"
    },
    "volumeMode": "string",
    "vsphereVolume": {
      "fsType": "string",
      "storagePolicyID": "string",
      "storagePolicyName": "string",
      "volumePath": "string"
    }
  },
  "status": {
    "message": "string",
    "phase": "string",
    "reason": "string"
  }
}