{
  "apiVersion": "string",
  "kind": "string",
  "metadata": {
    "annotations": {},
    "clusterName": "string",
    "creationTimestamp": "string",
    "deletionGracePeriodSeconds": 4,
    "deletionTimestamp": "string",
    "finalizers": [
      "string",
      "string",
      "string",
      "string",
      "string",
      "string",
      "string",
      "string"
    ],
    "generateName": "string",
    "generation": 7,
    "initializers": {
      "pending": [
        {
          "name": "string"
        },
        {
          "name": "string"
        },
        {
          "name": "string"
        },
        {
          "name": "string"
        },
        {
          "name": "string"
        },
        {
          "name": "string"
        },
        {
          "name": "string"
        },
        {
          "name": "string"
        },
        {
          "name": "string"
        }
      ],
      "result": {
        "apiVersion": "string",
        "code": 9,
        "details": {
          "causes": [
            {
              "field": "string",
              "message": "string",
              "reason": "string"
            },
            {
              "field": "string",
              "message": "string",
              "reason": "string"
            },
            {
              "field": "string",
              "message": "string",
              "reason": "string"
            }
          ],
          "group": "string",
          "kind": "string",
          "name": "string",
          "retryAfterSeconds": 3,
          "uid": "string"
        },
        "kind": "string",
        "message": "string",
        "metadata": {
          "continue": "string",
          "remainingItemCount": 5,
          "resourceVersion": "string",
          "selfLink": "string"
        },
        "reason": "string",
        "status": "string"
      }
    },
    "labels": {},
    "managedFields": [
      {
        "apiVersion": "string",
        "fields": {},
        "manager": "string",
        "operation": "string",
        "time": "string"
      },
      {
        "apiVersion": "string",
        "fields": {},
        "manager": "string",
        "operation": "string",
        "time": "string"
      },
      {
        "apiVersion": "string",
        "fields": {},
        "manager": "string",
        "operation": "string",
        "time": "string"
      },
      {
        "apiVersion": "string",
        "fields": {},
        "manager": "string",
        "operation": "string",
        "time": "string"
      },
      {
        "apiVersion": "string",
        "fields": {},
        "manager": "string",
        "operation": "string",
        "time": "string"
      }
    ],
    "name": "string",
    "namespace": "string",
    "ownerReferences": [
      {
        "apiVersion": "string",
        "blockOwnerDeletion": false,
        "controller": true,
        "kind": "string",
        "name": "string",
        "uid": "string"
      },
      {
        "apiVersion": "string",
        "blockOwnerDeletion": false,
        "controller": false,
        "kind": "string",
        "name": "string",
        "uid": "string"
      },
      {
        "apiVersion": "string",
        "blockOwnerDeletion": false,
        "controller": false,
        "kind": "string",
        "name": "string",
        "uid": "string"
      },
      {
        "apiVersion": "string",
        "blockOwnerDeletion": true,
        "controller": true,
        "kind": "string",
        "name": "string",
        "uid": "string"
      },
      {
        "apiVersion": "string",
        "blockOwnerDeletion": false,
        "controller": true,
        "kind": "string",
        "name": "string",
        "uid": "string"
      },
      {
        "apiVersion": "string",
        "blockOwnerDeletion": false,
        "controller": true,
        "kind": "string",
        "name": "string",
        "uid": "string"
      },
      {
        "apiVersion": "string",
        "blockOwnerDeletion": true,
        "controller": true,
        "kind": "string",
        "name": "string",
        "uid": "string"
      },
      {
        "apiVersion": "string",
        "blockOwnerDeletion": false,
        "controller": false,
        "kind": "string",
        "name": "string",
        "uid": "string"
      },
      {
        "apiVersion": "string",
        "blockOwnerDeletion": true,
        "controller": true,
        "kind": "string",
        "name": "string",
        "uid": "string"
      }
    ],
    "resourceVersion": "string",
    "selfLink": "string",
    "uid": "string"
  },
  "webhooks": [
    {
      "admissionReviewVersions": [
        "string",
        "string",
        "string",
        "string"
      ],
      "clientConfig": {
        "caBundle": "string",
        "service": {
          "name": "string",
          "namespace": "string",
          "path": "string",
          "port": 4
        },
        "url": "string"
      },
      "failurePolicy": "string",
      "name": "string",
      "namespaceSelector": {
        "matchExpressions": [
          {
            "key": "string",
            "operator": "string",
            "values": [
              "string",
              "string"
            ]
          },
          {
            "key": "string",
            "operator": "string",
            "values": [
              "string",
              "string"
            ]
          },
          {
            "key": "string",
            "operator": "string",
            "values": [
              "string"
            ]
          },
          {
            "key": "string",
            "operator": "string",
            "values": [
              "string",
              "string",
              "string",
              "string",
              "string"
            ]
          },
          {
            "key": "string",
            "operator": "string",
            "values": [
              "string",
              "string"
            ]
          },
          {
            "key": "string",
            "operator": "string",
            "values": [
              "string",
              "string",
              "string",
              "string",
              "string",
              "string",
              "string"
            ]
          },
          {
            "key": "string",
            "operator": "string",
            "values": [
              "string",
              "string",
              "string",
              "string",
              "string",
              "string",
              "string",
              "string"
            ]
          },
          {
            "key": "string",
            "operator": "string",
            "values": [
              "string",
              "string",
              "string",
              "string"
            ]
          },
          {
            "key": "string",
            "operator": "string",
            "values": [
              "string",
              "string",
              "string"
            ]
          }
        ],
        "matchLabels": {}
      },
      "rules": [
        {
          "apiGroups": [
            "string",
            "string",
            "string"
          ],
          "apiVersions": [
            "string",
            "string",
            "string",
            "string",
            "string"
          ],
          "operations": [
            "string",
            "string",
            "string",
            "string"
          ],
          "resources": [
            "string",
            "string"
          ],
          "scope": "string"
        },
        {
          "apiGroups": [
            "string",
            "string",
            "string",
            "string",
            "string",
            "string",
            "string",
            "string",
            "string",
            "string"
          ],
          "apiVersions": [
            "string",
            "string",
            "string",
            "string",
            "string",
            "string",
            "string"
          ],
          "operations": [
            "string",
            "string",
            "string",
            "string"
          ],
          "resources": [
            "string",
            "string",
            "string",
            "string",
            "string",
            "string"
          ],
          "scope": "string"
        },
        {
          "apiGroups": [
            "string",
            "string",
            "string",
            "string",
            "string",
            "string",
            "string"
          ],
          "apiVersions": [
            "string",
            "string",
            "string",
            "string",
            "string",
            "string"
          ],
          "operations": [
            "string",
            "string",
            "string",
            "string",
            "string"
          ],
          "resources": [
            "string",
            "string",
            "string"
          ],
          "scope": "string"
        },
        {
          "apiGroups": [
            "string",
            "string"
          ],
          "apiVersions": [
            "string",
            "string",
            "string",
            "string",
            "string",
            "string",
            "string",
            "string",
            "string",
            "string"
          ],
          "operations": [
            "string",
            "string",
            "string",
            "string",
            "string",
            "string",
            "string"
          ],
          "resources": [
            "string",
            "string",
            "string",
            "string",
            "string",
            "string",
            "string",
            "string",
            "string"
          ],
          "scope": "string"
        },
        {
          "apiGroups": [
            "string",
            "string",
            "string",
            "string"
          ],
          "apiVersions": [
            "string",
            "string",
            "string",
            "string",
            "string",
            "string",
            "string"
          ],
          "operations": [
            "string",
            "string",
            "string"
          ],
          "resources": [
            "string"
          ],
          "scope": "string"
        },
        {
          "apiGroups": [
            "string"
          ],
          "apiVersions": [
            "string",
            "string",
            "string",
            "string",
            "string",
            "string",
            "string",
            "string"
          ],
          "operations": [
            "string",
            "string"
          ],
          "resources": [
            "string",
            "string",
            "string",
            "string",
            "string",
            "string",
            "string",
            "string",
            "string"
          ],
          "scope": "string"
        },
        {
          "apiGroups": [
            "string",
            "string",
            "string",
            "string",
            "string",
            "string",
            "string",
            "string"
          ],
          "apiVersions": [
            "string",
            "string",
            "string",
            "string",
            "string",
            "string",
            "string",
            "string",
            "string"
          ],
          "operations": [
            "string"
          ],
          "resources": [
            "string",
            "string",
            "string",
            "string",
            "string",
            "string",
            "string"
          ],
          "scope": "string"
        },
        {
          "apiGroups": [
            "string",
            "string",
            "string",
            "string",
            "string",
            "string",
            "string"
          ],
          "apiVersions": [
            "string",
            "string"
          ],
          "operations": [
            "string",
            "string",
            "string",
            "string"
          ],
          "resources": [
            "string",
            "string",
            "string",
            "string",
            "string",
            "string",
            "string",
            "string",
            "string",
            "string"
          ],
          "scope": "string"
        },
        {
          "apiGroups": [
            "string",
            "string"
          ],
          "apiVersions": [
            "string",
            "string",
            "string",
            "string"
          ],
          "operations": [
            "string",
            "string",
            "string",
            "string",
            "string"
          ],
          "resources": [
            "string",
            "string",
            "string",
            "string",
            "string"
          ],
          "scope": "string"
        }
      ],
      "sideEffects": "string",
      "timeoutSeconds": 10
    },
    {
      "admissionReviewVersions": [
        "string",
        "string",
        "string",
        "string",
        "string",
        "string",
        "string",
        "string",
        "string"
      ],
      "clientConfig": {
        "caBundle": "string",
        "service": {
          "name": "string",
          "namespace": "string",
          "path": "string",
          "port": 7
        },
        "url": "string"
      },
      "failurePolicy": "string",
      "name": "string",
      "namespaceSelector": {
        "matchExpressions": [
          {
            "key": "string",
            "operator": "string",
            "values": [
              "string"
            ]
          },
          {
            "key": "string",
            "operator": "string",
            "values": [
              "string"
            ]
          },
          {
            "key": "string",
            "operator": "string",
            "values": [
              "string",
              "string",
              "string",
              "string",
              "string",
              "string"
            ]
          }
        ],
        "matchLabels": {}
      },
      "rules": [
        {
          "apiGroups": [
            "string",
            "string",
            "string",
            "string",
            "string",
            "string",
            "string",
            "string"
          ],
          "apiVersions": [
            "string",
            "string",
            "string",
            "string",
            "string",
            "string",
            "string",
            "string"
          ],
          "operations": [
            "string",
            "string",
            "string",
            "string",
            "string",
            "string",
            "string",
            "string"
          ],
          "resources": [
            "string",
            "string",
            "string",
            "string",
            "string",
            "string",
            "string",
            "string"
          ],
          "scope": "string"
        },
        {
          "apiGroups": [
            "string",
            "string",
            "string",
            "string"
          ],
          "apiVersions": [
            "string",
            "string",
            "string",
            "string",
            "string",
            "string",
            "string",
            "string",
            "string",
            "string"
          ],
          "operations": [
            "string",
            "string",
            "string",
            "string",
            "string",
            "string",
            "string",
            "string",
            "string"
          ],
          "resources": [
            "string",
            "string",
            "string",
            "string",
            "string",
            "string",
            "string",
            "string",
            "string"
          ],
          "scope": "string"
        }
      ],
      "sideEffects": "string",
      "timeoutSeconds": 9
    },
    {
      "admissionReviewVersions": [
        "string",
        "string",
        "string",
        "string"
      ],
      "clientConfig": {
        "caBundle": "string",
        "service": {
          "name": "string",
          "namespace": "string",
          "path": "string",
          "port": 4
        },
        "url": "string"
      },
      "failurePolicy": "string",
      "name": "string",
      "namespaceSelector": {
        "matchExpressions": [
          {
            "key": "string",
            "operator": "string",
            "values": [
              "string"
            ]
          },
          {
            "key": "string",
            "operator": "string",
            "values": [
              "string",
              "string",
              "string",
              "string",
              "string"
            ]
          },
          {
            "key": "string",
            "operator": "string",
            "values": [
              "string"
            ]
          },
          {
            "key": "string",
            "operator": "string",
            "values": [
              "string",
              "string",
              "string",
              "string"
            ]
          },
          {
            "key": "string",
            "operator": "string",
            "values": [
              "string",
              "string",
              "string",
              "string",
              "string",
              "string",
              "string"
            ]
          },
          {
            "key": "string",
            "operator": "string",
            "values": [
              "string",
              "string",
              "string",
              "string",
              "string",
              "string",
              "string",
              "string",
              "string"
            ]
          },
          {
            "key": "string",
            "operator": "string",
            "values": [
              "string",
              "string",
              "string",
              "string",
              "string",
              "string",
              "string",
              "string",
              "string"
            ]
          },
          {
            "key": "string",
            "operator": "string",
            "values": [
              "string",
              "string",
              "string",
              "string"
            ]
          },
          {
            "key": "string",
            "operator": "string",
            "values": [
              "string"
            ]
          },
          {
            "key": "string",
            "operator": "string",
            "values": [
              "string",
              "string"
            ]
          }
        ],
        "matchLabels": {}
      },
      "rules": [
        {
          "apiGroups": [
            "string",
            "string"
          ],
          "apiVersions": [
            "string",
            "string",
            "string",
            "string"
          ],
          "operations": [
            "string",
            "string",
            "string",
            "string",
            "string",
            "string",
            "string",
            "string",
            "string"
          ],
          "resources": [
            "string",
            "string",
            "string"
          ],
          "scope": "string"
        },
        {
          "apiGroups": [
            "string",
            "string"
          ],
          "apiVersions": [
            "string",
            "string",
            "string",
            "string",
            "string",
            "string"
          ],
          "operations": [
            "string",
            "string",
            "string",
            "string",
            "string"
          ],
          "resources": [
            "string",
            "string",
            "string",
            "string",
            "string",
            "string",
            "string",
            "string",
            "string"
          ],
          "scope": "string"
        },
        {
          "apiGroups": [
            "string",
            "string",
            "string",
            "string",
            "string",
            "string"
          ],
          "apiVersions": [
            "string",
            "string",
            "string",
            "string",
            "string",
            "string"
          ],
          "operations": [
            "string",
            "string",
            "string",
            "string",
            "string",
            "string",
            "string",
            "string",
            "string",
            "string"
          ],
          "resources": [
            "string",
            "string",
            "string",
            "string",
            "string",
            "string",
            "string",
            "string"
          ],
          "scope": "string"
        },
        {
          "apiGroups": [
            "string",
            "string",
            "string",
            "string",
            "string",
            "string"
          ],
          "apiVersions": [
            "string",
            "string"
          ],
          "operations": [
            "string",
            "string",
            "string",
            "string",
            "string",
            "string",
            "string",
            "string",
            "string",
            "string"
          ],
          "resources": [
            "string",
            "string",
            "string",
            "string",
            "string",
            "string",
            "string"
          ],
          "scope": "string"
        }
      ],
      "sideEffects": "string",
      "timeoutSeconds": 5
    },
    {
      "admissionReviewVersions": [
        "string",
        "string"
      ],
      "clientConfig": {
        "caBundle": "string",
        "service": {
          "name": "string",
          "namespace": "string",
          "path": "string",
          "port": 7
        },
        "url": "string"
      },
      "failurePolicy": "string",
      "name": "string",
      "namespaceSelector": {
        "matchExpressions": [
          {
            "key": "string",
            "operator": "string",
            "values": [
              "string",
              "string"
            ]
          },
          {
            "key": "string",
            "operator": "string",
            "values": [
              "string",
              "string",
              "string",
              "string",
              "string",
              "string"
            ]
          }
        ],
        "matchLabels": {}
      },
      "rules": [
        {
          "apiGroups": [
            "string",
            "string"
          ],
          "apiVersions": [
            "string",
            "string",
            "string",
            "string",
            "string",
            "string",
            "string",
            "string",
            "string"
          ],
          "operations": [
            "string",
            "string",
            "string",
            "string",
            "string",
            "string",
            "string",
            "string",
            "string"
          ],
          "resources": [
            "string",
            "string",
            "string",
            "string",
            "string",
            "string",
            "string"
          ],
          "scope": "string"
        }
      ],
      "sideEffects": "string",
      "timeoutSeconds": 4
    }
  ]
}