{
  "allowVolumeExpansion": true,
  "allowedTopologies": [
    {
      "matchLabelExpressions": [
        {
          "key": "string",
          "values": [
            "string",
            "string",
            "string",
            "string",
            "string",
            "string",
            "string",
            "string"
          ]
        },
        {
          "key": "string",
          "values": [
            "string",
            "string",
            "string",
            "string",
            "string",
            "string",
            "string",
            "string"
          ]
        },
        {
          "key": "string",
          "values": [
            "string",
            "string",
            "string",
            "string",
            "string"
          ]
        },
        {
          "key": "string",
          "values": [
            "string",
            "string",
            "string",
            "string",
            "string",
            "string",
            "string",
            "string",
            "string"
          ]
        },
        {
          "key": "string",
          "values": [
            "string",
            "string",
            "string",
            "string",
            "string",
            "string"
          ]
        },
        {
          "key": "string",
          "values": [
            "string",
            "string",
            "string",
            "string",
            "string",
            "string",
            "string",
            "string"
          ]
        },
        {
          "key": "string",
          "values": [
            "string",
            "string",
            "string",
            "string",
            "string",
            "string",
            "string",
            "string",
            "string",
            "string"
          ]
        },
        {
          "key": "string",
          "values": [
            "string"
          ]
        },
        {
          "key": "string",
          "values": [
            "string",
            "string",
            "string"
          ]
        }
      ]
    },
    {
      "matchLabelExpressions": [
        {
          "key": "string",
          "values": [
            "string",
            "string",
            "string",
            "string",
            "string",
            "string",
            "string"
          ]
        },
        {
          "key": "string",
          "values": [
            "string",
            "string",
            "string",
            "string",
            "string",
            "string",
            "string",
            "string"
          ]
        },
        {
          "key": "string",
          "values": [
            "string"
          ]
        },
        {
          "key": "string",
          "values": [
            "string",
            "string",
            "string"
          ]
        }
      ]
    }
  ],
  "apiVersion": "string",
  "kind": "string",
  "metadata": {
    "annotations": {},
    "clusterName": "string",
    "creationTimestamp": "string",
    "deletionGracePeriodSeconds": 5,
    "deletionTimestamp": "string",
    "finalizers": [
      "string",
      "string",
      "string",
      "string",
      "string",
      "string",
      "string",
      "string"
    ],
    "generateName": "string",
    "generation": 10,
    "initializers": {
      "pending": [
        {
          "name": "string"
        },
        {
          "name": "string"
        },
        {
          "name": "string"
        },
        {
          "name": "string"
        },
        {
          "name": "string"
        },
        {
          "name": "string"
        },
        {
          "name": "string"
        },
        {
          "name": "string"
        },
        {
          "name": "string"
        }
      ],
      "result": {
        "apiVersion": "string",
        "code": 7,
        "details": {
          "causes": [
            {
              "field": "string",
              "message": "string",
              "reason": "string"
            },
            {
              "field": "string",
              "message": "string",
              "reason": "string"
            },
            {
              "field": "string",
              "message": "string",
              "reason": "string"
            },
            {
              "field": "string",
              "message": "string",
              "reason": "string"
            },
            {
              "field": "string",
              "message": "string",
              "reason": "string"
            },
            {
              "field": "string",
              "message": "string",
              "reason": "string"
            },
            {
              "field": "string",
              "message": "string",
              "reason": "string"
            },
            {
              "field": "string",
              "message": "string",
              "reason": "string"
            }
          ],
          "group": "string",
          "kind": "string",
          "name": "string",
          "retryAfterSeconds": 1,
          "uid": "string"
        },
        "kind": "string",
        "message": "string",
        "metadata": {
          "continue": "string",
          "remainingItemCount": 5,
          "resourceVersion": "string",
          "selfLink": "string"
        },
        "reason": "string",
        "status": "string"
      }
    },
    "labels": {},
    "managedFields": [
      {
        "apiVersion": "string",
        "fields": {},
        "manager": "string",
        "operation": "string",
        "time": "string"
      },
      {
        "apiVersion": "string",
        "fields": {},
        "manager": "string",
        "operation": "string",
        "time": "string"
      },
      {
        "apiVersion": "string",
        "fields": {},
        "manager": "string",
        "operation": "string",
        "time": "string"
      },
      {
        "apiVersion": "string",
        "fields": {},
        "manager": "string",
        "operation": "string",
        "time": "string"
      },
      {
        "apiVersion": "string",
        "fields": {},
        "manager": "string",
        "operation": "string",
        "time": "string"
      },
      {
        "apiVersion": "string",
        "fields": {},
        "manager": "string",
        "operation": "string",
        "time": "string"
      }
    ],
    "name": "string",
    "namespace": "string",
    "ownerReferences": [
      {
        "apiVersion": "string",
        "blockOwnerDeletion": true,
        "controller": false,
        "kind": "string",
        "name": "string",
        "uid": "string"
      }
    ],
    "resourceVersion": "string",
    "selfLink": "string",
    "uid": "string"
  },
  "mountOptions": [
    "string",
    "string"
  ],
  "parameters": {},
  "provisioner": "string",
  "reclaimPolicy": "string",
  "volumeBindingMode": "string"
}