{
  "apiVersion": "string",
  "kind": "string",
  "metadata": {
    "annotations": {},
    "clusterName": "string",
    "creationTimestamp": "string",
    "deletionGracePeriodSeconds": 7,
    "deletionTimestamp": "string",
    "finalizers": [
      "string",
      "string",
      "string"
    ],
    "generateName": "string",
    "generation": 1,
    "initializers": {
      "pending": [
        {
          "name": "string"
        },
        {
          "name": "string"
        },
        {
          "name": "string"
        },
        {
          "name": "string"
        }
      ],
      "result": {
        "apiVersion": "string",
        "code": 4,
        "details": {
          "causes": [
            {
              "field": "string",
              "message": "string",
              "reason": "string"
            },
            {
              "field": "string",
              "message": "string",
              "reason": "string"
            },
            {
              "field": "string",
              "message": "string",
              "reason": "string"
            },
            {
              "field": "string",
              "message": "string",
              "reason": "string"
            }
          ],
          "group": "string",
          "kind": "string",
          "name": "string",
          "retryAfterSeconds": 2,
          "uid": "string"
        },
        "kind": "string",
        "message": "string",
        "metadata": {
          "continue": "string",
          "remainingItemCount": 6,
          "resourceVersion": "string",
          "selfLink": "string"
        },
        "reason": "string",
        "status": "string"
      }
    },
    "labels": {},
    "managedFields": [
      {
        "apiVersion": "string",
        "fields": {},
        "manager": "string",
        "operation": "string",
        "time": "string"
      },
      {
        "apiVersion": "string",
        "fields": {},
        "manager": "string",
        "operation": "string",
        "time": "string"
      }
    ],
    "name": "string",
    "namespace": "string",
    "ownerReferences": [
      {
        "apiVersion": "string",
        "blockOwnerDeletion": true,
        "controller": false,
        "kind": "string",
        "name": "string",
        "uid": "string"
      },
      {
        "apiVersion": "string",
        "blockOwnerDeletion": true,
        "controller": true,
        "kind": "string",
        "name": "string",
        "uid": "string"
      },
      {
        "apiVersion": "string",
        "blockOwnerDeletion": true,
        "controller": true,
        "kind": "string",
        "name": "string",
        "uid": "string"
      },
      {
        "apiVersion": "string",
        "blockOwnerDeletion": false,
        "controller": true,
        "kind": "string",
        "name": "string",
        "uid": "string"
      },
      {
        "apiVersion": "string",
        "blockOwnerDeletion": true,
        "controller": false,
        "kind": "string",
        "name": "string",
        "uid": "string"
      },
      {
        "apiVersion": "string",
        "blockOwnerDeletion": false,
        "controller": true,
        "kind": "string",
        "name": "string",
        "uid": "string"
      },
      {
        "apiVersion": "string",
        "blockOwnerDeletion": true,
        "controller": true,
        "kind": "string",
        "name": "string",
        "uid": "string"
      },
      {
        "apiVersion": "string",
        "blockOwnerDeletion": true,
        "controller": false,
        "kind": "string",
        "name": "string",
        "uid": "string"
      },
      {
        "apiVersion": "string",
        "blockOwnerDeletion": false,
        "controller": true,
        "kind": "string",
        "name": "string",
        "uid": "string"
      },
      {
        "apiVersion": "string",
        "blockOwnerDeletion": false,
        "controller": false,
        "kind": "string",
        "name": "string",
        "uid": "string"
      }
    ],
    "resourceVersion": "string",
    "selfLink": "string",
    "uid": "string"
  },
  "spec": {
    "backend": {
      "serviceName": "string",
      "servicePort": "string"
    },
    "rules": [
      {
        "host": "string",
        "http": {
          "paths": [
            {
              "backend": {
                "serviceName": "string",
                "servicePort": "string"
              },
              "path": "string"
            },
            {
              "backend": {
                "serviceName": "string",
                "servicePort": "string"
              },
              "path": "string"
            },
            {
              "backend": {
                "serviceName": "string",
                "servicePort": "string"
              },
              "path": "string"
            },
            {
              "backend": {
                "serviceName": "string",
                "servicePort": "string"
              },
              "path": "string"
            },
            {
              "backend": {
                "serviceName": "string",
                "servicePort": "string"
              },
              "path": "string"
            },
            {
              "backend": {
                "serviceName": "string",
                "servicePort": "string"
              },
              "path": "string"
            }
          ]
        }
      },
      {
        "host": "string",
        "http": {
          "paths": [
            {
              "backend": {
                "serviceName": "string",
                "servicePort": "string"
              },
              "path": "string"
            },
            {
              "backend": {
                "serviceName": "string",
                "servicePort": "string"
              },
              "path": "string"
            },
            {
              "backend": {
                "serviceName": "string",
                "servicePort": "string"
              },
              "path": "string"
            },
            {
              "backend": {
                "serviceName": "string",
                "servicePort": "string"
              },
              "path": "string"
            },
            {
              "backend": {
                "serviceName": "string",
                "servicePort": "string"
              },
              "path": "string"
            },
            {
              "backend": {
                "serviceName": "string",
                "servicePort": "string"
              },
              "path": "string"
            },
            {
              "backend": {
                "serviceName": "string",
                "servicePort": "string"
              },
              "path": "string"
            }
          ]
        }
      },
      {
        "host": "string",
        "http": {
          "paths": [
            {
              "backend": {
                "serviceName": "string",
                "servicePort": "string"
              },
              "path": "string"
            },
            {
              "backend": {
                "serviceName": "string",
                "servicePort": "string"
              },
              "path": "string"
            },
            {
              "backend": {
                "serviceName": "string",
                "servicePort": "string"
              },
              "path": "string"
            },
            {
              "backend": {
                "serviceName": "string",
                "servicePort": "string"
              },
              "path": "string"
            },
            {
              "backend": {
                "serviceName": "string",
                "servicePort": "string"
              },
              "path": "string"
            },
            {
              "backend": {
                "serviceName": "string",
                "servicePort": "string"
              },
              "path": "string"
            },
            {
              "backend": {
                "serviceName": "string",
                "servicePort": "string"
              },
              "path": "string"
            },
            {
              "backend": {
                "serviceName": "string",
                "servicePort": "string"
              },
              "path": "string"
            },
            {
              "backend": {
                "serviceName": "string",
                "servicePort": "string"
              },
              "path": "string"
            },
            {
              "backend": {
                "serviceName": "string",
                "servicePort": "string"
              },
              "path": "string"
            }
          ]
        }
      },
      {
        "host": "string",
        "http": {
          "paths": [
            {
              "backend": {
                "serviceName": "string",
                "servicePort": "string"
              },
              "path": "string"
            },
            {
              "backend": {
                "serviceName": "string",
                "servicePort": "string"
              },
              "path": "string"
            },
            {
              "backend": {
                "serviceName": "string",
                "servicePort": "string"
              },
              "path": "string"
            },
            {
              "backend": {
                "serviceName": "string",
                "servicePort": "string"
              },
              "path": "string"
            },
            {
              "backend": {
                "serviceName": "string",
                "servicePort": "string"
              },
              "path": "string"
            },
            {
              "backend": {
                "serviceName": "string",
                "servicePort": "string"
              },
              "path": "string"
            },
            {
              "backend": {
                "serviceName": "string",
                "servicePort": "string"
              },
              "path": "string"
            },
            {
              "backend": {
                "serviceName": "string",
                "servicePort": "string"
              },
              "path": "string"
            }
          ]
        }
      },
      {
        "host": "string",
        "http": {
          "paths": [
            {
              "backend": {
                "serviceName": "string",
                "servicePort": "string"
              },
              "path": "string"
            },
            {
              "backend": {
                "serviceName": "string",
                "servicePort": "string"
              },
              "path": "string"
            },
            {
              "backend": {
                "serviceName": "string",
                "servicePort": "string"
              },
              "path": "string"
            },
            {
              "backend": {
                "serviceName": "string",
                "servicePort": "string"
              },
              "path": "string"
            },
            {
              "backend": {
                "serviceName": "string",
                "servicePort": "string"
              },
              "path": "string"
            },
            {
              "backend": {
                "serviceName": "string",
                "servicePort": "string"
              },
              "path": "string"
            },
            {
              "backend": {
                "serviceName": "string",
                "servicePort": "string"
              },
              "path": "string"
            },
            {
              "backend": {
                "serviceName": "string",
                "servicePort": "string"
              },
              "path": "string"
            },
            {
              "backend": {
                "serviceName": "string",
                "servicePort": "string"
              },
              "path": "string"
            }
          ]
        }
      },
      {
        "host": "string",
        "http": {
          "paths": [
            {
              "backend": {
                "serviceName": "string",
                "servicePort": "string"
              },
              "path": "string"
            },
            {
              "backend": {
                "serviceName": "string",
                "servicePort": "string"
              },
              "path": "string"
            },
            {
              "backend": {
                "serviceName": "string",
                "servicePort": "string"
              },
              "path": "string"
            },
            {
              "backend": {
                "serviceName": "string",
                "servicePort": "string"
              },
              "path": "string"
            }
          ]
        }
      },
      {
        "host": "string",
        "http": {
          "paths": [
            {
              "backend": {
                "serviceName": "string",
                "servicePort": "string"
              },
              "path": "string"
            },
            {
              "backend": {
                "serviceName": "string",
                "servicePort": "string"
              },
              "path": "string"
            },
            {
              "backend": {
                "serviceName": "string",
                "servicePort": "string"
              },
              "path": "string"
            }
          ]
        }
      }
    ],
    "tls": [
      {
        "hosts": [
          "string",
          "string",
          "string",
          "string",
          "string"
        ],
        "secretName": "string"
      },
      {
        "hosts": [
          "string"
        ],
        "secretName": "string"
      },
      {
        "hosts": [
          "string",
          "string",
          "string",
          "string",
          "string",
          "string"
        ],
        "secretName": "string"
      },
      {
        "hosts": [
          "string",
          "string",
          "string",
          "string",
          "string"
        ],
        "secretName": "string"
      },
      {
        "hosts": [
          "string",
          "string"
        ],
        "secretName": "string"
      },
      {
        "hosts": [
          "string",
          "string",
          "string",
          "string",
          "string",
          "string",
          "string",
          "string",
          "string",
          "string"
        ],
        "secretName": "string"
      },
      {
        "hosts": [
          "string",
          "string"
        ],
        "secretName": "string"
      },
      {
        "hosts": [
          "string",
          "string",
          "string"
        ],
        "secretName": "string"
      },
      {
        "hosts": [
          "string",
          "string",
          "string",
          "string",
          "string",
          "string",
          "string",
          "string"
        ],
        "secretName": "string"
      }
    ]
  },
  "status": {
    "loadBalancer": {
      "ingress": [
        {
          "hostname": "string",
          "ip": "string"
        },
        {
          "hostname": "string",
          "ip": "string"
        },
        {
          "hostname": "string",
          "ip": "string"
        },
        {
          "hostname": "string",
          "ip": "string"
        },
        {
          "hostname": "string",
          "ip": "string"
        }
      ]
    }
  }
}