{
  "id": "string",
  "items": [
    {
      "creationTimestamp": "string",
      "description": "string",
      "fingerprint": "string",
      "id": "string",
      "kind": "compute#instanceGroup",
      "name": "string",
      "namedPorts": [
        {
          "name": "string",
          "port": 8
        },
        {
          "name": "string",
          "port": 4
        },
        {
          "name": "string",
          "port": 4
        },
        {
          "name": "string",
          "port": 9
        },
        {
          "name": "string",
          "port": 4
        },
        {
          "name": "string",
          "port": 6
        },
        {
          "name": "string",
          "port": 6
        }
      ],
      "network": "string",
      "region": "string",
      "selfLink": "string",
      "size": 2,
      "subnetwork": "string",
      "zone": "string"
    }
  ],
  "kind": "compute#regionInstanceGroupList",
  "nextPageToken": "string",
  "selfLink": "string",
  "warning": {
    "code": "EXPERIMENTAL_TYPE_USED",
    "data": [
      {
        "key": "string",
        "value": "string"
      },
      {
        "key": "string",
        "value": "string"
      },
      {
        "key": "string",
        "value": "string"
      },
      {
        "key": "string",
        "value": "string"
      },
      {
        "key": "string",
        "value": "string"
      },
      {
        "key": "string",
        "value": "string"
      },
      {
        "key": "string",
        "value": "string"
      },
      {
        "key": "string",
        "value": "string"
      }
    ],
    "message": "string"
  }
}