{
  "id": "string",
  "items": [
    {
      "creationTimestamp": "string",
      "description": "string",
      "id": "string",
      "kind": "compute#targetSslProxy",
      "name": "string",
      "proxyHeader": "PROXY_V1",
      "selfLink": "string",
      "service": "string",
      "sslCertificates": [
        "string",
        "string",
        "string",
        "string",
        "string",
        "string",
        "string"
      ],
      "sslPolicy": "string"
    }
  ],
  "kind": "compute#targetSslProxyList",
  "nextPageToken": "string",
  "selfLink": "string",
  "warning": {
    "code": "NEXT_HOP_ADDRESS_NOT_ASSIGNED",
    "data": [
      {
        "key": "string",
        "value": "string"
      },
      {
        "key": "string",
        "value": "string"
      },
      {
        "key": "string",
        "value": "string"
      },
      {
        "key": "string",
        "value": "string"
      },
      {
        "key": "string",
        "value": "string"
      },
      {
        "key": "string",
        "value": "string"
      },
      {
        "key": "string",
        "value": "string"
      }
    ],
    "message": "string"
  }
}