{
  "actions": [
    {
      "name": "getProjectGlobalLicenseCodesLicenseCode",
      "protocol": "REST",
      "method": "GET",
      "entitypath": "{base_path}/{version}/projects/{pathv1}/global/licenseCodes/{pathv2}?{query}",
      "requestSchema": "schema.json",
      "responseSchema": "schema.json",
      "timeout": 0,
      "sendEmpty": false,
      "sendGetBody": false,
      "requestDatatype": "JSON",
      "responseDatatype": "JSON",
      "headers": {},
      "responseObjects": [
        {
          "type": "default",
          "key": "",
          "mockFile": "mockdatafiles/getProjectGlobalLicenseCodesLicenseCode-default.json"
        }
      ]
    },
    {
      "name": "postProjectGlobalLicenseCodesResourceTestIamPermissions",
      "protocol": "REST",
      "method": "POST",
      "entitypath": "{base_path}/{version}/projects/{pathv1}/global/licenseCodes/{pathv2}/testIamPermissions?{query}",
      "requestSchema": "schema.json",
      "responseSchema": "schema.json",
      "timeout": 0,
      "sendEmpty": false,
      "requestDatatype": "JSON",
      "responseDatatype": "JSON",
      "headers": {},
      "responseObjects": [
        {
          "type": "default",
          "key": "",
          "mockFile": "mockdatafiles/postProjectGlobalLicenseCodesResourceTestIamPermissions-default.json"
        }
      ]
    }
  ]
}