{
  "IPAddress": "string",
  "IPProtocol": "UDP",
  "allPorts": true,
  "allowGlobalAccess": true,
  "backendService": "string",
  "creationTimestamp": "string",
  "description": "string",
  "fingerprint": "string",
  "id": "string",
  "ipVersion": "IPV4",
  "isMirroringCollector": false,
  "kind": "compute#forwardingRule",
  "loadBalancingScheme": "EXTERNAL",
  "metadataFilters": [
    {
      "filterLabels": [
        {
          "name": "string",
          "value": "string"
        },
        {
          "name": "string",
          "value": "string"
        },
        {
          "name": "string",
          "value": "string"
        },
        {
          "name": "string",
          "value": "string"
        },
        {
          "name": "string",
          "value": "string"
        },
        {
          "name": "string",
          "value": "string"
        },
        {
          "name": "string",
          "value": "string"
        },
        {
          "name": "string",
          "value": "string"
        },
        {
          "name": "string",
          "value": "string"
        },
        {
          "name": "string",
          "value": "string"
        }
      ],
      "filterMatchCriteria": "MATCH_ALL"
    }
  ],
  "name": "string",
  "network": "string",
  "networkTier": "STANDARD",
  "portRange": "string",
  "ports": [
    "string",
    "string",
    "string",
    "string",
    "string",
    "string",
    "string",
    "string"
  ],
  "region": "string",
  "selfLink": "string",
  "serviceLabel": "string",
  "serviceName": "string",
  "subnetwork": "string",
  "target": "string"
}