{
  "id": "string",
  "items": [
    {
      "checkIntervalSec": 10,
      "creationTimestamp": "string",
      "description": "string",
      "grpcHealthCheck": {
        "grpcServiceName": "string",
        "port": 7,
        "portName": "string",
        "portSpecification": "USE_SERVING_PORT"
      },
      "healthyThreshold": 6,
      "http2HealthCheck": {
        "host": "string",
        "port": 7,
        "portName": "string",
        "portSpecification": "USE_NAMED_PORT",
        "proxyHeader": "NONE",
        "requestPath": "string",
        "response": "string"
      },
      "httpHealthCheck": {
        "host": "string",
        "port": 1,
        "portName": "string",
        "portSpecification": "USE_SERVING_PORT",
        "proxyHeader": "NONE",
        "requestPath": "string",
        "response": "string"
      },
      "httpsHealthCheck": {
        "host": "string",
        "port": 5,
        "portName": "string",
        "portSpecification": "USE_SERVING_PORT",
        "proxyHeader": "NONE",
        "requestPath": "string",
        "response": "string"
      },
      "id": "string",
      "kind": "compute#healthCheck",
      "name": "string",
      "region": "string",
      "selfLink": "string",
      "sslHealthCheck": {
        "port": 3,
        "portName": "string",
        "portSpecification": "USE_SERVING_PORT",
        "proxyHeader": "PROXY_V1",
        "request": "string",
        "response": "string"
      },
      "tcpHealthCheck": {
        "port": 7,
        "portName": "string",
        "portSpecification": "USE_SERVING_PORT",
        "proxyHeader": "PROXY_V1",
        "request": "string",
        "response": "string"
      },
      "timeoutSec": 2,
      "type": "HTTP2",
      "unhealthyThreshold": 8
    },
    {
      "checkIntervalSec": 4,
      "creationTimestamp": "string",
      "description": "string",
      "grpcHealthCheck": {
        "grpcServiceName": "string",
        "port": 3,
        "portName": "string",
        "portSpecification": "USE_NAMED_PORT"
      },
      "healthyThreshold": 8,
      "http2HealthCheck": {
        "host": "string",
        "port": 10,
        "portName": "string",
        "portSpecification": "USE_FIXED_PORT",
        "proxyHeader": "NONE",
        "requestPath": "string",
        "response": "string"
      },
      "httpHealthCheck": {
        "host": "string",
        "port": 2,
        "portName": "string",
        "portSpecification": "USE_SERVING_PORT",
        "proxyHeader": "NONE",
        "requestPath": "string",
        "response": "string"
      },
      "httpsHealthCheck": {
        "host": "string",
        "port": 6,
        "portName": "string",
        "portSpecification": "USE_SERVING_PORT",
        "proxyHeader": "NONE",
        "requestPath": "string",
        "response": "string"
      },
      "id": "string",
      "kind": "compute#healthCheck",
      "name": "string",
      "region": "string",
      "selfLink": "string",
      "sslHealthCheck": {
        "port": 8,
        "portName": "string",
        "portSpecification": "USE_NAMED_PORT",
        "proxyHeader": "NONE",
        "request": "string",
        "response": "string"
      },
      "tcpHealthCheck": {
        "port": 7,
        "portName": "string",
        "portSpecification": "USE_FIXED_PORT",
        "proxyHeader": "NONE",
        "request": "string",
        "response": "string"
      },
      "timeoutSec": 10,
      "type": "HTTP2",
      "unhealthyThreshold": 10
    },
    {
      "checkIntervalSec": 1,
      "creationTimestamp": "string",
      "description": "string",
      "grpcHealthCheck": {
        "grpcServiceName": "string",
        "port": 5,
        "portName": "string",
        "portSpecification": "USE_SERVING_PORT"
      },
      "healthyThreshold": 5,
      "http2HealthCheck": {
        "host": "string",
        "port": 4,
        "portName": "string",
        "portSpecification": "USE_SERVING_PORT",
        "proxyHeader": "NONE",
        "requestPath": "string",
        "response": "string"
      },
      "httpHealthCheck": {
        "host": "string",
        "port": 10,
        "portName": "string",
        "portSpecification": "USE_SERVING_PORT",
        "proxyHeader": "PROXY_V1",
        "requestPath": "string",
        "response": "string"
      },
      "httpsHealthCheck": {
        "host": "string",
        "port": 6,
        "portName": "string",
        "portSpecification": "USE_SERVING_PORT",
        "proxyHeader": "NONE",
        "requestPath": "string",
        "response": "string"
      },
      "id": "string",
      "kind": "compute#healthCheck",
      "name": "string",
      "region": "string",
      "selfLink": "string",
      "sslHealthCheck": {
        "port": 2,
        "portName": "string",
        "portSpecification": "USE_SERVING_PORT",
        "proxyHeader": "NONE",
        "request": "string",
        "response": "string"
      },
      "tcpHealthCheck": {
        "port": 8,
        "portName": "string",
        "portSpecification": "USE_SERVING_PORT",
        "proxyHeader": "PROXY_V1",
        "request": "string",
        "response": "string"
      },
      "timeoutSec": 2,
      "type": "SSL",
      "unhealthyThreshold": 2
    },
    {
      "checkIntervalSec": 3,
      "creationTimestamp": "string",
      "description": "string",
      "grpcHealthCheck": {
        "grpcServiceName": "string",
        "port": 6,
        "portName": "string",
        "portSpecification": "USE_NAMED_PORT"
      },
      "healthyThreshold": 7,
      "http2HealthCheck": {
        "host": "string",
        "port": 5,
        "portName": "string",
        "portSpecification": "USE_SERVING_PORT",
        "proxyHeader": "PROXY_V1",
        "requestPath": "string",
        "response": "string"
      },
      "httpHealthCheck": {
        "host": "string",
        "port": 6,
        "portName": "string",
        "portSpecification": "USE_FIXED_PORT",
        "proxyHeader": "NONE",
        "requestPath": "string",
        "response": "string"
      },
      "httpsHealthCheck": {
        "host": "string",
        "port": 1,
        "portName": "string",
        "portSpecification": "USE_FIXED_PORT",
        "proxyHeader": "PROXY_V1",
        "requestPath": "string",
        "response": "string"
      },
      "id": "string",
      "kind": "compute#healthCheck",
      "name": "string",
      "region": "string",
      "selfLink": "string",
      "sslHealthCheck": {
        "port": 3,
        "portName": "string",
        "portSpecification": "USE_SERVING_PORT",
        "proxyHeader": "PROXY_V1",
        "request": "string",
        "response": "string"
      },
      "tcpHealthCheck": {
        "port": 2,
        "portName": "string",
        "portSpecification": "USE_FIXED_PORT",
        "proxyHeader": "NONE",
        "request": "string",
        "response": "string"
      },
      "timeoutSec": 2,
      "type": "GRPC",
      "unhealthyThreshold": 6
    }
  ],
  "kind": "compute#healthCheckList",
  "nextPageToken": "string",
  "selfLink": "string",
  "warning": {
    "code": "REQUIRED_TOS_AGREEMENT",
    "data": [
      {
        "key": "string",
        "value": "string"
      },
      {
        "key": "string",
        "value": "string"
      },
      {
        "key": "string",
        "value": "string"
      },
      {
        "key": "string",
        "value": "string"
      },
      {
        "key": "string",
        "value": "string"
      },
      {
        "key": "string",
        "value": "string"
      },
      {
        "key": "string",
        "value": "string"
      },
      {
        "key": "string",
        "value": "string"
      }
    ],
    "message": "string"
  }
}