{
  "creationTimestamp": "string",
  "description": "string",
  "fingerprint": "string",
  "id": "string",
  "kind": "compute#instanceGroup",
  "name": "string",
  "namedPorts": [
    {
      "name": "string",
      "port": 7
    },
    {
      "name": "string",
      "port": 8
    }
  ],
  "network": "string",
  "region": "string",
  "selfLink": "string",
  "size": 2,
  "subnetwork": "string",
  "zone": "string"
}