{
  "id": "string",
  "items": [
    {
      "creationTimestamp": "string",
      "description": "string",
      "forwardingRules": [
        "string",
        "string"
      ],
      "id": "string",
      "kind": "compute#targetVpnGateway",
      "name": "string",
      "network": "string",
      "region": "string",
      "selfLink": "string",
      "status": "CREATING",
      "tunnels": [
        "string"
      ]
    },
    {
      "creationTimestamp": "string",
      "description": "string",
      "forwardingRules": [
        "string",
        "string",
        "string"
      ],
      "id": "string",
      "kind": "compute#targetVpnGateway",
      "name": "string",
      "network": "string",
      "region": "string",
      "selfLink": "string",
      "status": "READY",
      "tunnels": [
        "string",
        "string",
        "string",
        "string",
        "string",
        "string",
        "string",
        "string",
        "string"
      ]
    },
    {
      "creationTimestamp": "string",
      "description": "string",
      "forwardingRules": [
        "string",
        "string",
        "string",
        "string",
        "string",
        "string",
        "string",
        "string"
      ],
      "id": "string",
      "kind": "compute#targetVpnGateway",
      "name": "string",
      "network": "string",
      "region": "string",
      "selfLink": "string",
      "status": "CREATING",
      "tunnels": [
        "string",
        "string",
        "string",
        "string",
        "string",
        "string",
        "string",
        "string",
        "string",
        "string"
      ]
    },
    {
      "creationTimestamp": "string",
      "description": "string",
      "forwardingRules": [
        "string",
        "string",
        "string",
        "string",
        "string",
        "string",
        "string"
      ],
      "id": "string",
      "kind": "compute#targetVpnGateway",
      "name": "string",
      "network": "string",
      "region": "string",
      "selfLink": "string",
      "status": "READY",
      "tunnels": [
        "string",
        "string",
        "string",
        "string"
      ]
    },
    {
      "creationTimestamp": "string",
      "description": "string",
      "forwardingRules": [
        "string",
        "string",
        "string",
        "string",
        "string",
        "string",
        "string",
        "string"
      ],
      "id": "string",
      "kind": "compute#targetVpnGateway",
      "name": "string",
      "network": "string",
      "region": "string",
      "selfLink": "string",
      "status": "CREATING",
      "tunnels": [
        "string",
        "string",
        "string",
        "string"
      ]
    },
    {
      "creationTimestamp": "string",
      "description": "string",
      "forwardingRules": [
        "string",
        "string",
        "string",
        "string",
        "string",
        "string"
      ],
      "id": "string",
      "kind": "compute#targetVpnGateway",
      "name": "string",
      "network": "string",
      "region": "string",
      "selfLink": "string",
      "status": "DELETING",
      "tunnels": [
        "string",
        "string"
      ]
    },
    {
      "creationTimestamp": "string",
      "description": "string",
      "forwardingRules": [
        "string",
        "string",
        "string",
        "string",
        "string",
        "string",
        "string",
        "string",
        "string",
        "string"
      ],
      "id": "string",
      "kind": "compute#targetVpnGateway",
      "name": "string",
      "network": "string",
      "region": "string",
      "selfLink": "string",
      "status": "CREATING",
      "tunnels": [
        "string",
        "string",
        "string",
        "string",
        "string",
        "string",
        "string",
        "string",
        "string"
      ]
    },
    {
      "creationTimestamp": "string",
      "description": "string",
      "forwardingRules": [
        "string",
        "string",
        "string",
        "string",
        "string",
        "string",
        "string",
        "string"
      ],
      "id": "string",
      "kind": "compute#targetVpnGateway",
      "name": "string",
      "network": "string",
      "region": "string",
      "selfLink": "string",
      "status": "FAILED",
      "tunnels": [
        "string",
        "string",
        "string",
        "string"
      ]
    },
    {
      "creationTimestamp": "string",
      "description": "string",
      "forwardingRules": [
        "string",
        "string",
        "string",
        "string",
        "string"
      ],
      "id": "string",
      "kind": "compute#targetVpnGateway",
      "name": "string",
      "network": "string",
      "region": "string",
      "selfLink": "string",
      "status": "DELETING",
      "tunnels": [
        "string",
        "string",
        "string",
        "string"
      ]
    },
    {
      "creationTimestamp": "string",
      "description": "string",
      "forwardingRules": [
        "string",
        "string",
        "string",
        "string",
        "string",
        "string",
        "string"
      ],
      "id": "string",
      "kind": "compute#targetVpnGateway",
      "name": "string",
      "network": "string",
      "region": "string",
      "selfLink": "string",
      "status": "READY",
      "tunnels": [
        "string",
        "string",
        "string"
      ]
    }
  ],
  "kind": "compute#targetVpnGatewayList",
  "nextPageToken": "string",
  "selfLink": "string",
  "warning": {
    "code": "NEXT_HOP_INSTANCE_NOT_FOUND",
    "data": [
      {
        "key": "string",
        "value": "string"
      },
      {
        "key": "string",
        "value": "string"
      },
      {
        "key": "string",
        "value": "string"
      },
      {
        "key": "string",
        "value": "string"
      },
      {
        "key": "string",
        "value": "string"
      },
      {
        "key": "string",
        "value": "string"
      },
      {
        "key": "string",
        "value": "string"
      },
      {
        "key": "string",
        "value": "string"
      },
      {
        "key": "string",
        "value": "string"
      }
    ],
    "message": "string"
  }
}