{
  "autoscalingPolicy": {
    "coolDownPeriodSec": 3,
    "cpuUtilization": {
      "utilizationTarget": 6
    },
    "customMetricUtilizations": [
      {
        "metric": "string",
        "utilizationTarget": 6,
        "utilizationTargetType": "GAUGE"
      },
      {
        "metric": "string",
        "utilizationTarget": 4,
        "utilizationTargetType": "DELTA_PER_SECOND"
      },
      {
        "metric": "string",
        "utilizationTarget": 7,
        "utilizationTargetType": "DELTA_PER_MINUTE"
      },
      {
        "metric": "string",
        "utilizationTarget": 7,
        "utilizationTargetType": "DELTA_PER_MINUTE"
      },
      {
        "metric": "string",
        "utilizationTarget": 10,
        "utilizationTargetType": "DELTA_PER_MINUTE"
      },
      {
        "metric": "string",
        "utilizationTarget": 4,
        "utilizationTargetType": "GAUGE"
      },
      {
        "metric": "string",
        "utilizationTarget": 3,
        "utilizationTargetType": "GAUGE"
      }
    ],
    "loadBalancingUtilization": {
      "utilizationTarget": 5
    },
    "maxNumReplicas": 3,
    "minNumReplicas": 1,
    "mode": "OFF",
    "scaleInControl": {
      "maxScaledInReplicas": {
        "calculated": 1,
        "fixed": 6,
        "percent": 7
      },
      "timeWindowSec": 7
    }
  },
  "creationTimestamp": "string",
  "description": "string",
  "id": "string",
  "kind": "compute#autoscaler",
  "name": "string",
  "recommendedSize": 6,
  "region": "string",
  "selfLink": "string",
  "status": "ERROR",
  "statusDetails": [
    {
      "message": "string",
      "type": "SCALING_TARGET_DOES_NOT_EXIST"
    },
    {
      "message": "string",
      "type": "BACKEND_SERVICE_DOES_NOT_EXIST"
    },
    {
      "message": "string",
      "type": "MORE_THAN_ONE_BACKEND_SERVICE"
    }
  ],
  "target": "string",
  "zone": "string"
}