{
  "creationTimestamp": "string",
  "description": "string",
  "forwardingRules": [
    "string",
    "string",
    "string",
    "string",
    "string",
    "string",
    "string",
    "string",
    "string",
    "string"
  ],
  "id": "string",
  "kind": "compute#targetVpnGateway",
  "name": "string",
  "network": "string",
  "region": "string",
  "selfLink": "string",
  "status": "CREATING",
  "tunnels": [
    "string",
    "string",
    "string",
    "string",
    "string",
    "string",
    "string",
    "string",
    "string"
  ]
}