{
  "id": "string",
  "items": [
    {
      "creationTimestamp": "string",
      "description": "string",
      "fingerprint": "string",
      "healthChecks": [
        "string",
        "string",
        "string",
        "string",
        "string",
        "string",
        "string"
      ],
      "healthStatusAggregationPolicy": "NO_AGGREGATION",
      "id": "string",
      "kind": "compute#healthCheckService",
      "name": "string",
      "networkEndpointGroups": [
        "string",
        "string",
        "string"
      ],
      "notificationEndpoints": [
        "string",
        "string",
        "string",
        "string",
        "string"
      ],
      "region": "string",
      "selfLink": "string"
    },
    {
      "creationTimestamp": "string",
      "description": "string",
      "fingerprint": "string",
      "healthChecks": [
        "string"
      ],
      "healthStatusAggregationPolicy": "AND",
      "id": "string",
      "kind": "compute#healthCheckService",
      "name": "string",
      "networkEndpointGroups": [
        "string",
        "string",
        "string",
        "string",
        "string",
        "string"
      ],
      "notificationEndpoints": [
        "string",
        "string",
        "string",
        "string",
        "string",
        "string",
        "string",
        "string",
        "string"
      ],
      "region": "string",
      "selfLink": "string"
    },
    {
      "creationTimestamp": "string",
      "description": "string",
      "fingerprint": "string",
      "healthChecks": [
        "string",
        "string"
      ],
      "healthStatusAggregationPolicy": "AND",
      "id": "string",
      "kind": "compute#healthCheckService",
      "name": "string",
      "networkEndpointGroups": [
        "string",
        "string",
        "string",
        "string",
        "string",
        "string"
      ],
      "notificationEndpoints": [
        "string",
        "string",
        "string",
        "string"
      ],
      "region": "string",
      "selfLink": "string"
    }
  ],
  "kind": "compute#healthCheckServicesList",
  "nextPageToken": "string",
  "selfLink": "string",
  "warning": {
    "code": "NOT_CRITICAL_ERROR",
    "data": [
      {
        "key": "string",
        "value": "string"
      },
      {
        "key": "string",
        "value": "string"
      },
      {
        "key": "string",
        "value": "string"
      },
      {
        "key": "string",
        "value": "string"
      }
    ],
    "message": "string"
  }
}