{
  "actions": [
    {
      "name": "getProjectAggregatedInstances",
      "protocol": "REST",
      "method": "GET",
      "entitypath": "{base_path}/{version}/projects/{pathv1}/aggregated/instances?{query}",
      "requestSchema": "schema.json",
      "responseSchema": "schema.json",
      "timeout": 0,
      "sendEmpty": false,
      "sendGetBody": false,
      "requestDatatype": "JSON",
      "responseDatatype": "JSON",
      "headers": {},
      "responseObjects": [
        {
          "type": "default",
          "key": "",
          "mockFile": "mockdatafiles/getProjectAggregatedInstances-default.json"
        }
      ]
    },
    {
      "name": "getProjectZonesZoneInstances",
      "protocol": "REST",
      "method": "GET",
      "entitypath": "{base_path}/{version}/projects/{pathv1}/zones/{pathv2}/instances?{query}",
      "requestSchema": "schema.json",
      "responseSchema": "schema.json",
      "timeout": 0,
      "sendEmpty": false,
      "sendGetBody": false,
      "requestDatatype": "JSON",
      "responseDatatype": "JSON",
      "headers": {},
      "responseObjects": [
        {
          "type": "default",
          "key": "",
          "mockFile": "mockdatafiles/getProjectZonesZoneInstances-default.json"
        }
      ]
    },
    {
      "name": "postProjectZonesZoneInstances",
      "protocol": "REST",
      "method": "POST",
      "entitypath": "{base_path}/{version}/projects/{pathv1}/zones/{pathv2}/instances?{query}",
      "requestSchema": "schema.json",
      "responseSchema": "schema.json",
      "timeout": 0,
      "sendEmpty": false,
      "requestDatatype": "JSON",
      "responseDatatype": "JSON",
      "headers": {},
      "responseObjects": [
        {
          "type": "default",
          "key": "",
          "mockFile": "mockdatafiles/postProjectZonesZoneInstances-default.json"
        }
      ]
    },
    {
      "name": "deleteProjectZonesZoneInstancesInstance",
      "protocol": "REST",
      "method": "DELETE",
      "entitypath": "{base_path}/{version}/projects/{pathv1}/zones/{pathv2}/instances/{pathv3}?{query}",
      "requestSchema": "schema.json",
      "responseSchema": "schema.json",
      "timeout": 0,
      "sendEmpty": false,
      "requestDatatype": "JSON",
      "responseDatatype": "JSON",
      "headers": {},
      "responseObjects": [
        {
          "type": "default",
          "key": "",
          "mockFile": "mockdatafiles/deleteProjectZonesZoneInstancesInstance-default.json"
        }
      ]
    },
    {
      "name": "getProjectZonesZoneInstancesInstance",
      "protocol": "REST",
      "method": "GET",
      "entitypath": "{base_path}/{version}/projects/{pathv1}/zones/{pathv2}/instances/{pathv3}?{query}",
      "requestSchema": "schema.json",
      "responseSchema": "schema.json",
      "timeout": 0,
      "sendEmpty": false,
      "sendGetBody": false,
      "requestDatatype": "JSON",
      "responseDatatype": "JSON",
      "headers": {},
      "responseObjects": [
        {
          "type": "default",
          "key": "",
          "mockFile": "mockdatafiles/getProjectZonesZoneInstancesInstance-default.json"
        }
      ]
    },
    {
      "name": "putProjectZonesZoneInstancesInstance",
      "protocol": "REST",
      "method": "PUT",
      "entitypath": "{base_path}/{version}/projects/{pathv1}/zones/{pathv2}/instances/{pathv3}?{query}",
      "requestSchema": "schema.json",
      "responseSchema": "schema.json",
      "timeout": 0,
      "sendEmpty": false,
      "requestDatatype": "JSON",
      "responseDatatype": "JSON",
      "headers": {},
      "responseObjects": [
        {
          "type": "default",
          "key": "",
          "mockFile": "mockdatafiles/putProjectZonesZoneInstancesInstance-default.json"
        }
      ]
    },
    {
      "name": "postProjectZonesZoneInstancesInstanceAddAccessConfig",
      "protocol": "REST",
      "method": "POST",
      "entitypath": "{base_path}/{version}/projects/{pathv1}/zones/{pathv2}/instances/{pathv3}/addAccessConfig?{query}",
      "requestSchema": "schema.json",
      "responseSchema": "schema.json",
      "timeout": 0,
      "sendEmpty": false,
      "requestDatatype": "JSON",
      "responseDatatype": "JSON",
      "headers": {},
      "responseObjects": [
        {
          "type": "default",
          "key": "",
          "mockFile": "mockdatafiles/postProjectZonesZoneInstancesInstanceAddAccessConfig-default.json"
        }
      ]
    },
    {
      "name": "postProjectZonesZoneInstancesInstanceAddResourcePolicies",
      "protocol": "REST",
      "method": "POST",
      "entitypath": "{base_path}/{version}/projects/{pathv1}/zones/{pathv2}/instances/{pathv3}/addResourcePolicies?{query}",
      "requestSchema": "schema.json",
      "responseSchema": "schema.json",
      "timeout": 0,
      "sendEmpty": false,
      "requestDatatype": "JSON",
      "responseDatatype": "JSON",
      "headers": {},
      "responseObjects": [
        {
          "type": "default",
          "key": "",
          "mockFile": "mockdatafiles/postProjectZonesZoneInstancesInstanceAddResourcePolicies-default.json"
        }
      ]
    },
    {
      "name": "postProjectZonesZoneInstancesInstanceAttachDisk",
      "protocol": "REST",
      "method": "POST",
      "entitypath": "{base_path}/{version}/projects/{pathv1}/zones/{pathv2}/instances/{pathv3}/attachDisk?{query}",
      "requestSchema": "schema.json",
      "responseSchema": "schema.json",
      "timeout": 0,
      "sendEmpty": false,
      "requestDatatype": "JSON",
      "responseDatatype": "JSON",
      "headers": {},
      "responseObjects": [
        {
          "type": "default",
          "key": "",
          "mockFile": "mockdatafiles/postProjectZonesZoneInstancesInstanceAttachDisk-default.json"
        }
      ]
    },
    {
      "name": "postProjectZonesZoneInstancesInstanceDeleteAccessConfig",
      "protocol": "REST",
      "method": "POST",
      "entitypath": "{base_path}/{version}/projects/{pathv1}/zones/{pathv2}/instances/{pathv3}/deleteAccessConfig?{query}",
      "requestSchema": "schema.json",
      "responseSchema": "schema.json",
      "timeout": 0,
      "sendEmpty": false,
      "requestDatatype": "JSON",
      "responseDatatype": "JSON",
      "headers": {},
      "responseObjects": [
        {
          "type": "default",
          "key": "",
          "mockFile": "mockdatafiles/postProjectZonesZoneInstancesInstanceDeleteAccessConfig-default.json"
        }
      ]
    },
    {
      "name": "postProjectZonesZoneInstancesInstanceDetachDisk",
      "protocol": "REST",
      "method": "POST",
      "entitypath": "{base_path}/{version}/projects/{pathv1}/zones/{pathv2}/instances/{pathv3}/detachDisk?{query}",
      "requestSchema": "schema.json",
      "responseSchema": "schema.json",
      "timeout": 0,
      "sendEmpty": false,
      "requestDatatype": "JSON",
      "responseDatatype": "JSON",
      "headers": {},
      "responseObjects": [
        {
          "type": "default",
          "key": "",
          "mockFile": "mockdatafiles/postProjectZonesZoneInstancesInstanceDetachDisk-default.json"
        }
      ]
    },
    {
      "name": "getProjectZonesZoneInstancesInstanceGetGuestAttributes",
      "protocol": "REST",
      "method": "GET",
      "entitypath": "{base_path}/{version}/projects/{pathv1}/zones/{pathv2}/instances/{pathv3}/getGuestAttributes?{query}",
      "requestSchema": "schema.json",
      "responseSchema": "schema.json",
      "timeout": 0,
      "sendEmpty": false,
      "sendGetBody": false,
      "requestDatatype": "JSON",
      "responseDatatype": "JSON",
      "headers": {},
      "responseObjects": [
        {
          "type": "default",
          "key": "",
          "mockFile": "mockdatafiles/getProjectZonesZoneInstancesInstanceGetGuestAttributes-default.json"
        }
      ]
    },
    {
      "name": "getProjectZonesZoneInstancesInstanceGetShieldedInstanceIdentity",
      "protocol": "REST",
      "method": "GET",
      "entitypath": "{base_path}/{version}/projects/{pathv1}/zones/{pathv2}/instances/{pathv3}/getShieldedInstanceIdentity?{query}",
      "requestSchema": "schema.json",
      "responseSchema": "schema.json",
      "timeout": 0,
      "sendEmpty": false,
      "sendGetBody": false,
      "requestDatatype": "JSON",
      "responseDatatype": "JSON",
      "headers": {},
      "responseObjects": [
        {
          "type": "default",
          "key": "",
          "mockFile": "mockdatafiles/getProjectZonesZoneInstancesInstanceGetShieldedInstanceIdentity-default.json"
        }
      ]
    },
    {
      "name": "getProjectZonesZoneInstancesInstanceReferrers",
      "protocol": "REST",
      "method": "GET",
      "entitypath": "{base_path}/{version}/projects/{pathv1}/zones/{pathv2}/instances/{pathv3}/referrers?{query}",
      "requestSchema": "schema.json",
      "responseSchema": "schema.json",
      "timeout": 0,
      "sendEmpty": false,
      "sendGetBody": false,
      "requestDatatype": "JSON",
      "responseDatatype": "JSON",
      "headers": {},
      "responseObjects": [
        {
          "type": "default",
          "key": "",
          "mockFile": "mockdatafiles/getProjectZonesZoneInstancesInstanceReferrers-default.json"
        }
      ]
    },
    {
      "name": "postProjectZonesZoneInstancesInstanceRemoveResourcePolicies",
      "protocol": "REST",
      "method": "POST",
      "entitypath": "{base_path}/{version}/projects/{pathv1}/zones/{pathv2}/instances/{pathv3}/removeResourcePolicies?{query}",
      "requestSchema": "schema.json",
      "responseSchema": "schema.json",
      "timeout": 0,
      "sendEmpty": false,
      "requestDatatype": "JSON",
      "responseDatatype": "JSON",
      "headers": {},
      "responseObjects": [
        {
          "type": "default",
          "key": "",
          "mockFile": "mockdatafiles/postProjectZonesZoneInstancesInstanceRemoveResourcePolicies-default.json"
        }
      ]
    },
    {
      "name": "postProjectZonesZoneInstancesInstanceReset",
      "protocol": "REST",
      "method": "POST",
      "entitypath": "{base_path}/{version}/projects/{pathv1}/zones/{pathv2}/instances/{pathv3}/reset?{query}",
      "requestSchema": "schema.json",
      "responseSchema": "schema.json",
      "timeout": 0,
      "sendEmpty": false,
      "requestDatatype": "JSON",
      "responseDatatype": "JSON",
      "headers": {},
      "responseObjects": [
        {
          "type": "default",
          "key": "",
          "mockFile": "mockdatafiles/postProjectZonesZoneInstancesInstanceReset-default.json"
        }
      ]
    },
    {
      "name": "getProjectZonesZoneInstancesInstanceScreenshot",
      "protocol": "REST",
      "method": "GET",
      "entitypath": "{base_path}/{version}/projects/{pathv1}/zones/{pathv2}/instances/{pathv3}/screenshot?{query}",
      "requestSchema": "schema.json",
      "responseSchema": "schema.json",
      "timeout": 0,
      "sendEmpty": false,
      "sendGetBody": false,
      "requestDatatype": "JSON",
      "responseDatatype": "JSON",
      "headers": {},
      "responseObjects": [
        {
          "type": "default",
          "key": "",
          "mockFile": "mockdatafiles/getProjectZonesZoneInstancesInstanceScreenshot-default.json"
        }
      ]
    },
    {
      "name": "getProjectZonesZoneInstancesInstanceSerialPort",
      "protocol": "REST",
      "method": "GET",
      "entitypath": "{base_path}/{version}/projects/{pathv1}/zones/{pathv2}/instances/{pathv3}/serialPort?{query}",
      "requestSchema": "schema.json",
      "responseSchema": "schema.json",
      "timeout": 0,
      "sendEmpty": false,
      "sendGetBody": false,
      "requestDatatype": "JSON",
      "responseDatatype": "JSON",
      "headers": {},
      "responseObjects": [
        {
          "type": "default",
          "key": "",
          "mockFile": "mockdatafiles/getProjectZonesZoneInstancesInstanceSerialPort-default.json"
        }
      ]
    },
    {
      "name": "postProjectZonesZoneInstancesInstanceSetDiskAutoDelete",
      "protocol": "REST",
      "method": "POST",
      "entitypath": "{base_path}/{version}/projects/{pathv1}/zones/{pathv2}/instances/{pathv3}/setDiskAutoDelete?{query}",
      "requestSchema": "schema.json",
      "responseSchema": "schema.json",
      "timeout": 0,
      "sendEmpty": false,
      "requestDatatype": "JSON",
      "responseDatatype": "JSON",
      "headers": {},
      "responseObjects": [
        {
          "type": "default",
          "key": "",
          "mockFile": "mockdatafiles/postProjectZonesZoneInstancesInstanceSetDiskAutoDelete-default.json"
        }
      ]
    },
    {
      "name": "postProjectZonesZoneInstancesInstanceSetLabels",
      "protocol": "REST",
      "method": "POST",
      "entitypath": "{base_path}/{version}/projects/{pathv1}/zones/{pathv2}/instances/{pathv3}/setLabels?{query}",
      "requestSchema": "schema.json",
      "responseSchema": "schema.json",
      "timeout": 0,
      "sendEmpty": false,
      "requestDatatype": "JSON",
      "responseDatatype": "JSON",
      "headers": {},
      "responseObjects": [
        {
          "type": "default",
          "key": "",
          "mockFile": "mockdatafiles/postProjectZonesZoneInstancesInstanceSetLabels-default.json"
        }
      ]
    },
    {
      "name": "postProjectZonesZoneInstancesInstanceSetMachineResources",
      "protocol": "REST",
      "method": "POST",
      "entitypath": "{base_path}/{version}/projects/{pathv1}/zones/{pathv2}/instances/{pathv3}/setMachineResources?{query}",
      "requestSchema": "schema.json",
      "responseSchema": "schema.json",
      "timeout": 0,
      "sendEmpty": false,
      "requestDatatype": "JSON",
      "responseDatatype": "JSON",
      "headers": {},
      "responseObjects": [
        {
          "type": "default",
          "key": "",
          "mockFile": "mockdatafiles/postProjectZonesZoneInstancesInstanceSetMachineResources-default.json"
        }
      ]
    },
    {
      "name": "postProjectZonesZoneInstancesInstanceSetMachineType",
      "protocol": "REST",
      "method": "POST",
      "entitypath": "{base_path}/{version}/projects/{pathv1}/zones/{pathv2}/instances/{pathv3}/setMachineType?{query}",
      "requestSchema": "schema.json",
      "responseSchema": "schema.json",
      "timeout": 0,
      "sendEmpty": false,
      "requestDatatype": "JSON",
      "responseDatatype": "JSON",
      "headers": {},
      "responseObjects": [
        {
          "type": "default",
          "key": "",
          "mockFile": "mockdatafiles/postProjectZonesZoneInstancesInstanceSetMachineType-default.json"
        }
      ]
    },
    {
      "name": "postProjectZonesZoneInstancesInstanceSetMetadata",
      "protocol": "REST",
      "method": "POST",
      "entitypath": "{base_path}/{version}/projects/{pathv1}/zones/{pathv2}/instances/{pathv3}/setMetadata?{query}",
      "requestSchema": "schema.json",
      "responseSchema": "schema.json",
      "timeout": 0,
      "sendEmpty": false,
      "requestDatatype": "JSON",
      "responseDatatype": "JSON",
      "headers": {},
      "responseObjects": [
        {
          "type": "default",
          "key": "",
          "mockFile": "mockdatafiles/postProjectZonesZoneInstancesInstanceSetMetadata-default.json"
        }
      ]
    },
    {
      "name": "postProjectZonesZoneInstancesInstanceSetMinCpuPlatform",
      "protocol": "REST",
      "method": "POST",
      "entitypath": "{base_path}/{version}/projects/{pathv1}/zones/{pathv2}/instances/{pathv3}/setMinCpuPlatform?{query}",
      "requestSchema": "schema.json",
      "responseSchema": "schema.json",
      "timeout": 0,
      "sendEmpty": false,
      "requestDatatype": "JSON",
      "responseDatatype": "JSON",
      "headers": {},
      "responseObjects": [
        {
          "type": "default",
          "key": "",
          "mockFile": "mockdatafiles/postProjectZonesZoneInstancesInstanceSetMinCpuPlatform-default.json"
        }
      ]
    },
    {
      "name": "postProjectZonesZoneInstancesInstanceSetScheduling",
      "protocol": "REST",
      "method": "POST",
      "entitypath": "{base_path}/{version}/projects/{pathv1}/zones/{pathv2}/instances/{pathv3}/setScheduling?{query}",
      "requestSchema": "schema.json",
      "responseSchema": "schema.json",
      "timeout": 0,
      "sendEmpty": false,
      "requestDatatype": "JSON",
      "responseDatatype": "JSON",
      "headers": {},
      "responseObjects": [
        {
          "type": "default",
          "key": "",
          "mockFile": "mockdatafiles/postProjectZonesZoneInstancesInstanceSetScheduling-default.json"
        }
      ]
    },
    {
      "name": "postProjectZonesZoneInstancesInstanceSetServiceAccount",
      "protocol": "REST",
      "method": "POST",
      "entitypath": "{base_path}/{version}/projects/{pathv1}/zones/{pathv2}/instances/{pathv3}/setServiceAccount?{query}",
      "requestSchema": "schema.json",
      "responseSchema": "schema.json",
      "timeout": 0,
      "sendEmpty": false,
      "requestDatatype": "JSON",
      "responseDatatype": "JSON",
      "headers": {},
      "responseObjects": [
        {
          "type": "default",
          "key": "",
          "mockFile": "mockdatafiles/postProjectZonesZoneInstancesInstanceSetServiceAccount-default.json"
        }
      ]
    },
    {
      "name": "patchProjectZonesZoneInstancesInstanceSetShieldedInstanceIntegrityPolicy",
      "protocol": "REST",
      "method": "PATCH",
      "entitypath": "{base_path}/{version}/projects/{pathv1}/zones/{pathv2}/instances/{pathv3}/setShieldedInstanceIntegrityPolicy?{query}",
      "requestSchema": "schema.json",
      "responseSchema": "schema.json",
      "timeout": 0,
      "sendEmpty": false,
      "requestDatatype": "JSON",
      "responseDatatype": "JSON",
      "headers": {},
      "responseObjects": [
        {
          "type": "default",
          "key": "",
          "mockFile": "mockdatafiles/patchProjectZonesZoneInstancesInstanceSetShieldedInstanceIntegrityPolicy-default.json"
        }
      ]
    },
    {
      "name": "postProjectZonesZoneInstancesInstanceSetTags",
      "protocol": "REST",
      "method": "POST",
      "entitypath": "{base_path}/{version}/projects/{pathv1}/zones/{pathv2}/instances/{pathv3}/setTags?{query}",
      "requestSchema": "schema.json",
      "responseSchema": "schema.json",
      "timeout": 0,
      "sendEmpty": false,
      "requestDatatype": "JSON",
      "responseDatatype": "JSON",
      "headers": {},
      "responseObjects": [
        {
          "type": "default",
          "key": "",
          "mockFile": "mockdatafiles/postProjectZonesZoneInstancesInstanceSetTags-default.json"
        }
      ]
    },
    {
      "name": "postProjectZonesZoneInstancesInstanceSimulateMaintenanceEvent",
      "protocol": "REST",
      "method": "POST",
      "entitypath": "{base_path}/{version}/projects/{pathv1}/zones/{pathv2}/instances/{pathv3}/simulateMaintenanceEvent?{query}",
      "requestSchema": "schema.json",
      "responseSchema": "schema.json",
      "timeout": 0,
      "sendEmpty": false,
      "requestDatatype": "JSON",
      "responseDatatype": "JSON",
      "headers": {},
      "responseObjects": [
        {
          "type": "default",
          "key": "",
          "mockFile": "mockdatafiles/postProjectZonesZoneInstancesInstanceSimulateMaintenanceEvent-default.json"
        }
      ]
    },
    {
      "name": "postProjectZonesZoneInstancesInstanceStart",
      "protocol": "REST",
      "method": "POST",
      "entitypath": "{base_path}/{version}/projects/{pathv1}/zones/{pathv2}/instances/{pathv3}/start?{query}",
      "requestSchema": "schema.json",
      "responseSchema": "schema.json",
      "timeout": 0,
      "sendEmpty": false,
      "requestDatatype": "JSON",
      "responseDatatype": "JSON",
      "headers": {},
      "responseObjects": [
        {
          "type": "default",
          "key": "",
          "mockFile": "mockdatafiles/postProjectZonesZoneInstancesInstanceStart-default.json"
        }
      ]
    },
    {
      "name": "postProjectZonesZoneInstancesInstanceStartWithEncryptionKey",
      "protocol": "REST",
      "method": "POST",
      "entitypath": "{base_path}/{version}/projects/{pathv1}/zones/{pathv2}/instances/{pathv3}/startWithEncryptionKey?{query}",
      "requestSchema": "schema.json",
      "responseSchema": "schema.json",
      "timeout": 0,
      "sendEmpty": false,
      "requestDatatype": "JSON",
      "responseDatatype": "JSON",
      "headers": {},
      "responseObjects": [
        {
          "type": "default",
          "key": "",
          "mockFile": "mockdatafiles/postProjectZonesZoneInstancesInstanceStartWithEncryptionKey-default.json"
        }
      ]
    },
    {
      "name": "postProjectZonesZoneInstancesInstanceStop",
      "protocol": "REST",
      "method": "POST",
      "entitypath": "{base_path}/{version}/projects/{pathv1}/zones/{pathv2}/instances/{pathv3}/stop?{query}",
      "requestSchema": "schema.json",
      "responseSchema": "schema.json",
      "timeout": 0,
      "sendEmpty": false,
      "requestDatatype": "JSON",
      "responseDatatype": "JSON",
      "headers": {},
      "responseObjects": [
        {
          "type": "default",
          "key": "",
          "mockFile": "mockdatafiles/postProjectZonesZoneInstancesInstanceStop-default.json"
        }
      ]
    },
    {
      "name": "postProjectZonesZoneInstancesInstanceUpdateAccessConfig",
      "protocol": "REST",
      "method": "POST",
      "entitypath": "{base_path}/{version}/projects/{pathv1}/zones/{pathv2}/instances/{pathv3}/updateAccessConfig?{query}",
      "requestSchema": "schema.json",
      "responseSchema": "schema.json",
      "timeout": 0,
      "sendEmpty": false,
      "requestDatatype": "JSON",
      "responseDatatype": "JSON",
      "headers": {},
      "responseObjects": [
        {
          "type": "default",
          "key": "",
          "mockFile": "mockdatafiles/postProjectZonesZoneInstancesInstanceUpdateAccessConfig-default.json"
        }
      ]
    },
    {
      "name": "patchProjectZonesZoneInstancesInstanceUpdateDisplayDevice",
      "protocol": "REST",
      "method": "PATCH",
      "entitypath": "{base_path}/{version}/projects/{pathv1}/zones/{pathv2}/instances/{pathv3}/updateDisplayDevice?{query}",
      "requestSchema": "schema.json",
      "responseSchema": "schema.json",
      "timeout": 0,
      "sendEmpty": false,
      "requestDatatype": "JSON",
      "responseDatatype": "JSON",
      "headers": {},
      "responseObjects": [
        {
          "type": "default",
          "key": "",
          "mockFile": "mockdatafiles/patchProjectZonesZoneInstancesInstanceUpdateDisplayDevice-default.json"
        }
      ]
    },
    {
      "name": "patchProjectZonesZoneInstancesInstanceUpdateNetworkInterface",
      "protocol": "REST",
      "method": "PATCH",
      "entitypath": "{base_path}/{version}/projects/{pathv1}/zones/{pathv2}/instances/{pathv3}/updateNetworkInterface?{query}",
      "requestSchema": "schema.json",
      "responseSchema": "schema.json",
      "timeout": 0,
      "sendEmpty": false,
      "requestDatatype": "JSON",
      "responseDatatype": "JSON",
      "headers": {},
      "responseObjects": [
        {
          "type": "default",
          "key": "",
          "mockFile": "mockdatafiles/patchProjectZonesZoneInstancesInstanceUpdateNetworkInterface-default.json"
        }
      ]
    },
    {
      "name": "patchProjectZonesZoneInstancesInstanceUpdateShieldedInstanceConfig",
      "protocol": "REST",
      "method": "PATCH",
      "entitypath": "{base_path}/{version}/projects/{pathv1}/zones/{pathv2}/instances/{pathv3}/updateShieldedInstanceConfig?{query}",
      "requestSchema": "schema.json",
      "responseSchema": "schema.json",
      "timeout": 0,
      "sendEmpty": false,
      "requestDatatype": "JSON",
      "responseDatatype": "JSON",
      "headers": {},
      "responseObjects": [
        {
          "type": "default",
          "key": "",
          "mockFile": "mockdatafiles/patchProjectZonesZoneInstancesInstanceUpdateShieldedInstanceConfig-default.json"
        }
      ]
    },
    {
      "name": "getProjectZonesZoneInstancesResourceGetIamPolicy",
      "protocol": "REST",
      "method": "GET",
      "entitypath": "{base_path}/{version}/projects/{pathv1}/zones/{pathv2}/instances/{pathv3}/getIamPolicy?{query}",
      "requestSchema": "schema.json",
      "responseSchema": "schema.json",
      "timeout": 0,
      "sendEmpty": false,
      "sendGetBody": false,
      "requestDatatype": "JSON",
      "responseDatatype": "JSON",
      "headers": {},
      "responseObjects": [
        {
          "type": "default",
          "key": "",
          "mockFile": "mockdatafiles/getProjectZonesZoneInstancesResourceGetIamPolicy-default.json"
        }
      ]
    },
    {
      "name": "postProjectZonesZoneInstancesResourceSetDeletionProtection",
      "protocol": "REST",
      "method": "POST",
      "entitypath": "{base_path}/{version}/projects/{pathv1}/zones/{pathv2}/instances/{pathv3}/setDeletionProtection?{query}",
      "requestSchema": "schema.json",
      "responseSchema": "schema.json",
      "timeout": 0,
      "sendEmpty": false,
      "requestDatatype": "JSON",
      "responseDatatype": "JSON",
      "headers": {},
      "responseObjects": [
        {
          "type": "default",
          "key": "",
          "mockFile": "mockdatafiles/postProjectZonesZoneInstancesResourceSetDeletionProtection-default.json"
        }
      ]
    },
    {
      "name": "postProjectZonesZoneInstancesResourceSetIamPolicy",
      "protocol": "REST",
      "method": "POST",
      "entitypath": "{base_path}/{version}/projects/{pathv1}/zones/{pathv2}/instances/{pathv3}/setIamPolicy?{query}",
      "requestSchema": "schema.json",
      "responseSchema": "schema.json",
      "timeout": 0,
      "sendEmpty": false,
      "requestDatatype": "JSON",
      "responseDatatype": "JSON",
      "headers": {},
      "responseObjects": [
        {
          "type": "default",
          "key": "",
          "mockFile": "mockdatafiles/postProjectZonesZoneInstancesResourceSetIamPolicy-default.json"
        }
      ]
    },
    {
      "name": "postProjectZonesZoneInstancesResourceTestIamPermissions",
      "protocol": "REST",
      "method": "POST",
      "entitypath": "{base_path}/{version}/projects/{pathv1}/zones/{pathv2}/instances/{pathv3}/testIamPermissions?{query}",
      "requestSchema": "schema.json",
      "responseSchema": "schema.json",
      "timeout": 0,
      "sendEmpty": false,
      "requestDatatype": "JSON",
      "responseDatatype": "JSON",
      "headers": {},
      "responseObjects": [
        {
          "type": "default",
          "key": "",
          "mockFile": "mockdatafiles/postProjectZonesZoneInstancesResourceTestIamPermissions-default.json"
        }
      ]
    }
  ]
}