{
  "id": "string",
  "items": [
    {
      "IPAddress": "string",
      "IPProtocol": "ICMP",
      "allPorts": true,
      "allowGlobalAccess": true,
      "backendService": "string",
      "creationTimestamp": "string",
      "description": "string",
      "fingerprint": "string",
      "id": "string",
      "ipVersion": "UNSPECIFIED_VERSION",
      "isMirroringCollector": false,
      "kind": "compute#forwardingRule",
      "loadBalancingScheme": "INVALID",
      "metadataFilters": [
        {
          "filterLabels": [
            {
              "name": "string",
              "value": "string"
            }
          ],
          "filterMatchCriteria": "MATCH_ANY"
        },
        {
          "filterLabels": [
            {
              "name": "string",
              "value": "string"
            },
            {
              "name": "string",
              "value": "string"
            },
            {
              "name": "string",
              "value": "string"
            }
          ],
          "filterMatchCriteria": "NOT_SET"
        },
        {
          "filterLabels": [
            {
              "name": "string",
              "value": "string"
            },
            {
              "name": "string",
              "value": "string"
            },
            {
              "name": "string",
              "value": "string"
            },
            {
              "name": "string",
              "value": "string"
            },
            {
              "name": "string",
              "value": "string"
            },
            {
              "name": "string",
              "value": "string"
            },
            {
              "name": "string",
              "value": "string"
            }
          ],
          "filterMatchCriteria": "NOT_SET"
        },
        {
          "filterLabels": [
            {
              "name": "string",
              "value": "string"
            },
            {
              "name": "string",
              "value": "string"
            },
            {
              "name": "string",
              "value": "string"
            },
            {
              "name": "string",
              "value": "string"
            },
            {
              "name": "string",
              "value": "string"
            },
            {
              "name": "string",
              "value": "string"
            },
            {
              "name": "string",
              "value": "string"
            }
          ],
          "filterMatchCriteria": "NOT_SET"
        },
        {
          "filterLabels": [
            {
              "name": "string",
              "value": "string"
            },
            {
              "name": "string",
              "value": "string"
            },
            {
              "name": "string",
              "value": "string"
            },
            {
              "name": "string",
              "value": "string"
            }
          ],
          "filterMatchCriteria": "NOT_SET"
        },
        {
          "filterLabels": [
            {
              "name": "string",
              "value": "string"
            },
            {
              "name": "string",
              "value": "string"
            },
            {
              "name": "string",
              "value": "string"
            },
            {
              "name": "string",
              "value": "string"
            },
            {
              "name": "string",
              "value": "string"
            }
          ],
          "filterMatchCriteria": "MATCH_ANY"
        },
        {
          "filterLabels": [
            {
              "name": "string",
              "value": "string"
            }
          ],
          "filterMatchCriteria": "NOT_SET"
        },
        {
          "filterLabels": [
            {
              "name": "string",
              "value": "string"
            },
            {
              "name": "string",
              "value": "string"
            },
            {
              "name": "string",
              "value": "string"
            },
            {
              "name": "string",
              "value": "string"
            }
          ],
          "filterMatchCriteria": "MATCH_ALL"
        },
        {
          "filterLabels": [
            {
              "name": "string",
              "value": "string"
            },
            {
              "name": "string",
              "value": "string"
            },
            {
              "name": "string",
              "value": "string"
            },
            {
              "name": "string",
              "value": "string"
            },
            {
              "name": "string",
              "value": "string"
            },
            {
              "name": "string",
              "value": "string"
            }
          ],
          "filterMatchCriteria": "NOT_SET"
        },
        {
          "filterLabels": [
            {
              "name": "string",
              "value": "string"
            },
            {
              "name": "string",
              "value": "string"
            },
            {
              "name": "string",
              "value": "string"
            },
            {
              "name": "string",
              "value": "string"
            },
            {
              "name": "string",
              "value": "string"
            },
            {
              "name": "string",
              "value": "string"
            },
            {
              "name": "string",
              "value": "string"
            }
          ],
          "filterMatchCriteria": "MATCH_ALL"
        }
      ],
      "name": "string",
      "network": "string",
      "networkTier": "STANDARD",
      "portRange": "string",
      "ports": [
        "string",
        "string",
        "string"
      ],
      "region": "string",
      "selfLink": "string",
      "serviceLabel": "string",
      "serviceName": "string",
      "subnetwork": "string",
      "target": "string"
    },
    {
      "IPAddress": "string",
      "IPProtocol": "ESP",
      "allPorts": false,
      "allowGlobalAccess": true,
      "backendService": "string",
      "creationTimestamp": "string",
      "description": "string",
      "fingerprint": "string",
      "id": "string",
      "ipVersion": "IPV4",
      "isMirroringCollector": true,
      "kind": "compute#forwardingRule",
      "loadBalancingScheme": "EXTERNAL",
      "metadataFilters": [
        {
          "filterLabels": [
            {
              "name": "string",
              "value": "string"
            },
            {
              "name": "string",
              "value": "string"
            },
            {
              "name": "string",
              "value": "string"
            },
            {
              "name": "string",
              "value": "string"
            }
          ],
          "filterMatchCriteria": "MATCH_ANY"
        },
        {
          "filterLabels": [
            {
              "name": "string",
              "value": "string"
            }
          ],
          "filterMatchCriteria": "MATCH_ALL"
        },
        {
          "filterLabels": [
            {
              "name": "string",
              "value": "string"
            },
            {
              "name": "string",
              "value": "string"
            },
            {
              "name": "string",
              "value": "string"
            },
            {
              "name": "string",
              "value": "string"
            },
            {
              "name": "string",
              "value": "string"
            },
            {
              "name": "string",
              "value": "string"
            },
            {
              "name": "string",
              "value": "string"
            }
          ],
          "filterMatchCriteria": "NOT_SET"
        },
        {
          "filterLabels": [
            {
              "name": "string",
              "value": "string"
            },
            {
              "name": "string",
              "value": "string"
            },
            {
              "name": "string",
              "value": "string"
            },
            {
              "name": "string",
              "value": "string"
            },
            {
              "name": "string",
              "value": "string"
            },
            {
              "name": "string",
              "value": "string"
            },
            {
              "name": "string",
              "value": "string"
            },
            {
              "name": "string",
              "value": "string"
            },
            {
              "name": "string",
              "value": "string"
            },
            {
              "name": "string",
              "value": "string"
            }
          ],
          "filterMatchCriteria": "MATCH_ANY"
        },
        {
          "filterLabels": [
            {
              "name": "string",
              "value": "string"
            },
            {
              "name": "string",
              "value": "string"
            },
            {
              "name": "string",
              "value": "string"
            },
            {
              "name": "string",
              "value": "string"
            },
            {
              "name": "string",
              "value": "string"
            },
            {
              "name": "string",
              "value": "string"
            },
            {
              "name": "string",
              "value": "string"
            },
            {
              "name": "string",
              "value": "string"
            }
          ],
          "filterMatchCriteria": "MATCH_ALL"
        },
        {
          "filterLabels": [
            {
              "name": "string",
              "value": "string"
            },
            {
              "name": "string",
              "value": "string"
            },
            {
              "name": "string",
              "value": "string"
            },
            {
              "name": "string",
              "value": "string"
            },
            {
              "name": "string",
              "value": "string"
            },
            {
              "name": "string",
              "value": "string"
            }
          ],
          "filterMatchCriteria": "MATCH_ANY"
        }
      ],
      "name": "string",
      "network": "string",
      "networkTier": "PREMIUM",
      "portRange": "string",
      "ports": [
        "string",
        "string",
        "string",
        "string",
        "string",
        "string",
        "string",
        "string"
      ],
      "region": "string",
      "selfLink": "string",
      "serviceLabel": "string",
      "serviceName": "string",
      "subnetwork": "string",
      "target": "string"
    },
    {
      "IPAddress": "string",
      "IPProtocol": "SCTP",
      "allPorts": true,
      "allowGlobalAccess": true,
      "backendService": "string",
      "creationTimestamp": "string",
      "description": "string",
      "fingerprint": "string",
      "id": "string",
      "ipVersion": "IPV4",
      "isMirroringCollector": true,
      "kind": "compute#forwardingRule",
      "loadBalancingScheme": "INTERNAL_MANAGED",
      "metadataFilters": [
        {
          "filterLabels": [
            {
              "name": "string",
              "value": "string"
            },
            {
              "name": "string",
              "value": "string"
            },
            {
              "name": "string",
              "value": "string"
            }
          ],
          "filterMatchCriteria": "MATCH_ANY"
        },
        {
          "filterLabels": [
            {
              "name": "string",
              "value": "string"
            },
            {
              "name": "string",
              "value": "string"
            },
            {
              "name": "string",
              "value": "string"
            },
            {
              "name": "string",
              "value": "string"
            }
          ],
          "filterMatchCriteria": "NOT_SET"
        },
        {
          "filterLabels": [
            {
              "name": "string",
              "value": "string"
            },
            {
              "name": "string",
              "value": "string"
            },
            {
              "name": "string",
              "value": "string"
            },
            {
              "name": "string",
              "value": "string"
            },
            {
              "name": "string",
              "value": "string"
            },
            {
              "name": "string",
              "value": "string"
            }
          ],
          "filterMatchCriteria": "MATCH_ANY"
        },
        {
          "filterLabels": [
            {
              "name": "string",
              "value": "string"
            },
            {
              "name": "string",
              "value": "string"
            },
            {
              "name": "string",
              "value": "string"
            },
            {
              "name": "string",
              "value": "string"
            },
            {
              "name": "string",
              "value": "string"
            },
            {
              "name": "string",
              "value": "string"
            },
            {
              "name": "string",
              "value": "string"
            },
            {
              "name": "string",
              "value": "string"
            },
            {
              "name": "string",
              "value": "string"
            }
          ],
          "filterMatchCriteria": "MATCH_ANY"
        },
        {
          "filterLabels": [
            {
              "name": "string",
              "value": "string"
            },
            {
              "name": "string",
              "value": "string"
            },
            {
              "name": "string",
              "value": "string"
            },
            {
              "name": "string",
              "value": "string"
            },
            {
              "name": "string",
              "value": "string"
            },
            {
              "name": "string",
              "value": "string"
            },
            {
              "name": "string",
              "value": "string"
            },
            {
              "name": "string",
              "value": "string"
            }
          ],
          "filterMatchCriteria": "MATCH_ANY"
        },
        {
          "filterLabels": [
            {
              "name": "string",
              "value": "string"
            },
            {
              "name": "string",
              "value": "string"
            },
            {
              "name": "string",
              "value": "string"
            },
            {
              "name": "string",
              "value": "string"
            },
            {
              "name": "string",
              "value": "string"
            }
          ],
          "filterMatchCriteria": "MATCH_ALL"
        },
        {
          "filterLabels": [
            {
              "name": "string",
              "value": "string"
            },
            {
              "name": "string",
              "value": "string"
            },
            {
              "name": "string",
              "value": "string"
            },
            {
              "name": "string",
              "value": "string"
            },
            {
              "name": "string",
              "value": "string"
            },
            {
              "name": "string",
              "value": "string"
            },
            {
              "name": "string",
              "value": "string"
            },
            {
              "name": "string",
              "value": "string"
            }
          ],
          "filterMatchCriteria": "NOT_SET"
        },
        {
          "filterLabels": [
            {
              "name": "string",
              "value": "string"
            },
            {
              "name": "string",
              "value": "string"
            },
            {
              "name": "string",
              "value": "string"
            },
            {
              "name": "string",
              "value": "string"
            }
          ],
          "filterMatchCriteria": "MATCH_ALL"
        }
      ],
      "name": "string",
      "network": "string",
      "networkTier": "STANDARD",
      "portRange": "string",
      "ports": [
        "string",
        "string",
        "string",
        "string",
        "string",
        "string",
        "string",
        "string",
        "string"
      ],
      "region": "string",
      "selfLink": "string",
      "serviceLabel": "string",
      "serviceName": "string",
      "subnetwork": "string",
      "target": "string"
    },
    {
      "IPAddress": "string",
      "IPProtocol": "SCTP",
      "allPorts": true,
      "allowGlobalAccess": false,
      "backendService": "string",
      "creationTimestamp": "string",
      "description": "string",
      "fingerprint": "string",
      "id": "string",
      "ipVersion": "IPV6",
      "isMirroringCollector": false,
      "kind": "compute#forwardingRule",
      "loadBalancingScheme": "INTERNAL",
      "metadataFilters": [
        {
          "filterLabels": [
            {
              "name": "string",
              "value": "string"
            },
            {
              "name": "string",
              "value": "string"
            },
            {
              "name": "string",
              "value": "string"
            }
          ],
          "filterMatchCriteria": "MATCH_ALL"
        },
        {
          "filterLabels": [
            {
              "name": "string",
              "value": "string"
            },
            {
              "name": "string",
              "value": "string"
            },
            {
              "name": "string",
              "value": "string"
            },
            {
              "name": "string",
              "value": "string"
            },
            {
              "name": "string",
              "value": "string"
            },
            {
              "name": "string",
              "value": "string"
            },
            {
              "name": "string",
              "value": "string"
            }
          ],
          "filterMatchCriteria": "NOT_SET"
        }
      ],
      "name": "string",
      "network": "string",
      "networkTier": "STANDARD",
      "portRange": "string",
      "ports": [
        "string",
        "string"
      ],
      "region": "string",
      "selfLink": "string",
      "serviceLabel": "string",
      "serviceName": "string",
      "subnetwork": "string",
      "target": "string"
    },
    {
      "IPAddress": "string",
      "IPProtocol": "ESP",
      "allPorts": true,
      "allowGlobalAccess": true,
      "backendService": "string",
      "creationTimestamp": "string",
      "description": "string",
      "fingerprint": "string",
      "id": "string",
      "ipVersion": "IPV6",
      "isMirroringCollector": false,
      "kind": "compute#forwardingRule",
      "loadBalancingScheme": "INTERNAL_MANAGED",
      "metadataFilters": [
        {
          "filterLabels": [
            {
              "name": "string",
              "value": "string"
            },
            {
              "name": "string",
              "value": "string"
            },
            {
              "name": "string",
              "value": "string"
            },
            {
              "name": "string",
              "value": "string"
            },
            {
              "name": "string",
              "value": "string"
            },
            {
              "name": "string",
              "value": "string"
            },
            {
              "name": "string",
              "value": "string"
            },
            {
              "name": "string",
              "value": "string"
            },
            {
              "name": "string",
              "value": "string"
            }
          ],
          "filterMatchCriteria": "MATCH_ALL"
        },
        {
          "filterLabels": [
            {
              "name": "string",
              "value": "string"
            },
            {
              "name": "string",
              "value": "string"
            },
            {
              "name": "string",
              "value": "string"
            },
            {
              "name": "string",
              "value": "string"
            },
            {
              "name": "string",
              "value": "string"
            },
            {
              "name": "string",
              "value": "string"
            }
          ],
          "filterMatchCriteria": "MATCH_ALL"
        },
        {
          "filterLabels": [
            {
              "name": "string",
              "value": "string"
            }
          ],
          "filterMatchCriteria": "MATCH_ANY"
        }
      ],
      "name": "string",
      "network": "string",
      "networkTier": "STANDARD",
      "portRange": "string",
      "ports": [
        "string",
        "string",
        "string"
      ],
      "region": "string",
      "selfLink": "string",
      "serviceLabel": "string",
      "serviceName": "string",
      "subnetwork": "string",
      "target": "string"
    },
    {
      "IPAddress": "string",
      "IPProtocol": "ICMP",
      "allPorts": false,
      "allowGlobalAccess": true,
      "backendService": "string",
      "creationTimestamp": "string",
      "description": "string",
      "fingerprint": "string",
      "id": "string",
      "ipVersion": "IPV4",
      "isMirroringCollector": false,
      "kind": "compute#forwardingRule",
      "loadBalancingScheme": "INVALID",
      "metadataFilters": [
        {
          "filterLabels": [
            {
              "name": "string",
              "value": "string"
            },
            {
              "name": "string",
              "value": "string"
            },
            {
              "name": "string",
              "value": "string"
            },
            {
              "name": "string",
              "value": "string"
            },
            {
              "name": "string",
              "value": "string"
            },
            {
              "name": "string",
              "value": "string"
            },
            {
              "name": "string",
              "value": "string"
            }
          ],
          "filterMatchCriteria": "NOT_SET"
        },
        {
          "filterLabels": [
            {
              "name": "string",
              "value": "string"
            },
            {
              "name": "string",
              "value": "string"
            },
            {
              "name": "string",
              "value": "string"
            },
            {
              "name": "string",
              "value": "string"
            },
            {
              "name": "string",
              "value": "string"
            }
          ],
          "filterMatchCriteria": "NOT_SET"
        },
        {
          "filterLabels": [
            {
              "name": "string",
              "value": "string"
            },
            {
              "name": "string",
              "value": "string"
            },
            {
              "name": "string",
              "value": "string"
            },
            {
              "name": "string",
              "value": "string"
            },
            {
              "name": "string",
              "value": "string"
            },
            {
              "name": "string",
              "value": "string"
            },
            {
              "name": "string",
              "value": "string"
            }
          ],
          "filterMatchCriteria": "NOT_SET"
        },
        {
          "filterLabels": [
            {
              "name": "string",
              "value": "string"
            },
            {
              "name": "string",
              "value": "string"
            },
            {
              "name": "string",
              "value": "string"
            },
            {
              "name": "string",
              "value": "string"
            },
            {
              "name": "string",
              "value": "string"
            },
            {
              "name": "string",
              "value": "string"
            }
          ],
          "filterMatchCriteria": "MATCH_ANY"
        },
        {
          "filterLabels": [
            {
              "name": "string",
              "value": "string"
            },
            {
              "name": "string",
              "value": "string"
            },
            {
              "name": "string",
              "value": "string"
            },
            {
              "name": "string",
              "value": "string"
            },
            {
              "name": "string",
              "value": "string"
            }
          ],
          "filterMatchCriteria": "MATCH_ANY"
        },
        {
          "filterLabels": [
            {
              "name": "string",
              "value": "string"
            },
            {
              "name": "string",
              "value": "string"
            },
            {
              "name": "string",
              "value": "string"
            },
            {
              "name": "string",
              "value": "string"
            },
            {
              "name": "string",
              "value": "string"
            },
            {
              "name": "string",
              "value": "string"
            },
            {
              "name": "string",
              "value": "string"
            },
            {
              "name": "string",
              "value": "string"
            },
            {
              "name": "string",
              "value": "string"
            }
          ],
          "filterMatchCriteria": "MATCH_ANY"
        },
        {
          "filterLabels": [
            {
              "name": "string",
              "value": "string"
            }
          ],
          "filterMatchCriteria": "NOT_SET"
        },
        {
          "filterLabels": [
            {
              "name": "string",
              "value": "string"
            },
            {
              "name": "string",
              "value": "string"
            },
            {
              "name": "string",
              "value": "string"
            },
            {
              "name": "string",
              "value": "string"
            },
            {
              "name": "string",
              "value": "string"
            },
            {
              "name": "string",
              "value": "string"
            },
            {
              "name": "string",
              "value": "string"
            },
            {
              "name": "string",
              "value": "string"
            },
            {
              "name": "string",
              "value": "string"
            }
          ],
          "filterMatchCriteria": "MATCH_ALL"
        }
      ],
      "name": "string",
      "network": "string",
      "networkTier": "PREMIUM",
      "portRange": "string",
      "ports": [
        "string",
        "string",
        "string",
        "string",
        "string"
      ],
      "region": "string",
      "selfLink": "string",
      "serviceLabel": "string",
      "serviceName": "string",
      "subnetwork": "string",
      "target": "string"
    }
  ],
  "kind": "compute#forwardingRuleList",
  "nextPageToken": "string",
  "selfLink": "string",
  "warning": {
    "code": "UNREACHABLE",
    "data": [
      {
        "key": "string",
        "value": "string"
      },
      {
        "key": "string",
        "value": "string"
      },
      {
        "key": "string",
        "value": "string"
      },
      {
        "key": "string",
        "value": "string"
      },
      {
        "key": "string",
        "value": "string"
      },
      {
        "key": "string",
        "value": "string"
      },
      {
        "key": "string",
        "value": "string"
      },
      {
        "key": "string",
        "value": "string"
      }
    ],
    "message": "string"
  }
}