{
  "id": "string",
  "items": {},
  "kind": "compute#vpnGatewayAggregatedList",
  "nextPageToken": "string",
  "selfLink": "string",
  "warning": {
    "code": "EXTERNAL_API_WARNING",
    "data": [
      {
        "key": "string",
        "value": "string"
      }
    ],
    "message": "string"
  }
}