{
  "id": "string",
  "items": [
    {
      "checkIntervalSec": 2,
      "creationTimestamp": "string",
      "description": "string",
      "healthyThreshold": 2,
      "host": "string",
      "id": "string",
      "kind": "compute#httpHealthCheck",
      "name": "string",
      "port": 3,
      "requestPath": "string",
      "selfLink": "string",
      "timeoutSec": 6,
      "unhealthyThreshold": 5
    },
    {
      "checkIntervalSec": 10,
      "creationTimestamp": "string",
      "description": "string",
      "healthyThreshold": 1,
      "host": "string",
      "id": "string",
      "kind": "compute#httpHealthCheck",
      "name": "string",
      "port": 8,
      "requestPath": "string",
      "selfLink": "string",
      "timeoutSec": 9,
      "unhealthyThreshold": 7
    },
    {
      "checkIntervalSec": 1,
      "creationTimestamp": "string",
      "description": "string",
      "healthyThreshold": 1,
      "host": "string",
      "id": "string",
      "kind": "compute#httpHealthCheck",
      "name": "string",
      "port": 10,
      "requestPath": "string",
      "selfLink": "string",
      "timeoutSec": 2,
      "unhealthyThreshold": 7
    },
    {
      "checkIntervalSec": 10,
      "creationTimestamp": "string",
      "description": "string",
      "healthyThreshold": 9,
      "host": "string",
      "id": "string",
      "kind": "compute#httpHealthCheck",
      "name": "string",
      "port": 4,
      "requestPath": "string",
      "selfLink": "string",
      "timeoutSec": 5,
      "unhealthyThreshold": 10
    },
    {
      "checkIntervalSec": 2,
      "creationTimestamp": "string",
      "description": "string",
      "healthyThreshold": 10,
      "host": "string",
      "id": "string",
      "kind": "compute#httpHealthCheck",
      "name": "string",
      "port": 7,
      "requestPath": "string",
      "selfLink": "string",
      "timeoutSec": 3,
      "unhealthyThreshold": 1
    },
    {
      "checkIntervalSec": 1,
      "creationTimestamp": "string",
      "description": "string",
      "healthyThreshold": 8,
      "host": "string",
      "id": "string",
      "kind": "compute#httpHealthCheck",
      "name": "string",
      "port": 9,
      "requestPath": "string",
      "selfLink": "string",
      "timeoutSec": 5,
      "unhealthyThreshold": 4
    },
    {
      "checkIntervalSec": 5,
      "creationTimestamp": "string",
      "description": "string",
      "healthyThreshold": 1,
      "host": "string",
      "id": "string",
      "kind": "compute#httpHealthCheck",
      "name": "string",
      "port": 4,
      "requestPath": "string",
      "selfLink": "string",
      "timeoutSec": 5,
      "unhealthyThreshold": 9
    },
    {
      "checkIntervalSec": 7,
      "creationTimestamp": "string",
      "description": "string",
      "healthyThreshold": 3,
      "host": "string",
      "id": "string",
      "kind": "compute#httpHealthCheck",
      "name": "string",
      "port": 8,
      "requestPath": "string",
      "selfLink": "string",
      "timeoutSec": 1,
      "unhealthyThreshold": 10
    }
  ],
  "kind": "compute#httpHealthCheckList",
  "nextPageToken": "string",
  "selfLink": "string",
  "warning": {
    "code": "NEXT_HOP_ADDRESS_NOT_ASSIGNED",
    "data": [
      {
        "key": "string",
        "value": "string"
      },
      {
        "key": "string",
        "value": "string"
      },
      {
        "key": "string",
        "value": "string"
      }
    ],
    "message": "string"
  }
}