{
  "result": {
    "loadErrors": [
      "string",
      "string",
      "string",
      "string"
    ],
    "loadSucceeded": true,
    "testFailures": [
      {
        "actualService": "string",
        "expectedService": "string",
        "host": "string",
        "path": "string"
      },
      {
        "actualService": "string",
        "expectedService": "string",
        "host": "string",
        "path": "string"
      },
      {
        "actualService": "string",
        "expectedService": "string",
        "host": "string",
        "path": "string"
      }
    ],
    "testPassed": false
  }
}