{
  "id": "string",
  "items": [
    {
      "accelerators": [
        {
          "guestAcceleratorCount": 2,
          "guestAcceleratorType": "string"
        },
        {
          "guestAcceleratorCount": 4,
          "guestAcceleratorType": "string"
        },
        {
          "guestAcceleratorCount": 4,
          "guestAcceleratorType": "string"
        }
      ],
      "creationTimestamp": "string",
      "deprecated": {
        "deleted": "string",
        "deprecated": "string",
        "obsolete": "string",
        "replacement": "string",
        "state": "DELETED"
      },
      "description": "string",
      "guestCpus": 7,
      "id": "string",
      "imageSpaceGb": 10,
      "isSharedCpu": false,
      "kind": "compute#machineType",
      "maximumPersistentDisks": 6,
      "maximumPersistentDisksSizeGb": "string",
      "memoryMb": 4,
      "name": "string",
      "scratchDisks": [
        {
          "diskGb": 5
        },
        {
          "diskGb": 1
        },
        {
          "diskGb": 5
        },
        {
          "diskGb": 9
        },
        {
          "diskGb": 8
        }
      ],
      "selfLink": "string",
      "zone": "string"
    },
    {
      "accelerators": [
        {
          "guestAcceleratorCount": 2,
          "guestAcceleratorType": "string"
        },
        {
          "guestAcceleratorCount": 7,
          "guestAcceleratorType": "string"
        },
        {
          "guestAcceleratorCount": 3,
          "guestAcceleratorType": "string"
        },
        {
          "guestAcceleratorCount": 7,
          "guestAcceleratorType": "string"
        },
        {
          "guestAcceleratorCount": 10,
          "guestAcceleratorType": "string"
        }
      ],
      "creationTimestamp": "string",
      "deprecated": {
        "deleted": "string",
        "deprecated": "string",
        "obsolete": "string",
        "replacement": "string",
        "state": "OBSOLETE"
      },
      "description": "string",
      "guestCpus": 7,
      "id": "string",
      "imageSpaceGb": 4,
      "isSharedCpu": true,
      "kind": "compute#machineType",
      "maximumPersistentDisks": 2,
      "maximumPersistentDisksSizeGb": "string",
      "memoryMb": 3,
      "name": "string",
      "scratchDisks": [
        {
          "diskGb": 8
        }
      ],
      "selfLink": "string",
      "zone": "string"
    },
    {
      "accelerators": [
        {
          "guestAcceleratorCount": 8,
          "guestAcceleratorType": "string"
        },
        {
          "guestAcceleratorCount": 4,
          "guestAcceleratorType": "string"
        },
        {
          "guestAcceleratorCount": 9,
          "guestAcceleratorType": "string"
        },
        {
          "guestAcceleratorCount": 7,
          "guestAcceleratorType": "string"
        },
        {
          "guestAcceleratorCount": 9,
          "guestAcceleratorType": "string"
        },
        {
          "guestAcceleratorCount": 8,
          "guestAcceleratorType": "string"
        },
        {
          "guestAcceleratorCount": 10,
          "guestAcceleratorType": "string"
        },
        {
          "guestAcceleratorCount": 10,
          "guestAcceleratorType": "string"
        },
        {
          "guestAcceleratorCount": 1,
          "guestAcceleratorType": "string"
        }
      ],
      "creationTimestamp": "string",
      "deprecated": {
        "deleted": "string",
        "deprecated": "string",
        "obsolete": "string",
        "replacement": "string",
        "state": "DEPRECATED"
      },
      "description": "string",
      "guestCpus": 3,
      "id": "string",
      "imageSpaceGb": 9,
      "isSharedCpu": true,
      "kind": "compute#machineType",
      "maximumPersistentDisks": 5,
      "maximumPersistentDisksSizeGb": "string",
      "memoryMb": 2,
      "name": "string",
      "scratchDisks": [
        {
          "diskGb": 1
        },
        {
          "diskGb": 2
        },
        {
          "diskGb": 6
        },
        {
          "diskGb": 6
        }
      ],
      "selfLink": "string",
      "zone": "string"
    },
    {
      "accelerators": [
        {
          "guestAcceleratorCount": 2,
          "guestAcceleratorType": "string"
        },
        {
          "guestAcceleratorCount": 10,
          "guestAcceleratorType": "string"
        },
        {
          "guestAcceleratorCount": 9,
          "guestAcceleratorType": "string"
        },
        {
          "guestAcceleratorCount": 4,
          "guestAcceleratorType": "string"
        }
      ],
      "creationTimestamp": "string",
      "deprecated": {
        "deleted": "string",
        "deprecated": "string",
        "obsolete": "string",
        "replacement": "string",
        "state": "DELETED"
      },
      "description": "string",
      "guestCpus": 5,
      "id": "string",
      "imageSpaceGb": 2,
      "isSharedCpu": false,
      "kind": "compute#machineType",
      "maximumPersistentDisks": 6,
      "maximumPersistentDisksSizeGb": "string",
      "memoryMb": 7,
      "name": "string",
      "scratchDisks": [
        {
          "diskGb": 7
        },
        {
          "diskGb": 1
        },
        {
          "diskGb": 8
        },
        {
          "diskGb": 6
        },
        {
          "diskGb": 7
        },
        {
          "diskGb": 7
        },
        {
          "diskGb": 10
        },
        {
          "diskGb": 5
        }
      ],
      "selfLink": "string",
      "zone": "string"
    },
    {
      "accelerators": [
        {
          "guestAcceleratorCount": 3,
          "guestAcceleratorType": "string"
        },
        {
          "guestAcceleratorCount": 8,
          "guestAcceleratorType": "string"
        },
        {
          "guestAcceleratorCount": 4,
          "guestAcceleratorType": "string"
        },
        {
          "guestAcceleratorCount": 3,
          "guestAcceleratorType": "string"
        }
      ],
      "creationTimestamp": "string",
      "deprecated": {
        "deleted": "string",
        "deprecated": "string",
        "obsolete": "string",
        "replacement": "string",
        "state": "DELETED"
      },
      "description": "string",
      "guestCpus": 5,
      "id": "string",
      "imageSpaceGb": 3,
      "isSharedCpu": true,
      "kind": "compute#machineType",
      "maximumPersistentDisks": 10,
      "maximumPersistentDisksSizeGb": "string",
      "memoryMb": 9,
      "name": "string",
      "scratchDisks": [
        {
          "diskGb": 7
        },
        {
          "diskGb": 9
        },
        {
          "diskGb": 9
        },
        {
          "diskGb": 10
        },
        {
          "diskGb": 10
        },
        {
          "diskGb": 5
        }
      ],
      "selfLink": "string",
      "zone": "string"
    }
  ],
  "kind": "compute#machineTypeList",
  "nextPageToken": "string",
  "selfLink": "string",
  "warning": {
    "code": "CLEANUP_FAILED",
    "data": [
      {
        "key": "string",
        "value": "string"
      },
      {
        "key": "string",
        "value": "string"
      },
      {
        "key": "string",
        "value": "string"
      },
      {
        "key": "string",
        "value": "string"
      },
      {
        "key": "string",
        "value": "string"
      },
      {
        "key": "string",
        "value": "string"
      }
    ],
    "message": "string"
  }
}