{
  "auditConfigs": [
    {
      "auditLogConfigs": [
        {
          "exemptedMembers": [
            "string",
            "string",
            "string",
            "string",
            "string",
            "string",
            "string",
            "string"
          ],
          "ignoreChildExemptions": false,
          "logType": "DATA_READ"
        },
        {
          "exemptedMembers": [
            "string"
          ],
          "ignoreChildExemptions": false,
          "logType": "ADMIN_READ"
        },
        {
          "exemptedMembers": [
            "string",
            "string",
            "string",
            "string",
            "string",
            "string",
            "string"
          ],
          "ignoreChildExemptions": false,
          "logType": "DATA_WRITE"
        },
        {
          "exemptedMembers": [
            "string"
          ],
          "ignoreChildExemptions": false,
          "logType": "LOG_TYPE_UNSPECIFIED"
        },
        {
          "exemptedMembers": [
            "string",
            "string",
            "string",
            "string"
          ],
          "ignoreChildExemptions": false,
          "logType": "ADMIN_READ"
        },
        {
          "exemptedMembers": [
            "string",
            "string",
            "string",
            "string",
            "string"
          ],
          "ignoreChildExemptions": true,
          "logType": "DATA_READ"
        },
        {
          "exemptedMembers": [
            "string",
            "string",
            "string",
            "string",
            "string",
            "string",
            "string",
            "string"
          ],
          "ignoreChildExemptions": true,
          "logType": "DATA_READ"
        },
        {
          "exemptedMembers": [
            "string",
            "string",
            "string",
            "string",
            "string",
            "string",
            "string",
            "string",
            "string",
            "string"
          ],
          "ignoreChildExemptions": true,
          "logType": "DATA_READ"
        },
        {
          "exemptedMembers": [
            "string",
            "string",
            "string",
            "string",
            "string"
          ],
          "ignoreChildExemptions": true,
          "logType": "LOG_TYPE_UNSPECIFIED"
        }
      ],
      "exemptedMembers": [
        "string",
        "string",
        "string",
        "string",
        "string",
        "string"
      ],
      "service": "string"
    },
    {
      "auditLogConfigs": [
        {
          "exemptedMembers": [
            "string",
            "string",
            "string",
            "string",
            "string",
            "string",
            "string"
          ],
          "ignoreChildExemptions": false,
          "logType": "ADMIN_READ"
        },
        {
          "exemptedMembers": [
            "string",
            "string",
            "string",
            "string",
            "string",
            "string"
          ],
          "ignoreChildExemptions": false,
          "logType": "ADMIN_READ"
        },
        {
          "exemptedMembers": [
            "string"
          ],
          "ignoreChildExemptions": true,
          "logType": "DATA_READ"
        },
        {
          "exemptedMembers": [
            "string",
            "string",
            "string",
            "string",
            "string",
            "string",
            "string"
          ],
          "ignoreChildExemptions": true,
          "logType": "DATA_WRITE"
        },
        {
          "exemptedMembers": [
            "string",
            "string",
            "string",
            "string",
            "string",
            "string",
            "string",
            "string",
            "string"
          ],
          "ignoreChildExemptions": true,
          "logType": "DATA_READ"
        },
        {
          "exemptedMembers": [
            "string",
            "string",
            "string"
          ],
          "ignoreChildExemptions": true,
          "logType": "DATA_READ"
        },
        {
          "exemptedMembers": [
            "string",
            "string",
            "string",
            "string",
            "string",
            "string",
            "string"
          ],
          "ignoreChildExemptions": false,
          "logType": "ADMIN_READ"
        },
        {
          "exemptedMembers": [
            "string",
            "string",
            "string",
            "string",
            "string",
            "string",
            "string",
            "string",
            "string"
          ],
          "ignoreChildExemptions": true,
          "logType": "ADMIN_READ"
        },
        {
          "exemptedMembers": [
            "string",
            "string",
            "string",
            "string",
            "string"
          ],
          "ignoreChildExemptions": false,
          "logType": "DATA_READ"
        }
      ],
      "exemptedMembers": [
        "string",
        "string",
        "string",
        "string",
        "string"
      ],
      "service": "string"
    },
    {
      "auditLogConfigs": [
        {
          "exemptedMembers": [
            "string"
          ],
          "ignoreChildExemptions": false,
          "logType": "DATA_WRITE"
        },
        {
          "exemptedMembers": [
            "string",
            "string",
            "string",
            "string",
            "string",
            "string",
            "string",
            "string",
            "string"
          ],
          "ignoreChildExemptions": false,
          "logType": "LOG_TYPE_UNSPECIFIED"
        }
      ],
      "exemptedMembers": [
        "string",
        "string",
        "string"
      ],
      "service": "string"
    },
    {
      "auditLogConfigs": [
        {
          "exemptedMembers": [
            "string",
            "string",
            "string",
            "string",
            "string",
            "string",
            "string",
            "string",
            "string",
            "string"
          ],
          "ignoreChildExemptions": true,
          "logType": "DATA_READ"
        },
        {
          "exemptedMembers": [
            "string",
            "string",
            "string",
            "string",
            "string",
            "string"
          ],
          "ignoreChildExemptions": true,
          "logType": "ADMIN_READ"
        },
        {
          "exemptedMembers": [
            "string"
          ],
          "ignoreChildExemptions": true,
          "logType": "DATA_READ"
        },
        {
          "exemptedMembers": [
            "string",
            "string",
            "string",
            "string",
            "string"
          ],
          "ignoreChildExemptions": false,
          "logType": "DATA_READ"
        },
        {
          "exemptedMembers": [
            "string",
            "string",
            "string",
            "string"
          ],
          "ignoreChildExemptions": false,
          "logType": "DATA_WRITE"
        }
      ],
      "exemptedMembers": [
        "string"
      ],
      "service": "string"
    },
    {
      "auditLogConfigs": [
        {
          "exemptedMembers": [
            "string",
            "string",
            "string",
            "string",
            "string",
            "string"
          ],
          "ignoreChildExemptions": true,
          "logType": "LOG_TYPE_UNSPECIFIED"
        },
        {
          "exemptedMembers": [
            "string",
            "string",
            "string",
            "string",
            "string"
          ],
          "ignoreChildExemptions": true,
          "logType": "LOG_TYPE_UNSPECIFIED"
        },
        {
          "exemptedMembers": [
            "string",
            "string",
            "string",
            "string",
            "string",
            "string",
            "string",
            "string",
            "string"
          ],
          "ignoreChildExemptions": false,
          "logType": "ADMIN_READ"
        },
        {
          "exemptedMembers": [
            "string",
            "string",
            "string",
            "string",
            "string"
          ],
          "ignoreChildExemptions": false,
          "logType": "LOG_TYPE_UNSPECIFIED"
        },
        {
          "exemptedMembers": [
            "string",
            "string",
            "string",
            "string"
          ],
          "ignoreChildExemptions": true,
          "logType": "ADMIN_READ"
        },
        {
          "exemptedMembers": [
            "string",
            "string",
            "string",
            "string",
            "string",
            "string"
          ],
          "ignoreChildExemptions": true,
          "logType": "DATA_READ"
        },
        {
          "exemptedMembers": [
            "string"
          ],
          "ignoreChildExemptions": true,
          "logType": "LOG_TYPE_UNSPECIFIED"
        },
        {
          "exemptedMembers": [
            "string",
            "string",
            "string",
            "string",
            "string",
            "string",
            "string",
            "string",
            "string"
          ],
          "ignoreChildExemptions": false,
          "logType": "DATA_READ"
        },
        {
          "exemptedMembers": [
            "string",
            "string",
            "string",
            "string",
            "string"
          ],
          "ignoreChildExemptions": false,
          "logType": "ADMIN_READ"
        },
        {
          "exemptedMembers": [
            "string",
            "string"
          ],
          "ignoreChildExemptions": false,
          "logType": "DATA_READ"
        }
      ],
      "exemptedMembers": [
        "string"
      ],
      "service": "string"
    },
    {
      "auditLogConfigs": [
        {
          "exemptedMembers": [
            "string",
            "string",
            "string",
            "string",
            "string"
          ],
          "ignoreChildExemptions": true,
          "logType": "DATA_READ"
        },
        {
          "exemptedMembers": [
            "string",
            "string",
            "string"
          ],
          "ignoreChildExemptions": false,
          "logType": "ADMIN_READ"
        },
        {
          "exemptedMembers": [
            "string",
            "string",
            "string",
            "string",
            "string",
            "string",
            "string",
            "string",
            "string",
            "string"
          ],
          "ignoreChildExemptions": true,
          "logType": "ADMIN_READ"
        },
        {
          "exemptedMembers": [
            "string",
            "string",
            "string",
            "string",
            "string",
            "string",
            "string",
            "string"
          ],
          "ignoreChildExemptions": false,
          "logType": "LOG_TYPE_UNSPECIFIED"
        }
      ],
      "exemptedMembers": [
        "string",
        "string",
        "string"
      ],
      "service": "string"
    },
    {
      "auditLogConfigs": [
        {
          "exemptedMembers": [
            "string",
            "string",
            "string"
          ],
          "ignoreChildExemptions": false,
          "logType": "DATA_READ"
        },
        {
          "exemptedMembers": [
            "string",
            "string"
          ],
          "ignoreChildExemptions": true,
          "logType": "DATA_READ"
        },
        {
          "exemptedMembers": [
            "string"
          ],
          "ignoreChildExemptions": true,
          "logType": "LOG_TYPE_UNSPECIFIED"
        },
        {
          "exemptedMembers": [
            "string",
            "string",
            "string",
            "string",
            "string",
            "string",
            "string"
          ],
          "ignoreChildExemptions": false,
          "logType": "ADMIN_READ"
        },
        {
          "exemptedMembers": [
            "string",
            "string",
            "string"
          ],
          "ignoreChildExemptions": false,
          "logType": "DATA_READ"
        }
      ],
      "exemptedMembers": [
        "string",
        "string",
        "string",
        "string",
        "string",
        "string",
        "string",
        "string",
        "string"
      ],
      "service": "string"
    },
    {
      "auditLogConfigs": [
        {
          "exemptedMembers": [
            "string",
            "string",
            "string",
            "string"
          ],
          "ignoreChildExemptions": true,
          "logType": "DATA_READ"
        },
        {
          "exemptedMembers": [
            "string",
            "string",
            "string",
            "string",
            "string"
          ],
          "ignoreChildExemptions": false,
          "logType": "DATA_READ"
        },
        {
          "exemptedMembers": [
            "string",
            "string",
            "string",
            "string",
            "string",
            "string",
            "string",
            "string",
            "string"
          ],
          "ignoreChildExemptions": true,
          "logType": "DATA_WRITE"
        },
        {
          "exemptedMembers": [
            "string",
            "string",
            "string",
            "string",
            "string"
          ],
          "ignoreChildExemptions": false,
          "logType": "DATA_WRITE"
        },
        {
          "exemptedMembers": [
            "string"
          ],
          "ignoreChildExemptions": false,
          "logType": "ADMIN_READ"
        },
        {
          "exemptedMembers": [
            "string",
            "string",
            "string",
            "string",
            "string",
            "string",
            "string",
            "string",
            "string"
          ],
          "ignoreChildExemptions": false,
          "logType": "DATA_WRITE"
        },
        {
          "exemptedMembers": [
            "string",
            "string",
            "string",
            "string",
            "string",
            "string",
            "string"
          ],
          "ignoreChildExemptions": false,
          "logType": "DATA_WRITE"
        },
        {
          "exemptedMembers": [
            "string",
            "string",
            "string",
            "string",
            "string",
            "string",
            "string"
          ],
          "ignoreChildExemptions": true,
          "logType": "LOG_TYPE_UNSPECIFIED"
        },
        {
          "exemptedMembers": [
            "string",
            "string",
            "string"
          ],
          "ignoreChildExemptions": true,
          "logType": "ADMIN_READ"
        },
        {
          "exemptedMembers": [
            "string",
            "string",
            "string",
            "string",
            "string",
            "string",
            "string"
          ],
          "ignoreChildExemptions": false,
          "logType": "DATA_READ"
        }
      ],
      "exemptedMembers": [
        "string",
        "string",
        "string",
        "string",
        "string",
        "string",
        "string",
        "string"
      ],
      "service": "string"
    }
  ],
  "bindings": [
    {
      "condition": {
        "description": "string",
        "expression": "string",
        "location": "string",
        "title": "string"
      },
      "members": [
        "string",
        "string",
        "string",
        "string"
      ],
      "role": "string"
    }
  ],
  "etag": "string",
  "iamOwned": false,
  "rules": [
    {
      "action": "LOG",
      "conditions": [
        {
          "iam": "APPROVER",
          "op": "NOT_IN",
          "svc": "string",
          "sys": "SERVICE",
          "values": [
            "string",
            "string",
            "string",
            "string",
            "string",
            "string",
            "string",
            "string",
            "string"
          ]
        }
      ],
      "description": "string",
      "ins": [
        "string",
        "string",
        "string",
        "string",
        "string",
        "string",
        "string"
      ],
      "logConfigs": [
        {
          "cloudAudit": {
            "authorizationLoggingOptions": {
              "permissionType": "PERMISSION_TYPE_UNSPECIFIED"
            },
            "logName": "UNSPECIFIED_LOG_NAME"
          },
          "counter": {
            "customFields": [
              {
                "name": "string",
                "value": "string"
              },
              {
                "name": "string",
                "value": "string"
              },
              {
                "name": "string",
                "value": "string"
              }
            ],
            "field": "string",
            "metric": "string"
          },
          "dataAccess": {
            "logMode": "LOG_FAIL_CLOSED"
          }
        }
      ],
      "notIns": [
        "string",
        "string",
        "string",
        "string"
      ],
      "permissions": [
        "string",
        "string",
        "string",
        "string",
        "string",
        "string",
        "string",
        "string",
        "string",
        "string"
      ]
    },
    {
      "action": "DENY",
      "conditions": [
        {
          "iam": "SECURITY_REALM",
          "op": "IN",
          "svc": "string",
          "sys": "NO_ATTR",
          "values": [
            "string",
            "string",
            "string",
            "string",
            "string",
            "string",
            "string",
            "string",
            "string",
            "string"
          ]
        },
        {
          "iam": "SECURITY_REALM",
          "op": "DISCHARGED",
          "svc": "string",
          "sys": "NAME",
          "values": [
            "string",
            "string",
            "string",
            "string",
            "string",
            "string",
            "string",
            "string",
            "string"
          ]
        },
        {
          "iam": "ATTRIBUTION",
          "op": "NOT_EQUALS",
          "svc": "string",
          "sys": "REGION",
          "values": [
            "string",
            "string",
            "string",
            "string",
            "string"
          ]
        },
        {
          "iam": "CREDENTIALS_TYPE",
          "op": "IN",
          "svc": "string",
          "sys": "IP",
          "values": [
            "string",
            "string",
            "string",
            "string"
          ]
        }
      ],
      "description": "string",
      "ins": [
        "string",
        "string",
        "string",
        "string",
        "string",
        "string"
      ],
      "logConfigs": [
        {
          "cloudAudit": {
            "authorizationLoggingOptions": {
              "permissionType": "PERMISSION_TYPE_UNSPECIFIED"
            },
            "logName": "DATA_ACCESS"
          },
          "counter": {
            "customFields": [
              {
                "name": "string",
                "value": "string"
              },
              {
                "name": "string",
                "value": "string"
              },
              {
                "name": "string",
                "value": "string"
              },
              {
                "name": "string",
                "value": "string"
              },
              {
                "name": "string",
                "value": "string"
              },
              {
                "name": "string",
                "value": "string"
              },
              {
                "name": "string",
                "value": "string"
              },
              {
                "name": "string",
                "value": "string"
              },
              {
                "name": "string",
                "value": "string"
              }
            ],
            "field": "string",
            "metric": "string"
          },
          "dataAccess": {
            "logMode": "LOG_FAIL_CLOSED"
          }
        },
        {
          "cloudAudit": {
            "authorizationLoggingOptions": {
              "permissionType": "DATA_WRITE"
            },
            "logName": "ADMIN_ACTIVITY"
          },
          "counter": {
            "customFields": [
              {
                "name": "string",
                "value": "string"
              },
              {
                "name": "string",
                "value": "string"
              },
              {
                "name": "string",
                "value": "string"
              },
              {
                "name": "string",
                "value": "string"
              },
              {
                "name": "string",
                "value": "string"
              },
              {
                "name": "string",
                "value": "string"
              }
            ],
            "field": "string",
            "metric": "string"
          },
          "dataAccess": {
            "logMode": "LOG_FAIL_CLOSED"
          }
        },
        {
          "cloudAudit": {
            "authorizationLoggingOptions": {
              "permissionType": "ADMIN_READ"
            },
            "logName": "UNSPECIFIED_LOG_NAME"
          },
          "counter": {
            "customFields": [
              {
                "name": "string",
                "value": "string"
              },
              {
                "name": "string",
                "value": "string"
              },
              {
                "name": "string",
                "value": "string"
              },
              {
                "name": "string",
                "value": "string"
              },
              {
                "name": "string",
                "value": "string"
              },
              {
                "name": "string",
                "value": "string"
              }
            ],
            "field": "string",
            "metric": "string"
          },
          "dataAccess": {
            "logMode": "LOG_MODE_UNSPECIFIED"
          }
        }
      ],
      "notIns": [
        "string",
        "string",
        "string",
        "string",
        "string",
        "string"
      ],
      "permissions": [
        "string",
        "string",
        "string",
        "string",
        "string",
        "string",
        "string"
      ]
    },
    {
      "action": "LOG",
      "conditions": [
        {
          "iam": "ATTRIBUTION",
          "op": "NO_OP",
          "svc": "string",
          "sys": "SERVICE",
          "values": [
            "string"
          ]
        },
        {
          "iam": "APPROVER",
          "op": "NO_OP",
          "svc": "string",
          "sys": "IP",
          "values": [
            "string",
            "string",
            "string",
            "string",
            "string"
          ]
        },
        {
          "iam": "ATTRIBUTION",
          "op": "IN",
          "svc": "string",
          "sys": "SERVICE",
          "values": [
            "string",
            "string"
          ]
        }
      ],
      "description": "string",
      "ins": [
        "string",
        "string"
      ],
      "logConfigs": [
        {
          "cloudAudit": {
            "authorizationLoggingOptions": {
              "permissionType": "DATA_WRITE"
            },
            "logName": "UNSPECIFIED_LOG_NAME"
          },
          "counter": {
            "customFields": [
              {
                "name": "string",
                "value": "string"
              },
              {
                "name": "string",
                "value": "string"
              },
              {
                "name": "string",
                "value": "string"
              },
              {
                "name": "string",
                "value": "string"
              },
              {
                "name": "string",
                "value": "string"
              },
              {
                "name": "string",
                "value": "string"
              }
            ],
            "field": "string",
            "metric": "string"
          },
          "dataAccess": {
            "logMode": "LOG_MODE_UNSPECIFIED"
          }
        },
        {
          "cloudAudit": {
            "authorizationLoggingOptions": {
              "permissionType": "DATA_WRITE"
            },
            "logName": "UNSPECIFIED_LOG_NAME"
          },
          "counter": {
            "customFields": [
              {
                "name": "string",
                "value": "string"
              },
              {
                "name": "string",
                "value": "string"
              },
              {
                "name": "string",
                "value": "string"
              },
              {
                "name": "string",
                "value": "string"
              },
              {
                "name": "string",
                "value": "string"
              },
              {
                "name": "string",
                "value": "string"
              },
              {
                "name": "string",
                "value": "string"
              },
              {
                "name": "string",
                "value": "string"
              },
              {
                "name": "string",
                "value": "string"
              }
            ],
            "field": "string",
            "metric": "string"
          },
          "dataAccess": {
            "logMode": "LOG_FAIL_CLOSED"
          }
        },
        {
          "cloudAudit": {
            "authorizationLoggingOptions": {
              "permissionType": "ADMIN_WRITE"
            },
            "logName": "DATA_ACCESS"
          },
          "counter": {
            "customFields": [
              {
                "name": "string",
                "value": "string"
              },
              {
                "name": "string",
                "value": "string"
              },
              {
                "name": "string",
                "value": "string"
              },
              {
                "name": "string",
                "value": "string"
              },
              {
                "name": "string",
                "value": "string"
              },
              {
                "name": "string",
                "value": "string"
              },
              {
                "name": "string",
                "value": "string"
              }
            ],
            "field": "string",
            "metric": "string"
          },
          "dataAccess": {
            "logMode": "LOG_MODE_UNSPECIFIED"
          }
        },
        {
          "cloudAudit": {
            "authorizationLoggingOptions": {
              "permissionType": "ADMIN_WRITE"
            },
            "logName": "ADMIN_ACTIVITY"
          },
          "counter": {
            "customFields": [
              {
                "name": "string",
                "value": "string"
              },
              {
                "name": "string",
                "value": "string"
              },
              {
                "name": "string",
                "value": "string"
              },
              {
                "name": "string",
                "value": "string"
              }
            ],
            "field": "string",
            "metric": "string"
          },
          "dataAccess": {
            "logMode": "LOG_FAIL_CLOSED"
          }
        }
      ],
      "notIns": [
        "string",
        "string",
        "string",
        "string",
        "string"
      ],
      "permissions": [
        "string",
        "string",
        "string",
        "string",
        "string"
      ]
    }
  ],
  "version": 9
}