{
  "archiveSizeBytes": "string",
  "creationTimestamp": "string",
  "deprecated": {
    "deleted": "string",
    "deprecated": "string",
    "obsolete": "string",
    "replacement": "string",
    "state": "OBSOLETE"
  },
  "description": "string",
  "diskSizeGb": "string",
  "family": "string",
  "guestOsFeatures": [
    {
      "type": "WINDOWS"
    },
    {
      "type": "VIRTIO_SCSI_MULTIQUEUE"
    },
    {
      "type": "MULTI_IP_SUBNET"
    },
    {
      "type": "UEFI_COMPATIBLE"
    },
    {
      "type": "VIRTIO_SCSI_MULTIQUEUE"
    },
    {
      "type": "UEFI_COMPATIBLE"
    },
    {
      "type": "WINDOWS"
    },
    {
      "type": "SEV_CAPABLE"
    },
    {
      "type": "VIRTIO_SCSI_MULTIQUEUE"
    }
  ],
  "id": "string",
  "imageEncryptionKey": {
    "kmsKeyName": "string",
    "kmsKeyServiceAccount": "string",
    "rawKey": "string",
    "sha256": "string"
  },
  "kind": "compute#image",
  "labelFingerprint": "string",
  "labels": {},
  "licenseCodes": [
    "string",
    "string",
    "string",
    "string"
  ],
  "licenses": [
    "string",
    "string"
  ],
  "name": "string",
  "rawDisk": {
    "containerType": "TAR",
    "sha1Checksum": "string",
    "source": "string"
  },
  "selfLink": "string",
  "shieldedInstanceInitialState": {
    "dbs": [
      {
        "content": "string",
        "fileType": "UNDEFINED"
      }
    ],
    "dbxs": [
      {
        "content": "string",
        "fileType": "X509"
      },
      {
        "content": "string",
        "fileType": "UNDEFINED"
      },
      {
        "content": "string",
        "fileType": "UNDEFINED"
      },
      {
        "content": "string",
        "fileType": "UNDEFINED"
      },
      {
        "content": "string",
        "fileType": "BIN"
      },
      {
        "content": "string",
        "fileType": "UNDEFINED"
      },
      {
        "content": "string",
        "fileType": "BIN"
      },
      {
        "content": "string",
        "fileType": "BIN"
      }
    ],
    "keks": [
      {
        "content": "string",
        "fileType": "BIN"
      },
      {
        "content": "string",
        "fileType": "UNDEFINED"
      },
      {
        "content": "string",
        "fileType": "UNDEFINED"
      },
      {
        "content": "string",
        "fileType": "X509"
      },
      {
        "content": "string",
        "fileType": "UNDEFINED"
      },
      {
        "content": "string",
        "fileType": "BIN"
      }
    ],
    "pk": {
      "content": "string",
      "fileType": "UNDEFINED"
    }
  },
  "sourceDisk": "string",
  "sourceDiskEncryptionKey": {
    "kmsKeyName": "string",
    "kmsKeyServiceAccount": "string",
    "rawKey": "string",
    "sha256": "string"
  },
  "sourceDiskId": "string",
  "sourceImage": "string",
  "sourceImageEncryptionKey": {
    "kmsKeyName": "string",
    "kmsKeyServiceAccount": "string",
    "rawKey": "string",
    "sha256": "string"
  },
  "sourceImageId": "string",
  "sourceSnapshot": "string",
  "sourceSnapshotEncryptionKey": {
    "kmsKeyName": "string",
    "kmsKeyServiceAccount": "string",
    "rawKey": "string",
    "sha256": "string"
  },
  "sourceSnapshotId": "string",
  "sourceType": "RAW",
  "status": "FAILED",
  "storageLocations": [
    "string",
    "string",
    "string",
    "string"
  ]
}