{
  "id": "string",
  "items": [
    {
      "annotations": {},
      "appEngine": {
        "service": "string",
        "urlMask": "string",
        "version": "string"
      },
      "cloudFunction": {
        "function": "string",
        "urlMask": "string"
      },
      "cloudRun": {
        "service": "string",
        "tag": "string",
        "urlMask": "string"
      },
      "creationTimestamp": "string",
      "defaultPort": 2,
      "description": "string",
      "id": "string",
      "kind": "compute#networkEndpointGroup",
      "name": "string",
      "network": "string",
      "networkEndpointType": "INTERNET_FQDN_PORT",
      "region": "string",
      "selfLink": "string",
      "size": 7,
      "subnetwork": "string",
      "zone": "string"
    },
    {
      "annotations": {},
      "appEngine": {
        "service": "string",
        "urlMask": "string",
        "version": "string"
      },
      "cloudFunction": {
        "function": "string",
        "urlMask": "string"
      },
      "cloudRun": {
        "service": "string",
        "tag": "string",
        "urlMask": "string"
      },
      "creationTimestamp": "string",
      "defaultPort": 4,
      "description": "string",
      "id": "string",
      "kind": "compute#networkEndpointGroup",
      "name": "string",
      "network": "string",
      "networkEndpointType": "INTERNET_IP_PORT",
      "region": "string",
      "selfLink": "string",
      "size": 2,
      "subnetwork": "string",
      "zone": "string"
    },
    {
      "annotations": {},
      "appEngine": {
        "service": "string",
        "urlMask": "string",
        "version": "string"
      },
      "cloudFunction": {
        "function": "string",
        "urlMask": "string"
      },
      "cloudRun": {
        "service": "string",
        "tag": "string",
        "urlMask": "string"
      },
      "creationTimestamp": "string",
      "defaultPort": 8,
      "description": "string",
      "id": "string",
      "kind": "compute#networkEndpointGroup",
      "name": "string",
      "network": "string",
      "networkEndpointType": "INTERNET_FQDN_PORT",
      "region": "string",
      "selfLink": "string",
      "size": 7,
      "subnetwork": "string",
      "zone": "string"
    },
    {
      "annotations": {},
      "appEngine": {
        "service": "string",
        "urlMask": "string",
        "version": "string"
      },
      "cloudFunction": {
        "function": "string",
        "urlMask": "string"
      },
      "cloudRun": {
        "service": "string",
        "tag": "string",
        "urlMask": "string"
      },
      "creationTimestamp": "string",
      "defaultPort": 6,
      "description": "string",
      "id": "string",
      "kind": "compute#networkEndpointGroup",
      "name": "string",
      "network": "string",
      "networkEndpointType": "NON_GCP_PRIVATE_IP_PORT",
      "region": "string",
      "selfLink": "string",
      "size": 4,
      "subnetwork": "string",
      "zone": "string"
    },
    {
      "annotations": {},
      "appEngine": {
        "service": "string",
        "urlMask": "string",
        "version": "string"
      },
      "cloudFunction": {
        "function": "string",
        "urlMask": "string"
      },
      "cloudRun": {
        "service": "string",
        "tag": "string",
        "urlMask": "string"
      },
      "creationTimestamp": "string",
      "defaultPort": 10,
      "description": "string",
      "id": "string",
      "kind": "compute#networkEndpointGroup",
      "name": "string",
      "network": "string",
      "networkEndpointType": "GCE_VM_IP_PORT",
      "region": "string",
      "selfLink": "string",
      "size": 8,
      "subnetwork": "string",
      "zone": "string"
    },
    {
      "annotations": {},
      "appEngine": {
        "service": "string",
        "urlMask": "string",
        "version": "string"
      },
      "cloudFunction": {
        "function": "string",
        "urlMask": "string"
      },
      "cloudRun": {
        "service": "string",
        "tag": "string",
        "urlMask": "string"
      },
      "creationTimestamp": "string",
      "defaultPort": 1,
      "description": "string",
      "id": "string",
      "kind": "compute#networkEndpointGroup",
      "name": "string",
      "network": "string",
      "networkEndpointType": "NON_GCP_PRIVATE_IP_PORT",
      "region": "string",
      "selfLink": "string",
      "size": 1,
      "subnetwork": "string",
      "zone": "string"
    }
  ],
  "kind": "compute#networkEndpointGroupList",
  "nextPageToken": "string",
  "selfLink": "string",
  "warning": {
    "code": "DEPRECATED_TYPE_USED",
    "data": [
      {
        "key": "string",
        "value": "string"
      },
      {
        "key": "string",
        "value": "string"
      },
      {
        "key": "string",
        "value": "string"
      }
    ],
    "message": "string"
  }
}