{
  "clientOperationId": "string",
  "creationTimestamp": "string",
  "description": "string",
  "endTime": "string",
  "error": {
    "errors": [
      {
        "code": "string",
        "location": "string",
        "message": "string"
      },
      {
        "code": "string",
        "location": "string",
        "message": "string"
      },
      {
        "code": "string",
        "location": "string",
        "message": "string"
      },
      {
        "code": "string",
        "location": "string",
        "message": "string"
      },
      {
        "code": "string",
        "location": "string",
        "message": "string"
      }
    ]
  },
  "httpErrorMessage": "string",
  "httpErrorStatusCode": 9,
  "id": "string",
  "insertTime": "string",
  "kind": "compute#operation",
  "name": "string",
  "operationType": "string",
  "progress": 9,
  "region": "string",
  "selfLink": "string",
  "startTime": "string",
  "status": "DONE",
  "statusMessage": "string",
  "targetId": "string",
  "targetLink": "string",
  "user": "string",
  "warnings": [
    {
      "code": "NO_RESULTS_ON_PAGE",
      "data": [
        {
          "key": "string",
          "value": "string"
        },
        {
          "key": "string",
          "value": "string"
        },
        {
          "key": "string",
          "value": "string"
        },
        {
          "key": "string",
          "value": "string"
        },
        {
          "key": "string",
          "value": "string"
        },
        {
          "key": "string",
          "value": "string"
        },
        {
          "key": "string",
          "value": "string"
        },
        {
          "key": "string",
          "value": "string"
        },
        {
          "key": "string",
          "value": "string"
        },
        {
          "key": "string",
          "value": "string"
        }
      ],
      "message": "string"
    },
    {
      "code": "NEXT_HOP_INSTANCE_NOT_FOUND",
      "data": [
        {
          "key": "string",
          "value": "string"
        },
        {
          "key": "string",
          "value": "string"
        },
        {
          "key": "string",
          "value": "string"
        },
        {
          "key": "string",
          "value": "string"
        },
        {
          "key": "string",
          "value": "string"
        },
        {
          "key": "string",
          "value": "string"
        },
        {
          "key": "string",
          "value": "string"
        },
        {
          "key": "string",
          "value": "string"
        },
        {
          "key": "string",
          "value": "string"
        },
        {
          "key": "string",
          "value": "string"
        }
      ],
      "message": "string"
    },
    {
      "code": "UNREACHABLE",
      "data": [
        {
          "key": "string",
          "value": "string"
        },
        {
          "key": "string",
          "value": "string"
        },
        {
          "key": "string",
          "value": "string"
        }
      ],
      "message": "string"
    },
    {
      "code": "INJECTED_KERNELS_DEPRECATED",
      "data": [
        {
          "key": "string",
          "value": "string"
        },
        {
          "key": "string",
          "value": "string"
        },
        {
          "key": "string",
          "value": "string"
        },
        {
          "key": "string",
          "value": "string"
        },
        {
          "key": "string",
          "value": "string"
        }
      ],
      "message": "string"
    },
    {
      "code": "DEPRECATED_TYPE_USED",
      "data": [
        {
          "key": "string",
          "value": "string"
        },
        {
          "key": "string",
          "value": "string"
        },
        {
          "key": "string",
          "value": "string"
        },
        {
          "key": "string",
          "value": "string"
        },
        {
          "key": "string",
          "value": "string"
        },
        {
          "key": "string",
          "value": "string"
        },
        {
          "key": "string",
          "value": "string"
        },
        {
          "key": "string",
          "value": "string"
        },
        {
          "key": "string",
          "value": "string"
        }
      ],
      "message": "string"
    },
    {
      "code": "NEXT_HOP_NOT_RUNNING",
      "data": [
        {
          "key": "string",
          "value": "string"
        },
        {
          "key": "string",
          "value": "string"
        },
        {
          "key": "string",
          "value": "string"
        },
        {
          "key": "string",
          "value": "string"
        },
        {
          "key": "string",
          "value": "string"
        },
        {
          "key": "string",
          "value": "string"
        },
        {
          "key": "string",
          "value": "string"
        },
        {
          "key": "string",
          "value": "string"
        },
        {
          "key": "string",
          "value": "string"
        },
        {
          "key": "string",
          "value": "string"
        }
      ],
      "message": "string"
    }
  ],
  "zone": "string"
}