{
  "id": "Adapter-gcp_compute",
  "type": "GcpCompute",
  "properties": {
    "host": "compute.googleapis.com",
    "port": 443,
    "choosepath": "",
    "base_path": "/compute",
    "version": "v1",
    "cache_location": "none",
    "encode_pathvars": true,
    "encode_queryvars": true,
    "save_metric": false,
    "stub": false,
    "protocol": "https",
    "authentication": {
      "auth_method": "no_authentication",
      "username": "username",
      "password": "password",
      "token": "token",
      "invalid_token_error": 401,
      "token_timeout": 3600000,
      "token_cache": "local",
      "auth_field": "header.headers.Authorization",
      "auth_field_format": "Bearer {token}",
      "auth_logging": false,
      "client_id": "",
      "client_secret": "",
      "grant_type": "",
      "sensitive": [],
      "sso": {
        "protocol": "",
        "host": "",
        "port": 0
      },
      "multiStepAuthCalls": [
        {
          "name": "",
          "requestFields": {},
          "responseFields": {},
          "successfullResponseCode": 200
        }
      ],
      "configureGtoken": {
        "email": "",
        "scope": "https://www.googleapis.com/auth/cloud-platform",
        "sub": "",
        "keyFile": "/opt/pronghorn/RENAME_TO_YOUR_KEYFILE.json",
        "key": "",
        "additionalClaims": "",
        "eagerRefreshThresholdMillis": 300000
      }
    },
    "healthcheck": {
      "type": "startup",
      "frequency": 600000,
      "query_object": {},
      "addlHeaders": {}
    },
    "throttle": {
      "throttle_enabled": false,
      "number_pronghorns": 1,
      "sync_async": "sync",
      "max_in_queue": 1000,
      "concurrent_max": 1,
      "expire_timeout": 0,
      "avg_runtime": 200,
      "priorities": [
        {
          "value": 0,
          "percent": 100
        }
      ]
    },
    "request": {
      "number_redirects": 0,
      "number_retries": 3,
      "limit_retry_error": [
        0
      ],
      "failover_codes": [],
      "attempt_timeout": 5000,
      "global_request": {
        "payload": {},
        "uriOptions": {},
        "addlHeaders": {},
        "authData": {}
      },
      "healthcheck_on_timeout": true,
      "return_raw": false,
      "archiving": false,
      "return_request": false
    },
    "proxy": {
      "enabled": false,
      "host": "",
      "port": 1,
      "protocol": "http",
      "username": "",
      "password": ""
    },
    "ssl": {
      "ecdhCurve": "",
      "enabled": false,
      "accept_invalid_cert": false,
      "ca_file": "",
      "key_file": "",
      "cert_file": "",
      "secure_protocol": "",
      "ciphers": ""
    },
    "mongo": {
      "host": "",
      "port": 0,
      "database": "",
      "username": "",
      "password": "",
      "replSet": "",
      "db_ssl": {
        "enabled": false,
        "accept_invalid_cert": false,
        "ca_file": "",
        "key_file": "",
        "cert_file": ""
      }
    },
    "devicebroker": {
      "enabled": true,
      "getDevice": [
        {
          "path": "/{project}/global/networks",
          "method": "GET",
          "query": {},
          "body": {},
          "headers": {},
          "handleFailure": "ignore",
          "requestFields": {
            "project": "{project}"
          },
          "responseDatakey": "items",
          "responseFields": {
            "name": "{name}",
            "ostype": "{kind}",
            "ostypePrefix": "VPC Network-",
            "ipaddress": "{id}",
            "port": "{selfLinkWithId}"
          }
        }
      ],
      "getDevicesFiltered": [
        {
          "path": "/{project}/global/networks",
          "method": "GET",
          "pagination": {
            "offsetVar": "",
            "limitVar": "",
            "incrementBy": "limit",
            "requestLocation": "query"
          },
          "query": {},
          "body": {},
          "headers": {},
          "handleFailure": "ignore",
          "requestFields": {
            "project": "helical-crowbar-382719"
          },
          "responseDatakey": "items",
          "responseFields": {
            "name": "{name}",
            "ostype": "{kind}",
            "ostypePrefix": "VPC Network-",
            "ipaddress": "{id}",
            "port": "{selfLinkWithId}",
            "project": "{project}"
          }
        }
      ],
      "isAlive": [
        {
          "path": "/{project}/global/networks/{network}",
          "method": "GET",
          "query": {},
          "body": {},
          "headers": {},
          "handleFailure": "ignore",
          "requestFields": {
            "project": "{project}",
            "network": ""
          },
          "responseDatakey": "",
          "responseFields": {}
        }
      ],
      "getConfig": [
        {
          "path": "/{project}/global/networks/{network}",
          "method": "GET",
          "query": {},
          "body": {},
          "headers": {},
          "handleFailure": "ignore",
          "requestFields": {
            "project": "{project}",
            "network": ""
          },
          "responseDatakey": "",
          "responseFields": {}
        }
      ],
      "getCount": [
        {
          "path": "/{project}/global/networks",
          "method": "GET",
          "query": {},
          "body": {},
          "headers": {},
          "handleFailure": "ignore",
          "requestFields": {
            "project": "helical-crowbar-382719"
          },
          "responseDatakey": "items",
          "responseFields": {}
        }
      ]
    },
    "cache": {
      "enabled": false,
      "entities": [
        {
          "entityType": "device",
          "frequency": 3600,
          "flushOnFail": false,
          "limit": 1000,
          "retryAttempts": 5,
          "sort": true,
          "populate": [
            {
              "path": "/{project}/global/networks",
              "method": "GET",
              "pagination": {
                "offsetVar": "",
                "limitVar": "",
                "incrementBy": "limit",
                "requestLocation": "query"
              },
              "query": {},
              "body": {},
              "headers": {},
              "handleFailure": "ignore",
              "requestFields": {
                "project": "helical-crowbar-382719"
              },
              "responseDatakey": "items",
              "responseFields": {
                "name": "{name}",
                "ostype": "{kind}",
                "ostypePrefix": "VPC Network-",
                "ipaddress": "{id}",
                "port": "{selfLinkWithId}",
                "project": "{project}"
              }
            }
          ],
          "cachedTasks": [
            {
              "name": "",
              "filterField": "",
              "filterLoc": ""
            }
          ]
        }
      ]
    }
  },
  "groups": [],
  "brokers": [],
  "logLevel": "none",
  "timeout": 120000
}