{
  "id": "string",
  "items": [
    {
      "chargesUseFee": false,
      "creationTimestamp": "string",
      "description": "string",
      "id": "string",
      "kind": "compute#license",
      "licenseCode": "string",
      "name": "string",
      "resourceRequirements": {
        "minGuestCpuCount": 9,
        "minMemoryMb": 7
      },
      "selfLink": "string",
      "transferable": true
    },
    {
      "chargesUseFee": false,
      "creationTimestamp": "string",
      "description": "string",
      "id": "string",
      "kind": "compute#license",
      "licenseCode": "string",
      "name": "string",
      "resourceRequirements": {
        "minGuestCpuCount": 9,
        "minMemoryMb": 3
      },
      "selfLink": "string",
      "transferable": false
    },
    {
      "chargesUseFee": true,
      "creationTimestamp": "string",
      "description": "string",
      "id": "string",
      "kind": "compute#license",
      "licenseCode": "string",
      "name": "string",
      "resourceRequirements": {
        "minGuestCpuCount": 10,
        "minMemoryMb": 3
      },
      "selfLink": "string",
      "transferable": true
    },
    {
      "chargesUseFee": true,
      "creationTimestamp": "string",
      "description": "string",
      "id": "string",
      "kind": "compute#license",
      "licenseCode": "string",
      "name": "string",
      "resourceRequirements": {
        "minGuestCpuCount": 1,
        "minMemoryMb": 2
      },
      "selfLink": "string",
      "transferable": true
    },
    {
      "chargesUseFee": false,
      "creationTimestamp": "string",
      "description": "string",
      "id": "string",
      "kind": "compute#license",
      "licenseCode": "string",
      "name": "string",
      "resourceRequirements": {
        "minGuestCpuCount": 3,
        "minMemoryMb": 3
      },
      "selfLink": "string",
      "transferable": true
    },
    {
      "chargesUseFee": false,
      "creationTimestamp": "string",
      "description": "string",
      "id": "string",
      "kind": "compute#license",
      "licenseCode": "string",
      "name": "string",
      "resourceRequirements": {
        "minGuestCpuCount": 1,
        "minMemoryMb": 6
      },
      "selfLink": "string",
      "transferable": true
    },
    {
      "chargesUseFee": false,
      "creationTimestamp": "string",
      "description": "string",
      "id": "string",
      "kind": "compute#license",
      "licenseCode": "string",
      "name": "string",
      "resourceRequirements": {
        "minGuestCpuCount": 1,
        "minMemoryMb": 10
      },
      "selfLink": "string",
      "transferable": true
    },
    {
      "chargesUseFee": true,
      "creationTimestamp": "string",
      "description": "string",
      "id": "string",
      "kind": "compute#license",
      "licenseCode": "string",
      "name": "string",
      "resourceRequirements": {
        "minGuestCpuCount": 5,
        "minMemoryMb": 4
      },
      "selfLink": "string",
      "transferable": false
    },
    {
      "chargesUseFee": true,
      "creationTimestamp": "string",
      "description": "string",
      "id": "string",
      "kind": "compute#license",
      "licenseCode": "string",
      "name": "string",
      "resourceRequirements": {
        "minGuestCpuCount": 10,
        "minMemoryMb": 1
      },
      "selfLink": "string",
      "transferable": false
    }
  ],
  "nextPageToken": "string",
  "selfLink": "string",
  "warning": {
    "code": "EXTERNAL_API_WARNING",
    "data": [
      {
        "key": "string",
        "value": "string"
      },
      {
        "key": "string",
        "value": "string"
      },
      {
        "key": "string",
        "value": "string"
      },
      {
        "key": "string",
        "value": "string"
      },
      {
        "key": "string",
        "value": "string"
      },
      {
        "key": "string",
        "value": "string"
      }
    ],
    "message": "string"
  }
}