{
  "$id": ".system-schemaTokenReq.json",
  "type": "object",
  "schema": "http://json-schema.org/draft-07/schema#",
  "translate": true,
  "dynamicfields": true,
  "properties": {
    "ph_request_type": {
      "type": "string",
      "description": "type of request (internal to adapter)",
      "default": "getToken",
      "enum": [
        "getToken"
      ],
      "external_name": "ph_request_type"
    },
    "username": {
      "type": "string",
      "description": "username to log in with",
      "parse": false,
      "encode": false,
      "encrypt": {
        "type": "AES",
        "key": ""
      },
      "external_name": "username"
    },
    "password": {
      "type": "string",
      "description": "password to log in with",
      "parse": false,
      "encode": false,
      "encrypt": {
        "type": "AES",
        "key": ""
      },
      "external_name": "password"
    },
    "client_id": {
      "type": "string",
      "description": "client id for GCP",
      "default": "718960358552-diplj6e38632nlk2afli5lvuraepuaa5.apps.googleusercontent.com",
      "parse": false,
      "encode": false,
      "encrypt": {
        "type": "AES",
        "key": ""
      },
      "external_name": "client_id"
    },
    "redirect_url": {
      "type": "string",
      "description": "redirect url",
      "default": "https://test.iap.com",
      "parse": false,
      "encode": false,
      "encrypt": {
        "type": "AES",
        "key": ""
      },
      "external_name": "redirect_url"
    },
    "grant_type": {
      "type": "string",
      "description": "grant type for GCP",
      "default": "code",
      "parse": false,
      "encode": false,
      "encrypt": {
        "type": "AES",
        "key": ""
      },
      "external_name": "grant_type"
    },
    "scope": {
      "type": "string",
      "description": "the scope of the application endpoint",
      "default": "https://www.googleapis.com/auth/compute",
      "parse": false,
      "encode": false,
      "encrypt": {
        "type": "AES",
        "key": ""
      },
      "external_name": "scope"
    },
    "client_secret": {
      "type": "string",
      "description": "client secret",
      "default": "9JBgk9KppndvbxXT3nWMUCle",
      "parse": false,
      "encode": false,
      "encrypt": {
        "type": "AES",
        "key": ""
      },
      "external_name": "client_secret"
    }
  },
  "definitions": {}
}