{
  "autoCreated": true,
  "creationTimestamp": "string",
  "description": "string",
  "diskSizeGb": "string",
  "downloadBytes": "string",
  "id": "string",
  "kind": "compute#snapshot",
  "labelFingerprint": "string",
  "labels": {},
  "licenseCodes": [
    "string",
    "string",
    "string",
    "string",
    "string",
    "string",
    "string"
  ],
  "licenses": [
    "string",
    "string",
    "string",
    "string"
  ],
  "name": "string",
  "selfLink": "string",
  "snapshotEncryptionKey": {
    "kmsKeyName": "string",
    "kmsKeyServiceAccount": "string",
    "rawKey": "string",
    "sha256": "string"
  },
  "sourceDisk": "string",
  "sourceDiskEncryptionKey": {
    "kmsKeyName": "string",
    "kmsKeyServiceAccount": "string",
    "rawKey": "string",
    "sha256": "string"
  },
  "sourceDiskId": "string",
  "status": "READY",
  "storageBytes": "string",
  "storageBytesStatus": "UP_TO_DATE",
  "storageLocations": [
    "string",
    "string",
    "string",
    "string",
    "string",
    "string",
    "string",
    "string"
  ]
}