{
  "id": "string",
  "items": {},
  "kind": "compute#reservationAggregatedList",
  "nextPageToken": "string",
  "selfLink": "string",
  "warning": {
    "code": "RESOURCE_NOT_DELETED",
    "data": [
      {
        "key": "string",
        "value": "string"
      },
      {
        "key": "string",
        "value": "string"
      },
      {
        "key": "string",
        "value": "string"
      },
      {
        "key": "string",
        "value": "string"
      },
      {
        "key": "string",
        "value": "string"
      },
      {
        "key": "string",
        "value": "string"
      },
      {
        "key": "string",
        "value": "string"
      }
    ],
    "message": "string"
  }
}