{
  "id": "string",
  "items": [
    {
      "bucketName": "string",
      "cdnPolicy": {
        "signedUrlCacheMaxAgeSec": "string",
        "signedUrlKeyNames": [
          "string",
          "string"
        ]
      },
      "creationTimestamp": "string",
      "description": "string",
      "enableCdn": true,
      "id": "string",
      "kind": "compute#backendBucket",
      "name": "string",
      "selfLink": "string"
    },
    {
      "bucketName": "string",
      "cdnPolicy": {
        "signedUrlCacheMaxAgeSec": "string",
        "signedUrlKeyNames": [
          "string",
          "string",
          "string",
          "string",
          "string",
          "string",
          "string"
        ]
      },
      "creationTimestamp": "string",
      "description": "string",
      "enableCdn": false,
      "id": "string",
      "kind": "compute#backendBucket",
      "name": "string",
      "selfLink": "string"
    },
    {
      "bucketName": "string",
      "cdnPolicy": {
        "signedUrlCacheMaxAgeSec": "string",
        "signedUrlKeyNames": [
          "string",
          "string",
          "string",
          "string"
        ]
      },
      "creationTimestamp": "string",
      "description": "string",
      "enableCdn": false,
      "id": "string",
      "kind": "compute#backendBucket",
      "name": "string",
      "selfLink": "string"
    },
    {
      "bucketName": "string",
      "cdnPolicy": {
        "signedUrlCacheMaxAgeSec": "string",
        "signedUrlKeyNames": [
          "string",
          "string"
        ]
      },
      "creationTimestamp": "string",
      "description": "string",
      "enableCdn": true,
      "id": "string",
      "kind": "compute#backendBucket",
      "name": "string",
      "selfLink": "string"
    },
    {
      "bucketName": "string",
      "cdnPolicy": {
        "signedUrlCacheMaxAgeSec": "string",
        "signedUrlKeyNames": [
          "string",
          "string",
          "string",
          "string",
          "string",
          "string",
          "string",
          "string",
          "string"
        ]
      },
      "creationTimestamp": "string",
      "description": "string",
      "enableCdn": true,
      "id": "string",
      "kind": "compute#backendBucket",
      "name": "string",
      "selfLink": "string"
    },
    {
      "bucketName": "string",
      "cdnPolicy": {
        "signedUrlCacheMaxAgeSec": "string",
        "signedUrlKeyNames": [
          "string",
          "string",
          "string",
          "string"
        ]
      },
      "creationTimestamp": "string",
      "description": "string",
      "enableCdn": false,
      "id": "string",
      "kind": "compute#backendBucket",
      "name": "string",
      "selfLink": "string"
    },
    {
      "bucketName": "string",
      "cdnPolicy": {
        "signedUrlCacheMaxAgeSec": "string",
        "signedUrlKeyNames": [
          "string",
          "string",
          "string",
          "string"
        ]
      },
      "creationTimestamp": "string",
      "description": "string",
      "enableCdn": true,
      "id": "string",
      "kind": "compute#backendBucket",
      "name": "string",
      "selfLink": "string"
    },
    {
      "bucketName": "string",
      "cdnPolicy": {
        "signedUrlCacheMaxAgeSec": "string",
        "signedUrlKeyNames": [
          "string",
          "string",
          "string",
          "string",
          "string",
          "string"
        ]
      },
      "creationTimestamp": "string",
      "description": "string",
      "enableCdn": false,
      "id": "string",
      "kind": "compute#backendBucket",
      "name": "string",
      "selfLink": "string"
    },
    {
      "bucketName": "string",
      "cdnPolicy": {
        "signedUrlCacheMaxAgeSec": "string",
        "signedUrlKeyNames": [
          "string",
          "string",
          "string",
          "string",
          "string",
          "string",
          "string"
        ]
      },
      "creationTimestamp": "string",
      "description": "string",
      "enableCdn": false,
      "id": "string",
      "kind": "compute#backendBucket",
      "name": "string",
      "selfLink": "string"
    }
  ],
  "kind": "compute#backendBucketList",
  "nextPageToken": "string",
  "selfLink": "string",
  "warning": {
    "code": "DEPRECATED_RESOURCE_USED",
    "data": [
      {
        "key": "string",
        "value": "string"
      },
      {
        "key": "string",
        "value": "string"
      },
      {
        "key": "string",
        "value": "string"
      },
      {
        "key": "string",
        "value": "string"
      }
    ],
    "message": "string"
  }
}