{
  "creationTimestamp": "string",
  "description": "string",
  "id": "string",
  "instance": "string",
  "kind": "compute#targetInstance",
  "name": "string",
  "natPolicy": "NO_NAT",
  "selfLink": "string",
  "zone": "string"
}