{
  "id": "string",
  "items": [
    {
      "creationTimestamp": "string",
      "defaultDiskSizeGb": "string",
      "deprecated": {
        "deleted": "string",
        "deprecated": "string",
        "obsolete": "string",
        "replacement": "string",
        "state": "ACTIVE"
      },
      "description": "string",
      "id": "string",
      "kind": "compute#diskType",
      "name": "string",
      "region": "string",
      "selfLink": "string",
      "validDiskSize": "string",
      "zone": "string"
    },
    {
      "creationTimestamp": "string",
      "defaultDiskSizeGb": "string",
      "deprecated": {
        "deleted": "string",
        "deprecated": "string",
        "obsolete": "string",
        "replacement": "string",
        "state": "ACTIVE"
      },
      "description": "string",
      "id": "string",
      "kind": "compute#diskType",
      "name": "string",
      "region": "string",
      "selfLink": "string",
      "validDiskSize": "string",
      "zone": "string"
    },
    {
      "creationTimestamp": "string",
      "defaultDiskSizeGb": "string",
      "deprecated": {
        "deleted": "string",
        "deprecated": "string",
        "obsolete": "string",
        "replacement": "string",
        "state": "DEPRECATED"
      },
      "description": "string",
      "id": "string",
      "kind": "compute#diskType",
      "name": "string",
      "region": "string",
      "selfLink": "string",
      "validDiskSize": "string",
      "zone": "string"
    },
    {
      "creationTimestamp": "string",
      "defaultDiskSizeGb": "string",
      "deprecated": {
        "deleted": "string",
        "deprecated": "string",
        "obsolete": "string",
        "replacement": "string",
        "state": "DEPRECATED"
      },
      "description": "string",
      "id": "string",
      "kind": "compute#diskType",
      "name": "string",
      "region": "string",
      "selfLink": "string",
      "validDiskSize": "string",
      "zone": "string"
    },
    {
      "creationTimestamp": "string",
      "defaultDiskSizeGb": "string",
      "deprecated": {
        "deleted": "string",
        "deprecated": "string",
        "obsolete": "string",
        "replacement": "string",
        "state": "OBSOLETE"
      },
      "description": "string",
      "id": "string",
      "kind": "compute#diskType",
      "name": "string",
      "region": "string",
      "selfLink": "string",
      "validDiskSize": "string",
      "zone": "string"
    },
    {
      "creationTimestamp": "string",
      "defaultDiskSizeGb": "string",
      "deprecated": {
        "deleted": "string",
        "deprecated": "string",
        "obsolete": "string",
        "replacement": "string",
        "state": "DEPRECATED"
      },
      "description": "string",
      "id": "string",
      "kind": "compute#diskType",
      "name": "string",
      "region": "string",
      "selfLink": "string",
      "validDiskSize": "string",
      "zone": "string"
    },
    {
      "creationTimestamp": "string",
      "defaultDiskSizeGb": "string",
      "deprecated": {
        "deleted": "string",
        "deprecated": "string",
        "obsolete": "string",
        "replacement": "string",
        "state": "ACTIVE"
      },
      "description": "string",
      "id": "string",
      "kind": "compute#diskType",
      "name": "string",
      "region": "string",
      "selfLink": "string",
      "validDiskSize": "string",
      "zone": "string"
    }
  ],
  "kind": "compute#diskTypeList",
  "nextPageToken": "string",
  "selfLink": "string",
  "warning": {
    "code": "DISK_SIZE_LARGER_THAN_IMAGE_SIZE",
    "data": [
      {
        "key": "string",
        "value": "string"
      },
      {
        "key": "string",
        "value": "string"
      }
    ],
    "message": "string"
  }
}