{
  "actions": [
    {
      "name": "addFirewallPolicyAssociation",
      "protocol": "REST",
      "method": "POST",
      "entitypath": "{base_path}/{version}/locations/global/{pathv1}/addAssociation?{query}",
      "requestSchema": "schema.json",
      "responseSchema": "schema.json",
      "timeout": 0,
      "sendEmpty": false,
      "sendGetBody": false,
      "requestDatatype": "JSON",
      "responseDatatype": "JSON",
      "headers": {},
      "responseObjects": [
        {
          "type": "default",
          "key": "",
          "mockFile": "mockdatafiles/addFirewallPolicyAssociation-default.json"
        }
      ]
    },
    {
      "name": "addFirewallPolicyRule",
      "protocol": "REST",
      "method": "POST",
      "entitypath": "{base_path}/{version}/locations/global/{pathv1}/addRule?{query}",
      "requestSchema": "schema.json",
      "responseSchema": "schema.json",
      "timeout": 0,
      "sendEmpty": false,
      "sendGetBody": false,
      "requestDatatype": "JSON",
      "responseDatatype": "JSON",
      "headers": {},
      "responseObjects": [
        {
          "type": "default",
          "key": "",
          "mockFile": "mockdatafiles/addFirewallPolicyRule-default.json"
        }
      ]
    },
    {
      "name": "cloneFirewallPolicyRule",
      "protocol": "REST",
      "method": "POST",
      "entitypath": "{base_path}/{version}/locations/global/{pathv1}/cloneRules?{query}",
      "requestSchema": "schema.json",
      "responseSchema": "schema.json",
      "timeout": 0,
      "sendEmpty": true,
      "sendGetBody": false,
      "requestDatatype": "JSON",
      "responseDatatype": "JSON",
      "headers": {},
      "responseObjects": [
        {
          "type": "default",
          "key": "",
          "mockFile": "mockdatafiles/cloneFirewallPolicyRule-default.json"
        }
      ]
    },
    {
      "name": "deleteFirewallPolicy",
      "protocol": "REST",
      "method": "DELETE",
      "entitypath": "{base_path}/{version}/locations/global/{pathv1}?{query}",
      "requestSchema": "schema.json",
      "responseSchema": "schema.json",
      "timeout": 0,
      "sendEmpty": true,
      "sendGetBody": false,
      "requestDatatype": "JSON",
      "responseDatatype": "JSON",
      "headers": {},
      "responseObjects": [
        {
          "type": "default",
          "key": "",
          "mockFile": "mockdatafiles/deleteFirewallPolicy-default.json"
        }
      ]
    },
    {
      "name": "getFirewallPolicy",
      "protocol": "REST",
      "method": "GET",
      "entitypath": "{base_path}/{version}/locations/global/{pathv1}?{query}",
      "requestSchema": "schema.json",
      "responseSchema": "schema.json",
      "timeout": 0,
      "sendEmpty": false,
      "sendGetBody": false,
      "requestDatatype": "JSON",
      "responseDatatype": "JSON",
      "headers": {},
      "responseObjects": [
        {
          "type": "default",
          "key": "",
          "mockFile": "mockdatafiles/getFirewallPolicy-default.json"
        }
      ]
    },
    {
      "name": "getFirewallPolicyAssociation",
      "protocol": "REST",
      "method": "GET",
      "entitypath": "{base_path}/{version}/locations/global/{pathv1}/getAssociation?{query}",
      "requestSchema": "schema.json",
      "responseSchema": "schema.json",
      "timeout": 0,
      "sendEmpty": false,
      "sendGetBody": false,
      "requestDatatype": "JSON",
      "responseDatatype": "JSON",
      "headers": {},
      "responseObjects": [
        {
          "type": "default",
          "key": "",
          "mockFile": "mockdatafiles/getFirewallPolicyAssociation-default.json"
        }
      ]
    },
    {
      "name": "getFirewallPolicyIamPolicy",
      "protocol": "REST",
      "method": "GET",
      "entitypath": "{base_path}/{version}/locations/global/{pathv1}/getIamPolicy?{query}",
      "requestSchema": "schema.json",
      "responseSchema": "schema.json",
      "timeout": 0,
      "sendEmpty": false,
      "sendGetBody": false,
      "requestDatatype": "JSON",
      "responseDatatype": "JSON",
      "headers": {},
      "responseObjects": [
        {
          "type": "default",
          "key": "",
          "mockFile": "mockdatafiles/getFirewallPolicyIamPolicy-default.json"
        }
      ]
    },
    {
      "name": "getFirewallPolicyRule",
      "protocol": "REST",
      "method": "GET",
      "entitypath": "{base_path}/{version}/locations/global/{pathv1}/getRule?{query}",
      "requestSchema": "schema.json",
      "responseSchema": "schema.json",
      "timeout": 0,
      "sendEmpty": false,
      "sendGetBody": false,
      "requestDatatype": "JSON",
      "responseDatatype": "JSON",
      "headers": {},
      "responseObjects": [
        {
          "type": "default",
          "key": "",
          "mockFile": "mockdatafiles/getFirewallPolicyRule-default.json"
        }
      ]
    },
    {
      "name": "insertFirewallPolicy",
      "protocol": "REST",
      "method": "POST",
      "entitypath": "{base_path}/{version}/locations/global/firewallPolicies?{query}",
      "requestSchema": "schema.json",
      "responseSchema": "schema.json",
      "timeout": 0,
      "sendEmpty": false,
      "sendGetBody": false,
      "requestDatatype": "JSON",
      "responseDatatype": "JSON",
      "headers": {},
      "responseObjects": [
        {
          "type": "default",
          "key": "",
          "mockFile": "mockdatafiles/insertFirewallPolicy-default.json"
        }
      ]
    },
    {
      "name": "listFirewallPolicy",
      "protocol": "REST",
      "method": "GET",
      "entitypath": "{base_path}/{version}/locations/global/firewallPolicies?{query}",
      "requestSchema": "schema.json",
      "responseSchema": "schema.json",
      "timeout": 0,
      "sendEmpty": false,
      "sendGetBody": false,
      "requestDatatype": "JSON",
      "responseDatatype": "JSON",
      "headers": {},
      "responseObjects": [
        {
          "type": "default",
          "key": "",
          "mockFile": "mockdatafiles/listFirewallPolicy-default.json"
        }
      ]
    },
    {
      "name": "listFirewallPolicyAssociations",
      "protocol": "REST",
      "method": "GET",
      "entitypath": "{base_path}/{version}/locations/global/firewallPolicies/listAssociations?{query}",
      "requestSchema": "schema.json",
      "responseSchema": "schema.json",
      "timeout": 0,
      "sendEmpty": false,
      "sendGetBody": false,
      "requestDatatype": "JSON",
      "responseDatatype": "JSON",
      "headers": {},
      "responseObjects": [
        {
          "type": "default",
          "key": "",
          "mockFile": "mockdatafiles/listFirewallPolicyAssociations-default.json"
        }
      ]
    },
    {
      "name": "moveFirewallPolicy",
      "protocol": "REST",
      "method": "POST",
      "entitypath": "{base_path}/{version}/locations/global/{pathv1}/move?{query}",
      "requestSchema": "schema.json",
      "responseSchema": "schema.json",
      "timeout": 0,
      "sendEmpty": true,
      "sendGetBody": false,
      "requestDatatype": "JSON",
      "responseDatatype": "JSON",
      "headers": {},
      "responseObjects": [
        {
          "type": "default",
          "key": "",
          "mockFile": "mockdatafiles/moveFirewallPolicy-default.json"
        }
      ]
    },
    {
      "name": "patchFirewallPolicy",
      "protocol": "REST",
      "method": "PATCH",
      "entitypath": "{base_path}/{version}/locations/global/{pathv1}?{query}",
      "requestSchema": "schema.json",
      "responseSchema": "schema.json",
      "timeout": 0,
      "sendEmpty": false,
      "sendGetBody": false,
      "requestDatatype": "JSON",
      "responseDatatype": "JSON",
      "headers": {},
      "responseObjects": [
        {
          "type": "default",
          "key": "",
          "mockFile": "mockdatafiles/patchFirewallPolicy-default.json"
        }
      ]
    },
    {
      "name": "patchFirewallPolicyRule",
      "protocol": "REST",
      "method": "PATCH",
      "entitypath": "{base_path}/{version}/locations/global/{pathv1}/patchRule?{query}",
      "requestSchema": "schema.json",
      "responseSchema": "schema.json",
      "timeout": 0,
      "sendEmpty": false,
      "sendGetBody": false,
      "requestDatatype": "JSON",
      "responseDatatype": "JSON",
      "headers": {},
      "responseObjects": [
        {
          "type": "default",
          "key": "",
          "mockFile": "mockdatafiles/patchFirewallPolicyRule-default.json"
        }
      ]
    },
    {
      "name": "removeFirewallPolicyAssociation",
      "protocol": "REST",
      "method": "POST",
      "entitypath": "{base_path}/{version}/locations/global/{pathv1}/removeAssociation?{query}",
      "requestSchema": "schema.json",
      "responseSchema": "schema.json",
      "timeout": 0,
      "sendEmpty": true,
      "sendGetBody": false,
      "requestDatatype": "JSON",
      "responseDatatype": "JSON",
      "headers": {},
      "responseObjects": [
        {
          "type": "default",
          "key": "",
          "mockFile": "mockdatafiles/removeFirewallPolicyAssociation-default.json"
        }
      ]
    },
    {
      "name": "removeFirewallPolicyRule",
      "protocol": "REST",
      "method": "POST",
      "entitypath": "{base_path}/{version}/locations/global/{pathv1}/removeRule?{query}",
      "requestSchema": "schema.json",
      "responseSchema": "schema.json",
      "timeout": 0,
      "sendEmpty": true,
      "sendGetBody": false,
      "requestDatatype": "JSON",
      "responseDatatype": "JSON",
      "headers": {},
      "responseObjects": [
        {
          "type": "default",
          "key": "",
          "mockFile": "mockdatafiles/removeFirewallPolicyRule-default.json"
        }
      ]
    },
    {
      "name": "setFirewallPolicyIamPolicy",
      "protocol": "REST",
      "method": "POST",
      "entitypath": "{base_path}/{version}/locations/global/{pathv1}/setIamPolicy?{query}",
      "requestSchema": "schema.json",
      "responseSchema": "schema.json",
      "timeout": 0,
      "sendEmpty": false,
      "sendGetBody": false,
      "requestDatatype": "JSON",
      "responseDatatype": "JSON",
      "headers": {},
      "responseObjects": [
        {
          "type": "default",
          "key": "",
          "mockFile": "mockdatafiles/setFirewallPolicyIamPolicy-default.json"
        }
      ]
    },
    {
      "name": "testFirewallPolicyIamPermissions",
      "protocol": "REST",
      "method": "POST",
      "entitypath": "{base_path}/{version}/locations/global/{pathv1}/testIamPermissions?{query}",
      "requestSchema": "schema.json",
      "responseSchema": "schema.json",
      "timeout": 0,
      "sendEmpty": false,
      "sendGetBody": false,
      "requestDatatype": "JSON",
      "responseDatatype": "JSON",
      "headers": {},
      "responseObjects": [
        {
          "type": "default",
          "key": "",
          "mockFile": "mockdatafiles/testFirewallPolicyIamPermissions-default.json"
        }
      ]
    }
  ]
}