{
  "id": "string",
  "items": [
    {
      "ipCidrRange": "string",
      "network": "string",
      "secondaryIpRanges": [
        {
          "ipCidrRange": "string",
          "rangeName": "string"
        },
        {
          "ipCidrRange": "string",
          "rangeName": "string"
        },
        {
          "ipCidrRange": "string",
          "rangeName": "string"
        },
        {
          "ipCidrRange": "string",
          "rangeName": "string"
        },
        {
          "ipCidrRange": "string",
          "rangeName": "string"
        },
        {
          "ipCidrRange": "string",
          "rangeName": "string"
        },
        {
          "ipCidrRange": "string",
          "rangeName": "string"
        }
      ],
      "subnetwork": "string"
    },
    {
      "ipCidrRange": "string",
      "network": "string",
      "secondaryIpRanges": [
        {
          "ipCidrRange": "string",
          "rangeName": "string"
        },
        {
          "ipCidrRange": "string",
          "rangeName": "string"
        },
        {
          "ipCidrRange": "string",
          "rangeName": "string"
        },
        {
          "ipCidrRange": "string",
          "rangeName": "string"
        },
        {
          "ipCidrRange": "string",
          "rangeName": "string"
        },
        {
          "ipCidrRange": "string",
          "rangeName": "string"
        }
      ],
      "subnetwork": "string"
    },
    {
      "ipCidrRange": "string",
      "network": "string",
      "secondaryIpRanges": [
        {
          "ipCidrRange": "string",
          "rangeName": "string"
        },
        {
          "ipCidrRange": "string",
          "rangeName": "string"
        },
        {
          "ipCidrRange": "string",
          "rangeName": "string"
        },
        {
          "ipCidrRange": "string",
          "rangeName": "string"
        },
        {
          "ipCidrRange": "string",
          "rangeName": "string"
        },
        {
          "ipCidrRange": "string",
          "rangeName": "string"
        }
      ],
      "subnetwork": "string"
    },
    {
      "ipCidrRange": "string",
      "network": "string",
      "secondaryIpRanges": [
        {
          "ipCidrRange": "string",
          "rangeName": "string"
        },
        {
          "ipCidrRange": "string",
          "rangeName": "string"
        },
        {
          "ipCidrRange": "string",
          "rangeName": "string"
        }
      ],
      "subnetwork": "string"
    }
  ],
  "kind": "compute#usableSubnetworksAggregatedList",
  "nextPageToken": "string",
  "selfLink": "string",
  "warning": {
    "code": "EXTERNAL_API_WARNING",
    "data": [
      {
        "key": "string",
        "value": "string"
      },
      {
        "key": "string",
        "value": "string"
      },
      {
        "key": "string",
        "value": "string"
      },
      {
        "key": "string",
        "value": "string"
      },
      {
        "key": "string",
        "value": "string"
      },
      {
        "key": "string",
        "value": "string"
      }
    ],
    "message": "string"
  }
}