{
  "actions": [
    {
      "name": "getProjectAggregatedForwardingRules",
      "protocol": "REST",
      "method": "GET",
      "entitypath": "{base_path}/{version}/projects/{pathv1}/aggregated/forwardingRules?{query}",
      "requestSchema": "schema.json",
      "responseSchema": "schema.json",
      "timeout": 0,
      "sendEmpty": false,
      "sendGetBody": false,
      "requestDatatype": "JSON",
      "responseDatatype": "JSON",
      "headers": {},
      "responseObjects": [
        {
          "type": "default",
          "key": "",
          "mockFile": "mockdatafiles/getProjectAggregatedForwardingRules-default.json"
        }
      ]
    },
    {
      "name": "getProjectRegionsRegionForwardingRules",
      "protocol": "REST",
      "method": "GET",
      "entitypath": "{base_path}/{version}/projects/{pathv1}/regions/{pathv2}/forwardingRules?{query}",
      "requestSchema": "schema.json",
      "responseSchema": "schema.json",
      "timeout": 0,
      "sendEmpty": false,
      "sendGetBody": false,
      "requestDatatype": "JSON",
      "responseDatatype": "JSON",
      "headers": {},
      "responseObjects": [
        {
          "type": "default",
          "key": "",
          "mockFile": "mockdatafiles/getProjectRegionsRegionForwardingRules-default.json"
        }
      ]
    },
    {
      "name": "postProjectRegionsRegionForwardingRules",
      "protocol": "REST",
      "method": "POST",
      "entitypath": "{base_path}/{version}/projects/{pathv1}/regions/{pathv2}/forwardingRules?{query}",
      "requestSchema": "schema.json",
      "responseSchema": "schema.json",
      "timeout": 0,
      "sendEmpty": false,
      "requestDatatype": "JSON",
      "responseDatatype": "JSON",
      "headers": {},
      "responseObjects": [
        {
          "type": "default",
          "key": "",
          "mockFile": "mockdatafiles/postProjectRegionsRegionForwardingRules-default.json"
        }
      ]
    },
    {
      "name": "deleteProjectRegionsRegionForwardingRulesForwardingRule",
      "protocol": "REST",
      "method": "DELETE",
      "entitypath": "{base_path}/{version}/projects/{pathv1}/regions/{pathv2}/forwardingRules/{pathv3}?{query}",
      "requestSchema": "schema.json",
      "responseSchema": "schema.json",
      "timeout": 0,
      "sendEmpty": false,
      "requestDatatype": "JSON",
      "responseDatatype": "JSON",
      "headers": {},
      "responseObjects": [
        {
          "type": "default",
          "key": "",
          "mockFile": "mockdatafiles/deleteProjectRegionsRegionForwardingRulesForwardingRule-default.json"
        }
      ]
    },
    {
      "name": "getProjectRegionsRegionForwardingRulesForwardingRule",
      "protocol": "REST",
      "method": "GET",
      "entitypath": "{base_path}/{version}/projects/{pathv1}/regions/{pathv2}/forwardingRules/{pathv3}?{query}",
      "requestSchema": "schema.json",
      "responseSchema": "schema.json",
      "timeout": 0,
      "sendEmpty": false,
      "sendGetBody": false,
      "requestDatatype": "JSON",
      "responseDatatype": "JSON",
      "headers": {},
      "responseObjects": [
        {
          "type": "default",
          "key": "",
          "mockFile": "mockdatafiles/getProjectRegionsRegionForwardingRulesForwardingRule-default.json"
        }
      ]
    },
    {
      "name": "patchProjectRegionsRegionForwardingRulesForwardingRule",
      "protocol": "REST",
      "method": "PATCH",
      "entitypath": "{base_path}/{version}/projects/{pathv1}/regions/{pathv2}/forwardingRules/{pathv3}?{query}",
      "requestSchema": "schema.json",
      "responseSchema": "schema.json",
      "timeout": 0,
      "sendEmpty": false,
      "requestDatatype": "JSON",
      "responseDatatype": "JSON",
      "headers": {},
      "responseObjects": [
        {
          "type": "default",
          "key": "",
          "mockFile": "mockdatafiles/patchProjectRegionsRegionForwardingRulesForwardingRule-default.json"
        }
      ]
    },
    {
      "name": "postProjectRegionsRegionForwardingRulesForwardingRuleSetTarget",
      "protocol": "REST",
      "method": "POST",
      "entitypath": "{base_path}/{version}/projects/{pathv1}/regions/{pathv2}/forwardingRules/{pathv3}/setTarget?{query}",
      "requestSchema": "schema.json",
      "responseSchema": "schema.json",
      "timeout": 0,
      "sendEmpty": false,
      "requestDatatype": "JSON",
      "responseDatatype": "JSON",
      "headers": {},
      "responseObjects": [
        {
          "type": "default",
          "key": "",
          "mockFile": "mockdatafiles/postProjectRegionsRegionForwardingRulesForwardingRuleSetTarget-default.json"
        }
      ]
    }
  ]
}