{
    "id": "string",
    "creationTimestamp": "string",
    "name": "string",
    "zone": "string",
    "clientOperationId": "string",
    "operationType": "string",
    "targetLink": "string",
    "targetId": "string",
    "status": "string",
    "statusMessage": "string",
    "user": "string",
    "progress": 1,
    "insertTime": "string",
    "startTime": "string",
    "endTime": "string",
    "error": {
      "errors": [
        {
          "code": "string",
          "location": "string",
          "message": "string"
        }
      ]
    },
    "warnings": [
      {
        "code": "string",
        "message": "string",
        "data": [
          {
            "key": "string",
            "value": "string"
          }
        ]
      }
    ],
    "httpErrorStatusCode": 1,
    "httpErrorMessage": "string",
    "selfLink": "string",
    "region": "string",
    "description": "string",
    "operationGroupId": "string",
    "kind": "string"
  }