{
  "etag": "string",
  "id": "string",
  "items": {},
  "kind": "compute#resourcePolicyAggregatedList",
  "nextPageToken": "string",
  "selfLink": "string",
  "warning": {
    "code": "DISK_SIZE_LARGER_THAN_IMAGE_SIZE",
    "data": [
      {
        "key": "string",
        "value": "string"
      },
      {
        "key": "string",
        "value": "string"
      },
      {
        "key": "string",
        "value": "string"
      }
    ],
    "message": "string"
  }
}