{
    "description": "string",
    "priority": 1,
    "match": {
      "srcIpRanges": [
        "string"
      ],
      "destIpRanges": [
        "string"
      ],
      "layer4Configs": [
        {
          "ipProtocol": "string",
          "ports": [
            "string"
          ]
        }
      ]
    },
    "action": "string",
    "direction": "string",
    "targetResources": [
      "string"
    ],
    "enableLogging": true,
    "ruleTupleCount": 1,
    "targetServiceAccounts": [
      "string"
    ],
    "disabled": true,
    "kind": "string"
  }