{
  "actions": [
    {
      "name": "getProjectRegionsRegionTargetHttpProxies",
      "protocol": "REST",
      "method": "GET",
      "entitypath": "{base_path}/{version}/projects/{pathv1}/regions/{pathv2}/targetHttpProxies?{query}",
      "requestSchema": "schema.json",
      "responseSchema": "schema.json",
      "timeout": 0,
      "sendEmpty": false,
      "sendGetBody": false,
      "requestDatatype": "JSON",
      "responseDatatype": "JSON",
      "headers": {},
      "responseObjects": [
        {
          "type": "default",
          "key": "",
          "mockFile": "mockdatafiles/getProjectRegionsRegionTargetHttpProxies-default.json"
        }
      ]
    },
    {
      "name": "postProjectRegionsRegionTargetHttpProxies",
      "protocol": "REST",
      "method": "POST",
      "entitypath": "{base_path}/{version}/projects/{pathv1}/regions/{pathv2}/targetHttpProxies?{query}",
      "requestSchema": "schema.json",
      "responseSchema": "schema.json",
      "timeout": 0,
      "sendEmpty": false,
      "requestDatatype": "JSON",
      "responseDatatype": "JSON",
      "headers": {},
      "responseObjects": [
        {
          "type": "default",
          "key": "",
          "mockFile": "mockdatafiles/postProjectRegionsRegionTargetHttpProxies-default.json"
        }
      ]
    },
    {
      "name": "deleteProjectRegionsRegionTargetHttpProxiesTargetHttpProxy",
      "protocol": "REST",
      "method": "DELETE",
      "entitypath": "{base_path}/{version}/projects/{pathv1}/regions/{pathv2}/targetHttpProxies/{pathv3}?{query}",
      "requestSchema": "schema.json",
      "responseSchema": "schema.json",
      "timeout": 0,
      "sendEmpty": false,
      "requestDatatype": "JSON",
      "responseDatatype": "JSON",
      "headers": {},
      "responseObjects": [
        {
          "type": "default",
          "key": "",
          "mockFile": "mockdatafiles/deleteProjectRegionsRegionTargetHttpProxiesTargetHttpProxy-default.json"
        }
      ]
    },
    {
      "name": "getProjectRegionsRegionTargetHttpProxiesTargetHttpProxy",
      "protocol": "REST",
      "method": "GET",
      "entitypath": "{base_path}/{version}/projects/{pathv1}/regions/{pathv2}/targetHttpProxies/{pathv3}?{query}",
      "requestSchema": "schema.json",
      "responseSchema": "schema.json",
      "timeout": 0,
      "sendEmpty": false,
      "sendGetBody": false,
      "requestDatatype": "JSON",
      "responseDatatype": "JSON",
      "headers": {},
      "responseObjects": [
        {
          "type": "default",
          "key": "",
          "mockFile": "mockdatafiles/getProjectRegionsRegionTargetHttpProxiesTargetHttpProxy-default.json"
        }
      ]
    },
    {
      "name": "postProjectRegionsRegionTargetHttpProxiesTargetHttpProxySetUrlMap",
      "protocol": "REST",
      "method": "POST",
      "entitypath": "{base_path}/{version}/projects/{pathv1}/regions/{pathv2}/targetHttpProxies/{pathv3}/setUrlMap?{query}",
      "requestSchema": "schema.json",
      "responseSchema": "schema.json",
      "timeout": 0,
      "sendEmpty": false,
      "requestDatatype": "JSON",
      "responseDatatype": "JSON",
      "headers": {},
      "responseObjects": [
        {
          "type": "default",
          "key": "",
          "mockFile": "mockdatafiles/postProjectRegionsRegionTargetHttpProxiesTargetHttpProxySetUrlMap-default.json"
        }
      ]
    }
  ]
}