{
  "id": "string",
  "items": [
    {
      "adminEnabled": false,
      "circuitInfos": [
        {
          "customerDemarcId": "string",
          "googleCircuitId": "string",
          "googleDemarcId": "string"
        },
        {
          "customerDemarcId": "string",
          "googleCircuitId": "string",
          "googleDemarcId": "string"
        },
        {
          "customerDemarcId": "string",
          "googleCircuitId": "string",
          "googleDemarcId": "string"
        },
        {
          "customerDemarcId": "string",
          "googleCircuitId": "string",
          "googleDemarcId": "string"
        },
        {
          "customerDemarcId": "string",
          "googleCircuitId": "string",
          "googleDemarcId": "string"
        },
        {
          "customerDemarcId": "string",
          "googleCircuitId": "string",
          "googleDemarcId": "string"
        },
        {
          "customerDemarcId": "string",
          "googleCircuitId": "string",
          "googleDemarcId": "string"
        },
        {
          "customerDemarcId": "string",
          "googleCircuitId": "string",
          "googleDemarcId": "string"
        },
        {
          "customerDemarcId": "string",
          "googleCircuitId": "string",
          "googleDemarcId": "string"
        },
        {
          "customerDemarcId": "string",
          "googleCircuitId": "string",
          "googleDemarcId": "string"
        }
      ],
      "creationTimestamp": "string",
      "customerName": "string",
      "description": "string",
      "expectedOutages": [
        {
          "affectedCircuits": [
            "string",
            "string",
            "string",
            "string",
            "string"
          ],
          "description": "string",
          "endTime": "string",
          "issueType": "IT_PARTIAL_OUTAGE",
          "name": "string",
          "source": "GOOGLE",
          "startTime": "string",
          "state": "CANCELLED"
        },
        {
          "affectedCircuits": [
            "string",
            "string",
            "string",
            "string",
            "string",
            "string",
            "string",
            "string",
            "string"
          ],
          "description": "string",
          "endTime": "string",
          "issueType": "PARTIAL_OUTAGE",
          "name": "string",
          "source": "GOOGLE",
          "startTime": "string",
          "state": "NS_ACTIVE"
        },
        {
          "affectedCircuits": [
            "string",
            "string"
          ],
          "description": "string",
          "endTime": "string",
          "issueType": "OUTAGE",
          "name": "string",
          "source": "GOOGLE",
          "startTime": "string",
          "state": "COMPLETED"
        }
      ],
      "googleIpAddress": "string",
      "googleReferenceId": "string",
      "id": "string",
      "interconnectAttachments": [
        "string",
        "string",
        "string",
        "string",
        "string",
        "string",
        "string"
      ],
      "interconnectType": "DEDICATED",
      "kind": "compute#interconnect",
      "linkType": "LINK_TYPE_ETHERNET_100G_LR",
      "location": "string",
      "name": "string",
      "nocContactEmail": "string",
      "operationalStatus": "OS_UNPROVISIONED",
      "peerIpAddress": "string",
      "provisionedLinkCount": 8,
      "requestedLinkCount": 10,
      "selfLink": "string",
      "state": "ACTIVE"
    },
    {
      "adminEnabled": true,
      "circuitInfos": [
        {
          "customerDemarcId": "string",
          "googleCircuitId": "string",
          "googleDemarcId": "string"
        },
        {
          "customerDemarcId": "string",
          "googleCircuitId": "string",
          "googleDemarcId": "string"
        },
        {
          "customerDemarcId": "string",
          "googleCircuitId": "string",
          "googleDemarcId": "string"
        },
        {
          "customerDemarcId": "string",
          "googleCircuitId": "string",
          "googleDemarcId": "string"
        },
        {
          "customerDemarcId": "string",
          "googleCircuitId": "string",
          "googleDemarcId": "string"
        }
      ],
      "creationTimestamp": "string",
      "customerName": "string",
      "description": "string",
      "expectedOutages": [
        {
          "affectedCircuits": [
            "string",
            "string",
            "string",
            "string",
            "string",
            "string"
          ],
          "description": "string",
          "endTime": "string",
          "issueType": "PARTIAL_OUTAGE",
          "name": "string",
          "source": "NSRC_GOOGLE",
          "startTime": "string",
          "state": "NS_CANCELED"
        }
      ],
      "googleIpAddress": "string",
      "googleReferenceId": "string",
      "id": "string",
      "interconnectAttachments": [
        "string",
        "string",
        "string",
        "string",
        "string",
        "string",
        "string",
        "string",
        "string",
        "string"
      ],
      "interconnectType": "IT_PRIVATE",
      "kind": "compute#interconnect",
      "linkType": "LINK_TYPE_ETHERNET_100G_LR",
      "location": "string",
      "name": "string",
      "nocContactEmail": "string",
      "operationalStatus": "OS_ACTIVE",
      "peerIpAddress": "string",
      "provisionedLinkCount": 6,
      "requestedLinkCount": 5,
      "selfLink": "string",
      "state": "ACTIVE"
    },
    {
      "adminEnabled": false,
      "circuitInfos": [
        {
          "customerDemarcId": "string",
          "googleCircuitId": "string",
          "googleDemarcId": "string"
        },
        {
          "customerDemarcId": "string",
          "googleCircuitId": "string",
          "googleDemarcId": "string"
        },
        {
          "customerDemarcId": "string",
          "googleCircuitId": "string",
          "googleDemarcId": "string"
        },
        {
          "customerDemarcId": "string",
          "googleCircuitId": "string",
          "googleDemarcId": "string"
        },
        {
          "customerDemarcId": "string",
          "googleCircuitId": "string",
          "googleDemarcId": "string"
        },
        {
          "customerDemarcId": "string",
          "googleCircuitId": "string",
          "googleDemarcId": "string"
        },
        {
          "customerDemarcId": "string",
          "googleCircuitId": "string",
          "googleDemarcId": "string"
        },
        {
          "customerDemarcId": "string",
          "googleCircuitId": "string",
          "googleDemarcId": "string"
        }
      ],
      "creationTimestamp": "string",
      "customerName": "string",
      "description": "string",
      "expectedOutages": [
        {
          "affectedCircuits": [
            "string",
            "string",
            "string",
            "string",
            "string",
            "string",
            "string",
            "string"
          ],
          "description": "string",
          "endTime": "string",
          "issueType": "OUTAGE",
          "name": "string",
          "source": "GOOGLE",
          "startTime": "string",
          "state": "NS_CANCELED"
        },
        {
          "affectedCircuits": [
            "string",
            "string",
            "string",
            "string",
            "string",
            "string",
            "string"
          ],
          "description": "string",
          "endTime": "string",
          "issueType": "IT_PARTIAL_OUTAGE",
          "name": "string",
          "source": "GOOGLE",
          "startTime": "string",
          "state": "CANCELLED"
        },
        {
          "affectedCircuits": [
            "string",
            "string",
            "string",
            "string",
            "string"
          ],
          "description": "string",
          "endTime": "string",
          "issueType": "IT_OUTAGE",
          "name": "string",
          "source": "GOOGLE",
          "startTime": "string",
          "state": "COMPLETED"
        },
        {
          "affectedCircuits": [
            "string",
            "string",
            "string",
            "string"
          ],
          "description": "string",
          "endTime": "string",
          "issueType": "OUTAGE",
          "name": "string",
          "source": "NSRC_GOOGLE",
          "startTime": "string",
          "state": "CANCELLED"
        },
        {
          "affectedCircuits": [
            "string",
            "string",
            "string",
            "string",
            "string",
            "string"
          ],
          "description": "string",
          "endTime": "string",
          "issueType": "IT_PARTIAL_OUTAGE",
          "name": "string",
          "source": "NSRC_GOOGLE",
          "startTime": "string",
          "state": "ACTIVE"
        },
        {
          "affectedCircuits": [
            "string",
            "string",
            "string",
            "string",
            "string",
            "string",
            "string"
          ],
          "description": "string",
          "endTime": "string",
          "issueType": "PARTIAL_OUTAGE",
          "name": "string",
          "source": "GOOGLE",
          "startTime": "string",
          "state": "NS_ACTIVE"
        },
        {
          "affectedCircuits": [
            "string",
            "string",
            "string",
            "string",
            "string",
            "string",
            "string"
          ],
          "description": "string",
          "endTime": "string",
          "issueType": "IT_PARTIAL_OUTAGE",
          "name": "string",
          "source": "NSRC_GOOGLE",
          "startTime": "string",
          "state": "ACTIVE"
        },
        {
          "affectedCircuits": [
            "string",
            "string",
            "string"
          ],
          "description": "string",
          "endTime": "string",
          "issueType": "IT_PARTIAL_OUTAGE",
          "name": "string",
          "source": "GOOGLE",
          "startTime": "string",
          "state": "ACTIVE"
        },
        {
          "affectedCircuits": [
            "string"
          ],
          "description": "string",
          "endTime": "string",
          "issueType": "OUTAGE",
          "name": "string",
          "source": "GOOGLE",
          "startTime": "string",
          "state": "NS_CANCELED"
        },
        {
          "affectedCircuits": [
            "string",
            "string",
            "string",
            "string",
            "string",
            "string",
            "string"
          ],
          "description": "string",
          "endTime": "string",
          "issueType": "OUTAGE",
          "name": "string",
          "source": "NSRC_GOOGLE",
          "startTime": "string",
          "state": "COMPLETED"
        }
      ],
      "googleIpAddress": "string",
      "googleReferenceId": "string",
      "id": "string",
      "interconnectAttachments": [
        "string",
        "string"
      ],
      "interconnectType": "PARTNER",
      "kind": "compute#interconnect",
      "linkType": "LINK_TYPE_ETHERNET_100G_LR",
      "location": "string",
      "name": "string",
      "nocContactEmail": "string",
      "operationalStatus": "OS_ACTIVE",
      "peerIpAddress": "string",
      "provisionedLinkCount": 8,
      "requestedLinkCount": 7,
      "selfLink": "string",
      "state": "ACTIVE"
    },
    {
      "adminEnabled": true,
      "circuitInfos": [
        {
          "customerDemarcId": "string",
          "googleCircuitId": "string",
          "googleDemarcId": "string"
        },
        {
          "customerDemarcId": "string",
          "googleCircuitId": "string",
          "googleDemarcId": "string"
        },
        {
          "customerDemarcId": "string",
          "googleCircuitId": "string",
          "googleDemarcId": "string"
        },
        {
          "customerDemarcId": "string",
          "googleCircuitId": "string",
          "googleDemarcId": "string"
        },
        {
          "customerDemarcId": "string",
          "googleCircuitId": "string",
          "googleDemarcId": "string"
        }
      ],
      "creationTimestamp": "string",
      "customerName": "string",
      "description": "string",
      "expectedOutages": [
        {
          "affectedCircuits": [
            "string",
            "string",
            "string",
            "string",
            "string",
            "string",
            "string",
            "string"
          ],
          "description": "string",
          "endTime": "string",
          "issueType": "PARTIAL_OUTAGE",
          "name": "string",
          "source": "NSRC_GOOGLE",
          "startTime": "string",
          "state": "CANCELLED"
        },
        {
          "affectedCircuits": [
            "string",
            "string",
            "string",
            "string"
          ],
          "description": "string",
          "endTime": "string",
          "issueType": "OUTAGE",
          "name": "string",
          "source": "NSRC_GOOGLE",
          "startTime": "string",
          "state": "NS_ACTIVE"
        },
        {
          "affectedCircuits": [
            "string",
            "string",
            "string",
            "string",
            "string"
          ],
          "description": "string",
          "endTime": "string",
          "issueType": "IT_PARTIAL_OUTAGE",
          "name": "string",
          "source": "GOOGLE",
          "startTime": "string",
          "state": "CANCELLED"
        },
        {
          "affectedCircuits": [
            "string",
            "string",
            "string",
            "string"
          ],
          "description": "string",
          "endTime": "string",
          "issueType": "OUTAGE",
          "name": "string",
          "source": "GOOGLE",
          "startTime": "string",
          "state": "NS_CANCELED"
        },
        {
          "affectedCircuits": [
            "string",
            "string",
            "string",
            "string",
            "string",
            "string",
            "string",
            "string"
          ],
          "description": "string",
          "endTime": "string",
          "issueType": "PARTIAL_OUTAGE",
          "name": "string",
          "source": "GOOGLE",
          "startTime": "string",
          "state": "NS_ACTIVE"
        },
        {
          "affectedCircuits": [
            "string",
            "string",
            "string",
            "string",
            "string",
            "string",
            "string"
          ],
          "description": "string",
          "endTime": "string",
          "issueType": "IT_PARTIAL_OUTAGE",
          "name": "string",
          "source": "GOOGLE",
          "startTime": "string",
          "state": "COMPLETED"
        },
        {
          "affectedCircuits": [
            "string",
            "string",
            "string",
            "string",
            "string"
          ],
          "description": "string",
          "endTime": "string",
          "issueType": "IT_PARTIAL_OUTAGE",
          "name": "string",
          "source": "NSRC_GOOGLE",
          "startTime": "string",
          "state": "NS_CANCELED"
        },
        {
          "affectedCircuits": [
            "string",
            "string",
            "string",
            "string",
            "string",
            "string",
            "string",
            "string"
          ],
          "description": "string",
          "endTime": "string",
          "issueType": "PARTIAL_OUTAGE",
          "name": "string",
          "source": "NSRC_GOOGLE",
          "startTime": "string",
          "state": "NS_ACTIVE"
        },
        {
          "affectedCircuits": [
            "string",
            "string",
            "string",
            "string",
            "string",
            "string",
            "string",
            "string",
            "string",
            "string"
          ],
          "description": "string",
          "endTime": "string",
          "issueType": "PARTIAL_OUTAGE",
          "name": "string",
          "source": "NSRC_GOOGLE",
          "startTime": "string",
          "state": "CANCELLED"
        }
      ],
      "googleIpAddress": "string",
      "googleReferenceId": "string",
      "id": "string",
      "interconnectAttachments": [
        "string",
        "string"
      ],
      "interconnectType": "IT_PRIVATE",
      "kind": "compute#interconnect",
      "linkType": "LINK_TYPE_ETHERNET_100G_LR",
      "location": "string",
      "name": "string",
      "nocContactEmail": "string",
      "operationalStatus": "OS_ACTIVE",
      "peerIpAddress": "string",
      "provisionedLinkCount": 10,
      "requestedLinkCount": 4,
      "selfLink": "string",
      "state": "UNPROVISIONED"
    },
    {
      "adminEnabled": false,
      "circuitInfos": [
        {
          "customerDemarcId": "string",
          "googleCircuitId": "string",
          "googleDemarcId": "string"
        },
        {
          "customerDemarcId": "string",
          "googleCircuitId": "string",
          "googleDemarcId": "string"
        },
        {
          "customerDemarcId": "string",
          "googleCircuitId": "string",
          "googleDemarcId": "string"
        },
        {
          "customerDemarcId": "string",
          "googleCircuitId": "string",
          "googleDemarcId": "string"
        }
      ],
      "creationTimestamp": "string",
      "customerName": "string",
      "description": "string",
      "expectedOutages": [
        {
          "affectedCircuits": [
            "string"
          ],
          "description": "string",
          "endTime": "string",
          "issueType": "IT_OUTAGE",
          "name": "string",
          "source": "NSRC_GOOGLE",
          "startTime": "string",
          "state": "NS_ACTIVE"
        },
        {
          "affectedCircuits": [
            "string",
            "string",
            "string",
            "string",
            "string",
            "string",
            "string"
          ],
          "description": "string",
          "endTime": "string",
          "issueType": "PARTIAL_OUTAGE",
          "name": "string",
          "source": "NSRC_GOOGLE",
          "startTime": "string",
          "state": "ACTIVE"
        },
        {
          "affectedCircuits": [
            "string",
            "string",
            "string",
            "string",
            "string",
            "string",
            "string",
            "string",
            "string"
          ],
          "description": "string",
          "endTime": "string",
          "issueType": "IT_OUTAGE",
          "name": "string",
          "source": "GOOGLE",
          "startTime": "string",
          "state": "ACTIVE"
        },
        {
          "affectedCircuits": [
            "string",
            "string",
            "string",
            "string",
            "string"
          ],
          "description": "string",
          "endTime": "string",
          "issueType": "IT_PARTIAL_OUTAGE",
          "name": "string",
          "source": "GOOGLE",
          "startTime": "string",
          "state": "NS_CANCELED"
        },
        {
          "affectedCircuits": [
            "string",
            "string",
            "string",
            "string",
            "string",
            "string",
            "string",
            "string",
            "string"
          ],
          "description": "string",
          "endTime": "string",
          "issueType": "OUTAGE",
          "name": "string",
          "source": "NSRC_GOOGLE",
          "startTime": "string",
          "state": "ACTIVE"
        },
        {
          "affectedCircuits": [
            "string",
            "string",
            "string",
            "string",
            "string"
          ],
          "description": "string",
          "endTime": "string",
          "issueType": "IT_PARTIAL_OUTAGE",
          "name": "string",
          "source": "NSRC_GOOGLE",
          "startTime": "string",
          "state": "ACTIVE"
        },
        {
          "affectedCircuits": [
            "string",
            "string",
            "string",
            "string",
            "string",
            "string",
            "string",
            "string",
            "string"
          ],
          "description": "string",
          "endTime": "string",
          "issueType": "IT_PARTIAL_OUTAGE",
          "name": "string",
          "source": "GOOGLE",
          "startTime": "string",
          "state": "COMPLETED"
        },
        {
          "affectedCircuits": [
            "string",
            "string",
            "string"
          ],
          "description": "string",
          "endTime": "string",
          "issueType": "IT_OUTAGE",
          "name": "string",
          "source": "NSRC_GOOGLE",
          "startTime": "string",
          "state": "COMPLETED"
        }
      ],
      "googleIpAddress": "string",
      "googleReferenceId": "string",
      "id": "string",
      "interconnectAttachments": [
        "string",
        "string",
        "string",
        "string",
        "string",
        "string",
        "string",
        "string"
      ],
      "interconnectType": "IT_PRIVATE",
      "kind": "compute#interconnect",
      "linkType": "LINK_TYPE_ETHERNET_10G_LR",
      "location": "string",
      "name": "string",
      "nocContactEmail": "string",
      "operationalStatus": "OS_UNPROVISIONED",
      "peerIpAddress": "string",
      "provisionedLinkCount": 6,
      "requestedLinkCount": 2,
      "selfLink": "string",
      "state": "UNPROVISIONED"
    },
    {
      "adminEnabled": false,
      "circuitInfos": [
        {
          "customerDemarcId": "string",
          "googleCircuitId": "string",
          "googleDemarcId": "string"
        },
        {
          "customerDemarcId": "string",
          "googleCircuitId": "string",
          "googleDemarcId": "string"
        }
      ],
      "creationTimestamp": "string",
      "customerName": "string",
      "description": "string",
      "expectedOutages": [
        {
          "affectedCircuits": [
            "string",
            "string",
            "string",
            "string"
          ],
          "description": "string",
          "endTime": "string",
          "issueType": "OUTAGE",
          "name": "string",
          "source": "GOOGLE",
          "startTime": "string",
          "state": "NS_CANCELED"
        },
        {
          "affectedCircuits": [
            "string",
            "string",
            "string",
            "string",
            "string",
            "string",
            "string",
            "string"
          ],
          "description": "string",
          "endTime": "string",
          "issueType": "IT_OUTAGE",
          "name": "string",
          "source": "NSRC_GOOGLE",
          "startTime": "string",
          "state": "NS_CANCELED"
        },
        {
          "affectedCircuits": [
            "string",
            "string",
            "string",
            "string",
            "string",
            "string",
            "string",
            "string"
          ],
          "description": "string",
          "endTime": "string",
          "issueType": "IT_OUTAGE",
          "name": "string",
          "source": "NSRC_GOOGLE",
          "startTime": "string",
          "state": "COMPLETED"
        },
        {
          "affectedCircuits": [
            "string",
            "string",
            "string"
          ],
          "description": "string",
          "endTime": "string",
          "issueType": "OUTAGE",
          "name": "string",
          "source": "NSRC_GOOGLE",
          "startTime": "string",
          "state": "CANCELLED"
        }
      ],
      "googleIpAddress": "string",
      "googleReferenceId": "string",
      "id": "string",
      "interconnectAttachments": [
        "string",
        "string",
        "string",
        "string",
        "string",
        "string"
      ],
      "interconnectType": "DEDICATED",
      "kind": "compute#interconnect",
      "linkType": "LINK_TYPE_ETHERNET_100G_LR",
      "location": "string",
      "name": "string",
      "nocContactEmail": "string",
      "operationalStatus": "OS_ACTIVE",
      "peerIpAddress": "string",
      "provisionedLinkCount": 3,
      "requestedLinkCount": 3,
      "selfLink": "string",
      "state": "UNPROVISIONED"
    },
    {
      "adminEnabled": false,
      "circuitInfos": [
        {
          "customerDemarcId": "string",
          "googleCircuitId": "string",
          "googleDemarcId": "string"
        },
        {
          "customerDemarcId": "string",
          "googleCircuitId": "string",
          "googleDemarcId": "string"
        },
        {
          "customerDemarcId": "string",
          "googleCircuitId": "string",
          "googleDemarcId": "string"
        }
      ],
      "creationTimestamp": "string",
      "customerName": "string",
      "description": "string",
      "expectedOutages": [
        {
          "affectedCircuits": [
            "string",
            "string"
          ],
          "description": "string",
          "endTime": "string",
          "issueType": "OUTAGE",
          "name": "string",
          "source": "NSRC_GOOGLE",
          "startTime": "string",
          "state": "CANCELLED"
        },
        {
          "affectedCircuits": [
            "string",
            "string",
            "string",
            "string",
            "string",
            "string",
            "string",
            "string"
          ],
          "description": "string",
          "endTime": "string",
          "issueType": "OUTAGE",
          "name": "string",
          "source": "GOOGLE",
          "startTime": "string",
          "state": "CANCELLED"
        },
        {
          "affectedCircuits": [
            "string",
            "string",
            "string",
            "string",
            "string",
            "string",
            "string"
          ],
          "description": "string",
          "endTime": "string",
          "issueType": "IT_PARTIAL_OUTAGE",
          "name": "string",
          "source": "NSRC_GOOGLE",
          "startTime": "string",
          "state": "CANCELLED"
        }
      ],
      "googleIpAddress": "string",
      "googleReferenceId": "string",
      "id": "string",
      "interconnectAttachments": [
        "string",
        "string",
        "string",
        "string",
        "string"
      ],
      "interconnectType": "PARTNER",
      "kind": "compute#interconnect",
      "linkType": "LINK_TYPE_ETHERNET_100G_LR",
      "location": "string",
      "name": "string",
      "nocContactEmail": "string",
      "operationalStatus": "OS_UNPROVISIONED",
      "peerIpAddress": "string",
      "provisionedLinkCount": 9,
      "requestedLinkCount": 5,
      "selfLink": "string",
      "state": "ACTIVE"
    },
    {
      "adminEnabled": true,
      "circuitInfos": [
        {
          "customerDemarcId": "string",
          "googleCircuitId": "string",
          "googleDemarcId": "string"
        },
        {
          "customerDemarcId": "string",
          "googleCircuitId": "string",
          "googleDemarcId": "string"
        },
        {
          "customerDemarcId": "string",
          "googleCircuitId": "string",
          "googleDemarcId": "string"
        },
        {
          "customerDemarcId": "string",
          "googleCircuitId": "string",
          "googleDemarcId": "string"
        },
        {
          "customerDemarcId": "string",
          "googleCircuitId": "string",
          "googleDemarcId": "string"
        },
        {
          "customerDemarcId": "string",
          "googleCircuitId": "string",
          "googleDemarcId": "string"
        }
      ],
      "creationTimestamp": "string",
      "customerName": "string",
      "description": "string",
      "expectedOutages": [
        {
          "affectedCircuits": [
            "string",
            "string",
            "string",
            "string",
            "string",
            "string",
            "string"
          ],
          "description": "string",
          "endTime": "string",
          "issueType": "PARTIAL_OUTAGE",
          "name": "string",
          "source": "NSRC_GOOGLE",
          "startTime": "string",
          "state": "COMPLETED"
        },
        {
          "affectedCircuits": [
            "string",
            "string",
            "string",
            "string",
            "string",
            "string",
            "string"
          ],
          "description": "string",
          "endTime": "string",
          "issueType": "IT_OUTAGE",
          "name": "string",
          "source": "GOOGLE",
          "startTime": "string",
          "state": "ACTIVE"
        },
        {
          "affectedCircuits": [
            "string",
            "string",
            "string"
          ],
          "description": "string",
          "endTime": "string",
          "issueType": "OUTAGE",
          "name": "string",
          "source": "NSRC_GOOGLE",
          "startTime": "string",
          "state": "NS_CANCELED"
        },
        {
          "affectedCircuits": [
            "string",
            "string",
            "string",
            "string",
            "string",
            "string",
            "string",
            "string",
            "string",
            "string"
          ],
          "description": "string",
          "endTime": "string",
          "issueType": "IT_PARTIAL_OUTAGE",
          "name": "string",
          "source": "NSRC_GOOGLE",
          "startTime": "string",
          "state": "NS_ACTIVE"
        },
        {
          "affectedCircuits": [
            "string",
            "string",
            "string",
            "string",
            "string",
            "string"
          ],
          "description": "string",
          "endTime": "string",
          "issueType": "OUTAGE",
          "name": "string",
          "source": "GOOGLE",
          "startTime": "string",
          "state": "COMPLETED"
        },
        {
          "affectedCircuits": [
            "string",
            "string",
            "string",
            "string",
            "string",
            "string",
            "string",
            "string",
            "string"
          ],
          "description": "string",
          "endTime": "string",
          "issueType": "IT_PARTIAL_OUTAGE",
          "name": "string",
          "source": "NSRC_GOOGLE",
          "startTime": "string",
          "state": "ACTIVE"
        },
        {
          "affectedCircuits": [
            "string",
            "string",
            "string",
            "string",
            "string",
            "string"
          ],
          "description": "string",
          "endTime": "string",
          "issueType": "IT_PARTIAL_OUTAGE",
          "name": "string",
          "source": "GOOGLE",
          "startTime": "string",
          "state": "NS_ACTIVE"
        },
        {
          "affectedCircuits": [
            "string",
            "string",
            "string",
            "string",
            "string",
            "string"
          ],
          "description": "string",
          "endTime": "string",
          "issueType": "PARTIAL_OUTAGE",
          "name": "string",
          "source": "NSRC_GOOGLE",
          "startTime": "string",
          "state": "COMPLETED"
        }
      ],
      "googleIpAddress": "string",
      "googleReferenceId": "string",
      "id": "string",
      "interconnectAttachments": [
        "string",
        "string",
        "string",
        "string",
        "string",
        "string",
        "string",
        "string"
      ],
      "interconnectType": "PARTNER",
      "kind": "compute#interconnect",
      "linkType": "LINK_TYPE_ETHERNET_100G_LR",
      "location": "string",
      "name": "string",
      "nocContactEmail": "string",
      "operationalStatus": "OS_ACTIVE",
      "peerIpAddress": "string",
      "provisionedLinkCount": 10,
      "requestedLinkCount": 8,
      "selfLink": "string",
      "state": "UNPROVISIONED"
    }
  ],
  "kind": "compute#interconnectList",
  "nextPageToken": "string",
  "selfLink": "string",
  "warning": {
    "code": "DEPRECATED_RESOURCE_USED",
    "data": [
      {
        "key": "string",
        "value": "string"
      },
      {
        "key": "string",
        "value": "string"
      },
      {
        "key": "string",
        "value": "string"
      },
      {
        "key": "string",
        "value": "string"
      },
      {
        "key": "string",
        "value": "string"
      },
      {
        "key": "string",
        "value": "string"
      },
      {
        "key": "string",
        "value": "string"
      }
    ],
    "message": "string"
  }
}