{
  "actions": [
    {
      "name": "getProjectAggregatedVpnGateways",
      "protocol": "REST",
      "method": "GET",
      "entitypath": "{base_path}/{version}/projects/{pathv1}/aggregated/vpnGateways?{query}",
      "requestSchema": "schema.json",
      "responseSchema": "schema.json",
      "timeout": 0,
      "sendEmpty": false,
      "sendGetBody": false,
      "requestDatatype": "JSON",
      "responseDatatype": "JSON",
      "headers": {},
      "responseObjects": [
        {
          "type": "default",
          "key": "",
          "mockFile": "mockdatafiles/getProjectAggregatedVpnGateways-default.json"
        }
      ]
    },
    {
      "name": "getProjectRegionsRegionVpnGateways",
      "protocol": "REST",
      "method": "GET",
      "entitypath": "{base_path}/{version}/projects/{pathv1}/regions/{pathv2}/vpnGateways?{query}",
      "requestSchema": "schema.json",
      "responseSchema": "schema.json",
      "timeout": 0,
      "sendEmpty": false,
      "sendGetBody": false,
      "requestDatatype": "JSON",
      "responseDatatype": "JSON",
      "headers": {},
      "responseObjects": [
        {
          "type": "default",
          "key": "",
          "mockFile": "mockdatafiles/getProjectRegionsRegionVpnGateways-default.json"
        }
      ]
    },
    {
      "name": "postProjectRegionsRegionVpnGateways",
      "protocol": "REST",
      "method": "POST",
      "entitypath": "{base_path}/{version}/projects/{pathv1}/regions/{pathv2}/vpnGateways?{query}",
      "requestSchema": "schema.json",
      "responseSchema": "schema.json",
      "timeout": 0,
      "sendEmpty": false,
      "requestDatatype": "JSON",
      "responseDatatype": "JSON",
      "headers": {},
      "responseObjects": [
        {
          "type": "default",
          "key": "",
          "mockFile": "mockdatafiles/postProjectRegionsRegionVpnGateways-default.json"
        }
      ]
    },
    {
      "name": "postProjectRegionsRegionVpnGatewaysResourceSetLabels",
      "protocol": "REST",
      "method": "POST",
      "entitypath": "{base_path}/{version}/projects/{pathv1}/regions/{pathv2}/vpnGateways/{pathv3}/setLabels?{query}",
      "requestSchema": "schema.json",
      "responseSchema": "schema.json",
      "timeout": 0,
      "sendEmpty": false,
      "requestDatatype": "JSON",
      "responseDatatype": "JSON",
      "headers": {},
      "responseObjects": [
        {
          "type": "default",
          "key": "",
          "mockFile": "mockdatafiles/postProjectRegionsRegionVpnGatewaysResourceSetLabels-default.json"
        }
      ]
    },
    {
      "name": "postProjectRegionsRegionVpnGatewaysResourceTestIamPermissions",
      "protocol": "REST",
      "method": "POST",
      "entitypath": "{base_path}/{version}/projects/{pathv1}/regions/{pathv2}/vpnGateways/{pathv3}/testIamPermissions?{query}",
      "requestSchema": "schema.json",
      "responseSchema": "schema.json",
      "timeout": 0,
      "sendEmpty": false,
      "requestDatatype": "JSON",
      "responseDatatype": "JSON",
      "headers": {},
      "responseObjects": [
        {
          "type": "default",
          "key": "",
          "mockFile": "mockdatafiles/postProjectRegionsRegionVpnGatewaysResourceTestIamPermissions-default.json"
        }
      ]
    },
    {
      "name": "deleteProjectRegionsRegionVpnGatewaysVpnGateway",
      "protocol": "REST",
      "method": "DELETE",
      "entitypath": "{base_path}/{version}/projects/{pathv1}/regions/{pathv2}/vpnGateways/{pathv3}?{query}",
      "requestSchema": "schema.json",
      "responseSchema": "schema.json",
      "timeout": 0,
      "sendEmpty": false,
      "requestDatatype": "JSON",
      "responseDatatype": "JSON",
      "headers": {},
      "responseObjects": [
        {
          "type": "default",
          "key": "",
          "mockFile": "mockdatafiles/deleteProjectRegionsRegionVpnGatewaysVpnGateway-default.json"
        }
      ]
    },
    {
      "name": "getProjectRegionsRegionVpnGatewaysVpnGateway",
      "protocol": "REST",
      "method": "GET",
      "entitypath": "{base_path}/{version}/projects/{pathv1}/regions/{pathv2}/vpnGateways/{pathv3}?{query}",
      "requestSchema": "schema.json",
      "responseSchema": "schema.json",
      "timeout": 0,
      "sendEmpty": false,
      "sendGetBody": false,
      "requestDatatype": "JSON",
      "responseDatatype": "JSON",
      "headers": {},
      "responseObjects": [
        {
          "type": "default",
          "key": "",
          "mockFile": "mockdatafiles/getProjectRegionsRegionVpnGatewaysVpnGateway-default.json"
        }
      ]
    },
    {
      "name": "getProjectRegionsRegionVpnGatewaysVpnGatewayGetStatus",
      "protocol": "REST",
      "method": "GET",
      "entitypath": "{base_path}/{version}/projects/{pathv1}/regions/{pathv2}/vpnGateways/{pathv3}/getStatus?{query}",
      "requestSchema": "schema.json",
      "responseSchema": "schema.json",
      "timeout": 0,
      "sendEmpty": false,
      "sendGetBody": false,
      "requestDatatype": "JSON",
      "responseDatatype": "JSON",
      "headers": {},
      "responseObjects": [
        {
          "type": "default",
          "key": "",
          "mockFile": "mockdatafiles/getProjectRegionsRegionVpnGatewaysVpnGatewayGetStatus-default.json"
        }
      ]
    }
  ]
}