{
  "actions": [
    {
      "name": "getProjectRegionsRegionBackendServices",
      "protocol": "REST",
      "method": "GET",
      "entitypath": "{base_path}/{version}/projects/{pathv1}/regions/{pathv2}/backendServices?{query}",
      "requestSchema": "schema.json",
      "responseSchema": "schema.json",
      "timeout": 0,
      "sendEmpty": false,
      "sendGetBody": false,
      "requestDatatype": "JSON",
      "responseDatatype": "JSON",
      "headers": {},
      "responseObjects": [
        {
          "type": "default",
          "key": "",
          "mockFile": "mockdatafiles/getProjectRegionsRegionBackendServices-default.json"
        }
      ]
    },
    {
      "name": "postProjectRegionsRegionBackendServices",
      "protocol": "REST",
      "method": "POST",
      "entitypath": "{base_path}/{version}/projects/{pathv1}/regions/{pathv2}/backendServices?{query}",
      "requestSchema": "schema.json",
      "responseSchema": "schema.json",
      "timeout": 0,
      "sendEmpty": false,
      "requestDatatype": "JSON",
      "responseDatatype": "JSON",
      "headers": {},
      "responseObjects": [
        {
          "type": "default",
          "key": "",
          "mockFile": "mockdatafiles/postProjectRegionsRegionBackendServices-default.json"
        }
      ]
    },
    {
      "name": "deleteProjectRegionsRegionBackendServicesBackendService",
      "protocol": "REST",
      "method": "DELETE",
      "entitypath": "{base_path}/{version}/projects/{pathv1}/regions/{pathv2}/backendServices/{pathv3}?{query}",
      "requestSchema": "schema.json",
      "responseSchema": "schema.json",
      "timeout": 0,
      "sendEmpty": false,
      "requestDatatype": "JSON",
      "responseDatatype": "JSON",
      "headers": {},
      "responseObjects": [
        {
          "type": "default",
          "key": "",
          "mockFile": "mockdatafiles/deleteProjectRegionsRegionBackendServicesBackendService-default.json"
        }
      ]
    },
    {
      "name": "getProjectRegionsRegionBackendServicesBackendService",
      "protocol": "REST",
      "method": "GET",
      "entitypath": "{base_path}/{version}/projects/{pathv1}/regions/{pathv2}/backendServices/{pathv3}?{query}",
      "requestSchema": "schema.json",
      "responseSchema": "schema.json",
      "timeout": 0,
      "sendEmpty": false,
      "sendGetBody": false,
      "requestDatatype": "JSON",
      "responseDatatype": "JSON",
      "headers": {},
      "responseObjects": [
        {
          "type": "default",
          "key": "",
          "mockFile": "mockdatafiles/getProjectRegionsRegionBackendServicesBackendService-default.json"
        }
      ]
    },
    {
      "name": "patchProjectRegionsRegionBackendServicesBackendService",
      "protocol": "REST",
      "method": "PATCH",
      "entitypath": "{base_path}/{version}/projects/{pathv1}/regions/{pathv2}/backendServices/{pathv3}?{query}",
      "requestSchema": "schema.json",
      "responseSchema": "schema.json",
      "timeout": 0,
      "sendEmpty": false,
      "requestDatatype": "JSON",
      "responseDatatype": "JSON",
      "headers": {},
      "responseObjects": [
        {
          "type": "default",
          "key": "",
          "mockFile": "mockdatafiles/patchProjectRegionsRegionBackendServicesBackendService-default.json"
        }
      ]
    },
    {
      "name": "putProjectRegionsRegionBackendServicesBackendService",
      "protocol": "REST",
      "method": "PUT",
      "entitypath": "{base_path}/{version}/projects/{pathv1}/regions/{pathv2}/backendServices/{pathv3}?{query}",
      "requestSchema": "schema.json",
      "responseSchema": "schema.json",
      "timeout": 0,
      "sendEmpty": false,
      "requestDatatype": "JSON",
      "responseDatatype": "JSON",
      "headers": {},
      "responseObjects": [
        {
          "type": "default",
          "key": "",
          "mockFile": "mockdatafiles/putProjectRegionsRegionBackendServicesBackendService-default.json"
        }
      ]
    },
    {
      "name": "postProjectRegionsRegionBackendServicesBackendServiceGetHealth",
      "protocol": "REST",
      "method": "POST",
      "entitypath": "{base_path}/{version}/projects/{pathv1}/regions/{pathv2}/backendServices/{pathv3}/getHealth?{query}",
      "requestSchema": "schema.json",
      "responseSchema": "schema.json",
      "timeout": 0,
      "sendEmpty": false,
      "requestDatatype": "JSON",
      "responseDatatype": "JSON",
      "headers": {},
      "responseObjects": [
        {
          "type": "default",
          "key": "",
          "mockFile": "mockdatafiles/postProjectRegionsRegionBackendServicesBackendServiceGetHealth-default.json"
        }
      ]
    }
  ]
}