{
  "checkIntervalSec": 2,
  "creationTimestamp": "string",
  "description": "string",
  "healthyThreshold": 1,
  "host": "string",
  "id": "string",
  "kind": "compute#httpsHealthCheck",
  "name": "string",
  "port": 1,
  "requestPath": "string",
  "selfLink": "string",
  "timeoutSec": 7,
  "unhealthyThreshold": 5
}