{
  "annotations": {},
  "appEngine": {
    "service": "string",
    "urlMask": "string",
    "version": "string"
  },
  "cloudFunction": {
    "function": "string",
    "urlMask": "string"
  },
  "cloudRun": {
    "service": "string",
    "tag": "string",
    "urlMask": "string"
  },
  "creationTimestamp": "string",
  "defaultPort": 7,
  "description": "string",
  "id": "string",
  "kind": "compute#networkEndpointGroup",
  "name": "string",
  "network": "string",
  "networkEndpointType": "GCE_VM_IP_PORT",
  "region": "string",
  "selfLink": "string",
  "size": 2,
  "subnetwork": "string",
  "zone": "string"
}