{
  "id": "string",
  "items": [
    {
      "kind": "compute#reference",
      "referenceType": "string",
      "referrer": "string",
      "target": "string"
    }
  ],
  "kind": "compute#instanceListReferrers",
  "nextPageToken": "string",
  "selfLink": "string",
  "warning": {
    "code": "NEXT_HOP_INSTANCE_NOT_ON_NETWORK",
    "data": [
      {
        "key": "string",
        "value": "string"
      },
      {
        "key": "string",
        "value": "string"
      },
      {
        "key": "string",
        "value": "string"
      }
    ],
    "message": "string"
  }
}