{
  "clientOperationId": "string",
  "creationTimestamp": "string",
  "description": "string",
  "endTime": "string",
  "error": {
    "errors": [
      {
        "code": "string",
        "location": "string",
        "message": "string"
      },
      {
        "code": "string",
        "location": "string",
        "message": "string"
      },
      {
        "code": "string",
        "location": "string",
        "message": "string"
      },
      {
        "code": "string",
        "location": "string",
        "message": "string"
      },
      {
        "code": "string",
        "location": "string",
        "message": "string"
      },
      {
        "code": "string",
        "location": "string",
        "message": "string"
      }
    ]
  },
  "httpErrorMessage": "string",
  "httpErrorStatusCode": 6,
  "id": "string",
  "insertTime": "string",
  "kind": "compute#operation",
  "name": "string",
  "operationType": "string",
  "progress": 8,
  "region": "string",
  "selfLink": "string",
  "startTime": "string",
  "status": "RUNNING",
  "statusMessage": "string",
  "targetId": "string",
  "targetLink": "string",
  "user": "string",
  "warnings": [
    {
      "code": "NEXT_HOP_INSTANCE_NOT_ON_NETWORK",
      "data": [
        {
          "key": "string",
          "value": "string"
        },
        {
          "key": "string",
          "value": "string"
        },
        {
          "key": "string",
          "value": "string"
        },
        {
          "key": "string",
          "value": "string"
        },
        {
          "key": "string",
          "value": "string"
        },
        {
          "key": "string",
          "value": "string"
        },
        {
          "key": "string",
          "value": "string"
        },
        {
          "key": "string",
          "value": "string"
        },
        {
          "key": "string",
          "value": "string"
        },
        {
          "key": "string",
          "value": "string"
        }
      ],
      "message": "string"
    },
    {
      "code": "UNDECLARED_PROPERTIES",
      "data": [
        {
          "key": "string",
          "value": "string"
        },
        {
          "key": "string",
          "value": "string"
        },
        {
          "key": "string",
          "value": "string"
        },
        {
          "key": "string",
          "value": "string"
        },
        {
          "key": "string",
          "value": "string"
        },
        {
          "key": "string",
          "value": "string"
        },
        {
          "key": "string",
          "value": "string"
        }
      ],
      "message": "string"
    }
  ],
  "zone": "string"
}