{
  "id": "string",
  "items": [
    {
      "clientOperationId": "string",
      "creationTimestamp": "string",
      "description": "string",
      "endTime": "string",
      "error": {
        "errors": [
          {
            "code": "string",
            "location": "string",
            "message": "string"
          },
          {
            "code": "string",
            "location": "string",
            "message": "string"
          },
          {
            "code": "string",
            "location": "string",
            "message": "string"
          },
          {
            "code": "string",
            "location": "string",
            "message": "string"
          },
          {
            "code": "string",
            "location": "string",
            "message": "string"
          },
          {
            "code": "string",
            "location": "string",
            "message": "string"
          },
          {
            "code": "string",
            "location": "string",
            "message": "string"
          },
          {
            "code": "string",
            "location": "string",
            "message": "string"
          },
          {
            "code": "string",
            "location": "string",
            "message": "string"
          },
          {
            "code": "string",
            "location": "string",
            "message": "string"
          }
        ]
      },
      "httpErrorMessage": "string",
      "httpErrorStatusCode": 2,
      "id": "string",
      "insertTime": "string",
      "kind": "compute#operation",
      "name": "string",
      "operationType": "string",
      "progress": 7,
      "region": "string",
      "selfLink": "string",
      "startTime": "string",
      "status": "DONE",
      "statusMessage": "string",
      "targetId": "string",
      "targetLink": "string",
      "user": "string",
      "warnings": [
        {
          "code": "DEPRECATED_RESOURCE_USED",
          "data": [
            {
              "key": "string",
              "value": "string"
            }
          ],
          "message": "string"
        },
        {
          "code": "SCHEMA_VALIDATION_IGNORED",
          "data": [
            {
              "key": "string",
              "value": "string"
            },
            {
              "key": "string",
              "value": "string"
            },
            {
              "key": "string",
              "value": "string"
            },
            {
              "key": "string",
              "value": "string"
            },
            {
              "key": "string",
              "value": "string"
            },
            {
              "key": "string",
              "value": "string"
            }
          ],
          "message": "string"
        },
        {
          "code": "MISSING_TYPE_DEPENDENCY",
          "data": [
            {
              "key": "string",
              "value": "string"
            },
            {
              "key": "string",
              "value": "string"
            },
            {
              "key": "string",
              "value": "string"
            },
            {
              "key": "string",
              "value": "string"
            },
            {
              "key": "string",
              "value": "string"
            },
            {
              "key": "string",
              "value": "string"
            },
            {
              "key": "string",
              "value": "string"
            }
          ],
          "message": "string"
        }
      ],
      "zone": "string"
    }
  ],
  "kind": "compute#operationList",
  "nextPageToken": "string",
  "selfLink": "string",
  "warning": {
    "code": "NO_RESULTS_ON_PAGE",
    "data": [
      {
        "key": "string",
        "value": "string"
      },
      {
        "key": "string",
        "value": "string"
      },
      {
        "key": "string",
        "value": "string"
      },
      {
        "key": "string",
        "value": "string"
      },
      {
        "key": "string",
        "value": "string"
      },
      {
        "key": "string",
        "value": "string"
      }
    ],
    "message": "string"
  }
}