{
  "id": "string",
  "items": [
    {
      "bgp": {
        "advertiseMode": "CUSTOM",
        "advertisedGroups": [
          "ALL_SUBNETS",
          "ALL_SUBNETS"
        ],
        "advertisedIpRanges": [
          {
            "description": "string",
            "range": "string"
          },
          {
            "description": "string",
            "range": "string"
          },
          {
            "description": "string",
            "range": "string"
          },
          {
            "description": "string",
            "range": "string"
          }
        ],
        "asn": 5
      },
      "bgpPeers": [
        {
          "advertiseMode": "DEFAULT",
          "advertisedGroups": [
            "ALL_SUBNETS",
            "ALL_SUBNETS",
            "ALL_SUBNETS",
            "ALL_SUBNETS",
            "ALL_SUBNETS",
            "ALL_SUBNETS",
            "ALL_SUBNETS"
          ],
          "advertisedIpRanges": [
            {
              "description": "string",
              "range": "string"
            },
            {
              "description": "string",
              "range": "string"
            },
            {
              "description": "string",
              "range": "string"
            },
            {
              "description": "string",
              "range": "string"
            },
            {
              "description": "string",
              "range": "string"
            },
            {
              "description": "string",
              "range": "string"
            },
            {
              "description": "string",
              "range": "string"
            },
            {
              "description": "string",
              "range": "string"
            }
          ],
          "advertisedRoutePriority": 6,
          "interfaceName": "string",
          "ipAddress": "string",
          "managementType": "MANAGED_BY_ATTACHMENT",
          "name": "string",
          "peerAsn": 4,
          "peerIpAddress": "string"
        },
        {
          "advertiseMode": "DEFAULT",
          "advertisedGroups": [
            "ALL_SUBNETS",
            "ALL_SUBNETS",
            "ALL_SUBNETS",
            "ALL_SUBNETS",
            "ALL_SUBNETS",
            "ALL_SUBNETS"
          ],
          "advertisedIpRanges": [
            {
              "description": "string",
              "range": "string"
            },
            {
              "description": "string",
              "range": "string"
            },
            {
              "description": "string",
              "range": "string"
            },
            {
              "description": "string",
              "range": "string"
            },
            {
              "description": "string",
              "range": "string"
            },
            {
              "description": "string",
              "range": "string"
            }
          ],
          "advertisedRoutePriority": 3,
          "interfaceName": "string",
          "ipAddress": "string",
          "managementType": "MANAGED_BY_USER",
          "name": "string",
          "peerAsn": 6,
          "peerIpAddress": "string"
        },
        {
          "advertiseMode": "CUSTOM",
          "advertisedGroups": [
            "ALL_SUBNETS",
            "ALL_SUBNETS",
            "ALL_SUBNETS",
            "ALL_SUBNETS",
            "ALL_SUBNETS",
            "ALL_SUBNETS"
          ],
          "advertisedIpRanges": [
            {
              "description": "string",
              "range": "string"
            },
            {
              "description": "string",
              "range": "string"
            },
            {
              "description": "string",
              "range": "string"
            },
            {
              "description": "string",
              "range": "string"
            },
            {
              "description": "string",
              "range": "string"
            },
            {
              "description": "string",
              "range": "string"
            },
            {
              "description": "string",
              "range": "string"
            },
            {
              "description": "string",
              "range": "string"
            },
            {
              "description": "string",
              "range": "string"
            }
          ],
          "advertisedRoutePriority": 10,
          "interfaceName": "string",
          "ipAddress": "string",
          "managementType": "MANAGED_BY_USER",
          "name": "string",
          "peerAsn": 6,
          "peerIpAddress": "string"
        },
        {
          "advertiseMode": "CUSTOM",
          "advertisedGroups": [
            "ALL_SUBNETS",
            "ALL_SUBNETS",
            "ALL_SUBNETS",
            "ALL_SUBNETS",
            "ALL_SUBNETS",
            "ALL_SUBNETS",
            "ALL_SUBNETS",
            "ALL_SUBNETS"
          ],
          "advertisedIpRanges": [
            {
              "description": "string",
              "range": "string"
            },
            {
              "description": "string",
              "range": "string"
            },
            {
              "description": "string",
              "range": "string"
            },
            {
              "description": "string",
              "range": "string"
            }
          ],
          "advertisedRoutePriority": 6,
          "interfaceName": "string",
          "ipAddress": "string",
          "managementType": "MANAGED_BY_USER",
          "name": "string",
          "peerAsn": 3,
          "peerIpAddress": "string"
        },
        {
          "advertiseMode": "CUSTOM",
          "advertisedGroups": [
            "ALL_SUBNETS",
            "ALL_SUBNETS",
            "ALL_SUBNETS",
            "ALL_SUBNETS",
            "ALL_SUBNETS",
            "ALL_SUBNETS",
            "ALL_SUBNETS",
            "ALL_SUBNETS"
          ],
          "advertisedIpRanges": [
            {
              "description": "string",
              "range": "string"
            },
            {
              "description": "string",
              "range": "string"
            },
            {
              "description": "string",
              "range": "string"
            }
          ],
          "advertisedRoutePriority": 9,
          "interfaceName": "string",
          "ipAddress": "string",
          "managementType": "MANAGED_BY_ATTACHMENT",
          "name": "string",
          "peerAsn": 6,
          "peerIpAddress": "string"
        },
        {
          "advertiseMode": "CUSTOM",
          "advertisedGroups": [
            "ALL_SUBNETS",
            "ALL_SUBNETS",
            "ALL_SUBNETS",
            "ALL_SUBNETS",
            "ALL_SUBNETS",
            "ALL_SUBNETS",
            "ALL_SUBNETS",
            "ALL_SUBNETS"
          ],
          "advertisedIpRanges": [
            {
              "description": "string",
              "range": "string"
            },
            {
              "description": "string",
              "range": "string"
            }
          ],
          "advertisedRoutePriority": 3,
          "interfaceName": "string",
          "ipAddress": "string",
          "managementType": "MANAGED_BY_ATTACHMENT",
          "name": "string",
          "peerAsn": 8,
          "peerIpAddress": "string"
        },
        {
          "advertiseMode": "CUSTOM",
          "advertisedGroups": [
            "ALL_SUBNETS",
            "ALL_SUBNETS",
            "ALL_SUBNETS",
            "ALL_SUBNETS",
            "ALL_SUBNETS"
          ],
          "advertisedIpRanges": [
            {
              "description": "string",
              "range": "string"
            },
            {
              "description": "string",
              "range": "string"
            },
            {
              "description": "string",
              "range": "string"
            }
          ],
          "advertisedRoutePriority": 5,
          "interfaceName": "string",
          "ipAddress": "string",
          "managementType": "MANAGED_BY_ATTACHMENT",
          "name": "string",
          "peerAsn": 10,
          "peerIpAddress": "string"
        },
        {
          "advertiseMode": "CUSTOM",
          "advertisedGroups": [
            "ALL_SUBNETS",
            "ALL_SUBNETS",
            "ALL_SUBNETS"
          ],
          "advertisedIpRanges": [
            {
              "description": "string",
              "range": "string"
            },
            {
              "description": "string",
              "range": "string"
            },
            {
              "description": "string",
              "range": "string"
            },
            {
              "description": "string",
              "range": "string"
            }
          ],
          "advertisedRoutePriority": 6,
          "interfaceName": "string",
          "ipAddress": "string",
          "managementType": "MANAGED_BY_USER",
          "name": "string",
          "peerAsn": 10,
          "peerIpAddress": "string"
        },
        {
          "advertiseMode": "DEFAULT",
          "advertisedGroups": [
            "ALL_SUBNETS"
          ],
          "advertisedIpRanges": [
            {
              "description": "string",
              "range": "string"
            },
            {
              "description": "string",
              "range": "string"
            },
            {
              "description": "string",
              "range": "string"
            },
            {
              "description": "string",
              "range": "string"
            },
            {
              "description": "string",
              "range": "string"
            },
            {
              "description": "string",
              "range": "string"
            }
          ],
          "advertisedRoutePriority": 9,
          "interfaceName": "string",
          "ipAddress": "string",
          "managementType": "MANAGED_BY_USER",
          "name": "string",
          "peerAsn": 9,
          "peerIpAddress": "string"
        },
        {
          "advertiseMode": "CUSTOM",
          "advertisedGroups": [
            "ALL_SUBNETS",
            "ALL_SUBNETS",
            "ALL_SUBNETS",
            "ALL_SUBNETS"
          ],
          "advertisedIpRanges": [
            {
              "description": "string",
              "range": "string"
            },
            {
              "description": "string",
              "range": "string"
            },
            {
              "description": "string",
              "range": "string"
            },
            {
              "description": "string",
              "range": "string"
            },
            {
              "description": "string",
              "range": "string"
            },
            {
              "description": "string",
              "range": "string"
            },
            {
              "description": "string",
              "range": "string"
            },
            {
              "description": "string",
              "range": "string"
            },
            {
              "description": "string",
              "range": "string"
            }
          ],
          "advertisedRoutePriority": 7,
          "interfaceName": "string",
          "ipAddress": "string",
          "managementType": "MANAGED_BY_USER",
          "name": "string",
          "peerAsn": 2,
          "peerIpAddress": "string"
        }
      ],
      "creationTimestamp": "string",
      "description": "string",
      "id": "string",
      "interfaces": [
        {
          "ipRange": "string",
          "linkedInterconnectAttachment": "string",
          "linkedVpnTunnel": "string",
          "managementType": "MANAGED_BY_USER",
          "name": "string"
        },
        {
          "ipRange": "string",
          "linkedInterconnectAttachment": "string",
          "linkedVpnTunnel": "string",
          "managementType": "MANAGED_BY_ATTACHMENT",
          "name": "string"
        },
        {
          "ipRange": "string",
          "linkedInterconnectAttachment": "string",
          "linkedVpnTunnel": "string",
          "managementType": "MANAGED_BY_ATTACHMENT",
          "name": "string"
        }
      ],
      "kind": "compute#router",
      "name": "string",
      "nats": [
        {
          "drainNatIps": [
            "string",
            "string"
          ],
          "icmpIdleTimeoutSec": 2,
          "logConfig": {
            "enable": true,
            "filter": "ERRORS_ONLY"
          },
          "minPortsPerVm": 5,
          "name": "string",
          "natIpAllocateOption": "AUTO_ONLY",
          "natIps": [
            "string"
          ],
          "sourceSubnetworkIpRangesToNat": "ALL_SUBNETWORKS_ALL_IP_RANGES",
          "subnetworks": [
            {
              "name": "string",
              "secondaryIpRangeNames": [
                "string",
                "string",
                "string",
                "string",
                "string",
                "string",
                "string",
                "string",
                "string"
              ],
              "sourceIpRangesToNat": [
                "PRIMARY_IP_RANGE",
                "PRIMARY_IP_RANGE",
                "LIST_OF_SECONDARY_IP_RANGES",
                "ALL_IP_RANGES",
                "LIST_OF_SECONDARY_IP_RANGES",
                "PRIMARY_IP_RANGE",
                "PRIMARY_IP_RANGE"
              ]
            },
            {
              "name": "string",
              "secondaryIpRangeNames": [
                "string",
                "string",
                "string",
                "string",
                "string",
                "string",
                "string",
                "string",
                "string",
                "string"
              ],
              "sourceIpRangesToNat": [
                "PRIMARY_IP_RANGE",
                "LIST_OF_SECONDARY_IP_RANGES",
                "ALL_IP_RANGES",
                "PRIMARY_IP_RANGE",
                "PRIMARY_IP_RANGE"
              ]
            },
            {
              "name": "string",
              "secondaryIpRangeNames": [
                "string",
                "string",
                "string",
                "string",
                "string",
                "string",
                "string",
                "string"
              ],
              "sourceIpRangesToNat": [
                "LIST_OF_SECONDARY_IP_RANGES",
                "PRIMARY_IP_RANGE",
                "LIST_OF_SECONDARY_IP_RANGES",
                "LIST_OF_SECONDARY_IP_RANGES",
                "LIST_OF_SECONDARY_IP_RANGES",
                "LIST_OF_SECONDARY_IP_RANGES",
                "LIST_OF_SECONDARY_IP_RANGES"
              ]
            },
            {
              "name": "string",
              "secondaryIpRangeNames": [
                "string",
                "string",
                "string",
                "string",
                "string",
                "string"
              ],
              "sourceIpRangesToNat": [
                "PRIMARY_IP_RANGE",
                "PRIMARY_IP_RANGE",
                "PRIMARY_IP_RANGE",
                "LIST_OF_SECONDARY_IP_RANGES",
                "LIST_OF_SECONDARY_IP_RANGES",
                "PRIMARY_IP_RANGE",
                "ALL_IP_RANGES",
                "PRIMARY_IP_RANGE",
                "LIST_OF_SECONDARY_IP_RANGES"
              ]
            },
            {
              "name": "string",
              "secondaryIpRangeNames": [
                "string",
                "string",
                "string",
                "string"
              ],
              "sourceIpRangesToNat": [
                "PRIMARY_IP_RANGE",
                "ALL_IP_RANGES",
                "PRIMARY_IP_RANGE"
              ]
            }
          ],
          "tcpEstablishedIdleTimeoutSec": 5,
          "tcpTransitoryIdleTimeoutSec": 4,
          "udpIdleTimeoutSec": 4
        },
        {
          "drainNatIps": [
            "string",
            "string",
            "string",
            "string"
          ],
          "icmpIdleTimeoutSec": 9,
          "logConfig": {
            "enable": false,
            "filter": "ERRORS_ONLY"
          },
          "minPortsPerVm": 2,
          "name": "string",
          "natIpAllocateOption": "AUTO_ONLY",
          "natIps": [
            "string",
            "string"
          ],
          "sourceSubnetworkIpRangesToNat": "LIST_OF_SUBNETWORKS",
          "subnetworks": [
            {
              "name": "string",
              "secondaryIpRangeNames": [
                "string",
                "string",
                "string",
                "string",
                "string",
                "string"
              ],
              "sourceIpRangesToNat": [
                "ALL_IP_RANGES"
              ]
            },
            {
              "name": "string",
              "secondaryIpRangeNames": [
                "string",
                "string",
                "string",
                "string",
                "string"
              ],
              "sourceIpRangesToNat": [
                "PRIMARY_IP_RANGE",
                "LIST_OF_SECONDARY_IP_RANGES",
                "ALL_IP_RANGES",
                "PRIMARY_IP_RANGE",
                "ALL_IP_RANGES",
                "ALL_IP_RANGES",
                "PRIMARY_IP_RANGE",
                "ALL_IP_RANGES"
              ]
            },
            {
              "name": "string",
              "secondaryIpRangeNames": [
                "string",
                "string",
                "string",
                "string",
                "string",
                "string"
              ],
              "sourceIpRangesToNat": [
                "ALL_IP_RANGES"
              ]
            },
            {
              "name": "string",
              "secondaryIpRangeNames": [
                "string",
                "string",
                "string",
                "string"
              ],
              "sourceIpRangesToNat": [
                "ALL_IP_RANGES",
                "LIST_OF_SECONDARY_IP_RANGES",
                "LIST_OF_SECONDARY_IP_RANGES",
                "ALL_IP_RANGES"
              ]
            },
            {
              "name": "string",
              "secondaryIpRangeNames": [
                "string",
                "string",
                "string",
                "string"
              ],
              "sourceIpRangesToNat": [
                "ALL_IP_RANGES",
                "PRIMARY_IP_RANGE",
                "PRIMARY_IP_RANGE",
                "ALL_IP_RANGES",
                "PRIMARY_IP_RANGE",
                "PRIMARY_IP_RANGE",
                "PRIMARY_IP_RANGE",
                "ALL_IP_RANGES",
                "PRIMARY_IP_RANGE"
              ]
            },
            {
              "name": "string",
              "secondaryIpRangeNames": [
                "string",
                "string",
                "string",
                "string",
                "string",
                "string",
                "string",
                "string",
                "string"
              ],
              "sourceIpRangesToNat": [
                "PRIMARY_IP_RANGE",
                "ALL_IP_RANGES"
              ]
            },
            {
              "name": "string",
              "secondaryIpRangeNames": [
                "string",
                "string",
                "string",
                "string"
              ],
              "sourceIpRangesToNat": [
                "PRIMARY_IP_RANGE",
                "PRIMARY_IP_RANGE",
                "ALL_IP_RANGES",
                "ALL_IP_RANGES",
                "PRIMARY_IP_RANGE",
                "ALL_IP_RANGES"
              ]
            },
            {
              "name": "string",
              "secondaryIpRangeNames": [
                "string",
                "string",
                "string",
                "string",
                "string",
                "string",
                "string",
                "string",
                "string",
                "string"
              ],
              "sourceIpRangesToNat": [
                "LIST_OF_SECONDARY_IP_RANGES",
                "PRIMARY_IP_RANGE",
                "PRIMARY_IP_RANGE",
                "LIST_OF_SECONDARY_IP_RANGES",
                "PRIMARY_IP_RANGE"
              ]
            },
            {
              "name": "string",
              "secondaryIpRangeNames": [
                "string",
                "string",
                "string",
                "string",
                "string",
                "string",
                "string",
                "string"
              ],
              "sourceIpRangesToNat": [
                "LIST_OF_SECONDARY_IP_RANGES",
                "ALL_IP_RANGES",
                "PRIMARY_IP_RANGE",
                "ALL_IP_RANGES",
                "ALL_IP_RANGES",
                "ALL_IP_RANGES"
              ]
            }
          ],
          "tcpEstablishedIdleTimeoutSec": 4,
          "tcpTransitoryIdleTimeoutSec": 6,
          "udpIdleTimeoutSec": 10
        },
        {
          "drainNatIps": [
            "string",
            "string",
            "string",
            "string",
            "string",
            "string",
            "string"
          ],
          "icmpIdleTimeoutSec": 7,
          "logConfig": {
            "enable": true,
            "filter": "TRANSLATIONS_ONLY"
          },
          "minPortsPerVm": 9,
          "name": "string",
          "natIpAllocateOption": "MANUAL_ONLY",
          "natIps": [
            "string",
            "string",
            "string",
            "string",
            "string",
            "string"
          ],
          "sourceSubnetworkIpRangesToNat": "ALL_SUBNETWORKS_ALL_PRIMARY_IP_RANGES",
          "subnetworks": [
            {
              "name": "string",
              "secondaryIpRangeNames": [
                "string",
                "string",
                "string",
                "string",
                "string"
              ],
              "sourceIpRangesToNat": [
                "LIST_OF_SECONDARY_IP_RANGES",
                "ALL_IP_RANGES",
                "PRIMARY_IP_RANGE",
                "ALL_IP_RANGES",
                "LIST_OF_SECONDARY_IP_RANGES"
              ]
            },
            {
              "name": "string",
              "secondaryIpRangeNames": [
                "string",
                "string",
                "string",
                "string",
                "string",
                "string",
                "string",
                "string",
                "string"
              ],
              "sourceIpRangesToNat": [
                "LIST_OF_SECONDARY_IP_RANGES",
                "PRIMARY_IP_RANGE",
                "ALL_IP_RANGES",
                "ALL_IP_RANGES",
                "PRIMARY_IP_RANGE",
                "PRIMARY_IP_RANGE",
                "ALL_IP_RANGES",
                "LIST_OF_SECONDARY_IP_RANGES",
                "ALL_IP_RANGES"
              ]
            }
          ],
          "tcpEstablishedIdleTimeoutSec": 9,
          "tcpTransitoryIdleTimeoutSec": 2,
          "udpIdleTimeoutSec": 4
        },
        {
          "drainNatIps": [
            "string",
            "string",
            "string"
          ],
          "icmpIdleTimeoutSec": 5,
          "logConfig": {
            "enable": false,
            "filter": "ALL"
          },
          "minPortsPerVm": 1,
          "name": "string",
          "natIpAllocateOption": "MANUAL_ONLY",
          "natIps": [
            "string",
            "string",
            "string",
            "string",
            "string",
            "string",
            "string",
            "string"
          ],
          "sourceSubnetworkIpRangesToNat": "ALL_SUBNETWORKS_ALL_PRIMARY_IP_RANGES",
          "subnetworks": [
            {
              "name": "string",
              "secondaryIpRangeNames": [
                "string",
                "string",
                "string",
                "string",
                "string",
                "string",
                "string",
                "string"
              ],
              "sourceIpRangesToNat": [
                "ALL_IP_RANGES",
                "ALL_IP_RANGES",
                "LIST_OF_SECONDARY_IP_RANGES",
                "ALL_IP_RANGES",
                "PRIMARY_IP_RANGE",
                "LIST_OF_SECONDARY_IP_RANGES",
                "ALL_IP_RANGES",
                "LIST_OF_SECONDARY_IP_RANGES"
              ]
            },
            {
              "name": "string",
              "secondaryIpRangeNames": [
                "string",
                "string",
                "string",
                "string",
                "string",
                "string",
                "string",
                "string"
              ],
              "sourceIpRangesToNat": [
                "LIST_OF_SECONDARY_IP_RANGES",
                "PRIMARY_IP_RANGE",
                "LIST_OF_SECONDARY_IP_RANGES",
                "PRIMARY_IP_RANGE",
                "LIST_OF_SECONDARY_IP_RANGES",
                "LIST_OF_SECONDARY_IP_RANGES",
                "PRIMARY_IP_RANGE",
                "PRIMARY_IP_RANGE",
                "LIST_OF_SECONDARY_IP_RANGES",
                "ALL_IP_RANGES"
              ]
            },
            {
              "name": "string",
              "secondaryIpRangeNames": [
                "string",
                "string",
                "string",
                "string",
                "string",
                "string",
                "string",
                "string",
                "string"
              ],
              "sourceIpRangesToNat": [
                "LIST_OF_SECONDARY_IP_RANGES",
                "ALL_IP_RANGES",
                "LIST_OF_SECONDARY_IP_RANGES",
                "ALL_IP_RANGES",
                "LIST_OF_SECONDARY_IP_RANGES",
                "PRIMARY_IP_RANGE",
                "LIST_OF_SECONDARY_IP_RANGES",
                "ALL_IP_RANGES",
                "LIST_OF_SECONDARY_IP_RANGES",
                "ALL_IP_RANGES"
              ]
            },
            {
              "name": "string",
              "secondaryIpRangeNames": [
                "string",
                "string"
              ],
              "sourceIpRangesToNat": [
                "PRIMARY_IP_RANGE",
                "LIST_OF_SECONDARY_IP_RANGES"
              ]
            },
            {
              "name": "string",
              "secondaryIpRangeNames": [
                "string",
                "string",
                "string",
                "string",
                "string",
                "string",
                "string"
              ],
              "sourceIpRangesToNat": [
                "PRIMARY_IP_RANGE",
                "PRIMARY_IP_RANGE",
                "PRIMARY_IP_RANGE",
                "ALL_IP_RANGES",
                "ALL_IP_RANGES",
                "PRIMARY_IP_RANGE",
                "LIST_OF_SECONDARY_IP_RANGES"
              ]
            },
            {
              "name": "string",
              "secondaryIpRangeNames": [
                "string",
                "string",
                "string",
                "string",
                "string",
                "string",
                "string",
                "string",
                "string",
                "string"
              ],
              "sourceIpRangesToNat": [
                "PRIMARY_IP_RANGE",
                "LIST_OF_SECONDARY_IP_RANGES",
                "PRIMARY_IP_RANGE",
                "PRIMARY_IP_RANGE"
              ]
            },
            {
              "name": "string",
              "secondaryIpRangeNames": [
                "string",
                "string",
                "string",
                "string",
                "string",
                "string",
                "string",
                "string",
                "string"
              ],
              "sourceIpRangesToNat": [
                "PRIMARY_IP_RANGE",
                "ALL_IP_RANGES",
                "PRIMARY_IP_RANGE",
                "LIST_OF_SECONDARY_IP_RANGES",
                "ALL_IP_RANGES"
              ]
            },
            {
              "name": "string",
              "secondaryIpRangeNames": [
                "string",
                "string"
              ],
              "sourceIpRangesToNat": [
                "ALL_IP_RANGES",
                "ALL_IP_RANGES",
                "PRIMARY_IP_RANGE",
                "ALL_IP_RANGES",
                "LIST_OF_SECONDARY_IP_RANGES",
                "ALL_IP_RANGES",
                "ALL_IP_RANGES",
                "PRIMARY_IP_RANGE",
                "PRIMARY_IP_RANGE"
              ]
            },
            {
              "name": "string",
              "secondaryIpRangeNames": [
                "string",
                "string",
                "string"
              ],
              "sourceIpRangesToNat": [
                "ALL_IP_RANGES",
                "LIST_OF_SECONDARY_IP_RANGES",
                "ALL_IP_RANGES"
              ]
            }
          ],
          "tcpEstablishedIdleTimeoutSec": 4,
          "tcpTransitoryIdleTimeoutSec": 8,
          "udpIdleTimeoutSec": 4
        },
        {
          "drainNatIps": [
            "string",
            "string",
            "string",
            "string",
            "string",
            "string",
            "string",
            "string",
            "string",
            "string"
          ],
          "icmpIdleTimeoutSec": 9,
          "logConfig": {
            "enable": false,
            "filter": "TRANSLATIONS_ONLY"
          },
          "minPortsPerVm": 8,
          "name": "string",
          "natIpAllocateOption": "AUTO_ONLY",
          "natIps": [
            "string",
            "string",
            "string",
            "string"
          ],
          "sourceSubnetworkIpRangesToNat": "ALL_SUBNETWORKS_ALL_PRIMARY_IP_RANGES",
          "subnetworks": [
            {
              "name": "string",
              "secondaryIpRangeNames": [
                "string"
              ],
              "sourceIpRangesToNat": [
                "ALL_IP_RANGES",
                "PRIMARY_IP_RANGE"
              ]
            },
            {
              "name": "string",
              "secondaryIpRangeNames": [
                "string",
                "string"
              ],
              "sourceIpRangesToNat": [
                "LIST_OF_SECONDARY_IP_RANGES"
              ]
            }
          ],
          "tcpEstablishedIdleTimeoutSec": 1,
          "tcpTransitoryIdleTimeoutSec": 10,
          "udpIdleTimeoutSec": 7
        },
        {
          "drainNatIps": [
            "string",
            "string",
            "string",
            "string",
            "string",
            "string",
            "string",
            "string",
            "string"
          ],
          "icmpIdleTimeoutSec": 1,
          "logConfig": {
            "enable": true,
            "filter": "ALL"
          },
          "minPortsPerVm": 5,
          "name": "string",
          "natIpAllocateOption": "AUTO_ONLY",
          "natIps": [
            "string",
            "string",
            "string",
            "string",
            "string",
            "string",
            "string"
          ],
          "sourceSubnetworkIpRangesToNat": "LIST_OF_SUBNETWORKS",
          "subnetworks": [
            {
              "name": "string",
              "secondaryIpRangeNames": [
                "string",
                "string",
                "string",
                "string",
                "string",
                "string",
                "string"
              ],
              "sourceIpRangesToNat": [
                "LIST_OF_SECONDARY_IP_RANGES",
                "LIST_OF_SECONDARY_IP_RANGES",
                "LIST_OF_SECONDARY_IP_RANGES",
                "LIST_OF_SECONDARY_IP_RANGES"
              ]
            },
            {
              "name": "string",
              "secondaryIpRangeNames": [
                "string",
                "string",
                "string"
              ],
              "sourceIpRangesToNat": [
                "PRIMARY_IP_RANGE",
                "PRIMARY_IP_RANGE",
                "PRIMARY_IP_RANGE",
                "PRIMARY_IP_RANGE",
                "PRIMARY_IP_RANGE",
                "PRIMARY_IP_RANGE",
                "LIST_OF_SECONDARY_IP_RANGES"
              ]
            },
            {
              "name": "string",
              "secondaryIpRangeNames": [
                "string",
                "string",
                "string",
                "string"
              ],
              "sourceIpRangesToNat": [
                "PRIMARY_IP_RANGE",
                "ALL_IP_RANGES",
                "LIST_OF_SECONDARY_IP_RANGES"
              ]
            },
            {
              "name": "string",
              "secondaryIpRangeNames": [
                "string",
                "string",
                "string",
                "string",
                "string",
                "string"
              ],
              "sourceIpRangesToNat": [
                "PRIMARY_IP_RANGE",
                "ALL_IP_RANGES",
                "ALL_IP_RANGES"
              ]
            },
            {
              "name": "string",
              "secondaryIpRangeNames": [
                "string",
                "string",
                "string",
                "string",
                "string",
                "string",
                "string",
                "string",
                "string",
                "string"
              ],
              "sourceIpRangesToNat": [
                "PRIMARY_IP_RANGE"
              ]
            },
            {
              "name": "string",
              "secondaryIpRangeNames": [
                "string",
                "string",
                "string",
                "string"
              ],
              "sourceIpRangesToNat": [
                "ALL_IP_RANGES",
                "ALL_IP_RANGES",
                "ALL_IP_RANGES",
                "LIST_OF_SECONDARY_IP_RANGES",
                "LIST_OF_SECONDARY_IP_RANGES",
                "ALL_IP_RANGES",
                "ALL_IP_RANGES",
                "ALL_IP_RANGES",
                "ALL_IP_RANGES"
              ]
            },
            {
              "name": "string",
              "secondaryIpRangeNames": [
                "string",
                "string",
                "string",
                "string",
                "string",
                "string",
                "string",
                "string",
                "string"
              ],
              "sourceIpRangesToNat": [
                "ALL_IP_RANGES",
                "PRIMARY_IP_RANGE",
                "LIST_OF_SECONDARY_IP_RANGES",
                "PRIMARY_IP_RANGE",
                "PRIMARY_IP_RANGE",
                "ALL_IP_RANGES",
                "PRIMARY_IP_RANGE",
                "LIST_OF_SECONDARY_IP_RANGES",
                "LIST_OF_SECONDARY_IP_RANGES"
              ]
            },
            {
              "name": "string",
              "secondaryIpRangeNames": [
                "string",
                "string",
                "string"
              ],
              "sourceIpRangesToNat": [
                "PRIMARY_IP_RANGE",
                "ALL_IP_RANGES",
                "LIST_OF_SECONDARY_IP_RANGES",
                "LIST_OF_SECONDARY_IP_RANGES",
                "LIST_OF_SECONDARY_IP_RANGES",
                "ALL_IP_RANGES",
                "LIST_OF_SECONDARY_IP_RANGES",
                "ALL_IP_RANGES",
                "LIST_OF_SECONDARY_IP_RANGES"
              ]
            },
            {
              "name": "string",
              "secondaryIpRangeNames": [
                "string",
                "string",
                "string"
              ],
              "sourceIpRangesToNat": [
                "ALL_IP_RANGES",
                "ALL_IP_RANGES",
                "LIST_OF_SECONDARY_IP_RANGES",
                "LIST_OF_SECONDARY_IP_RANGES",
                "PRIMARY_IP_RANGE",
                "LIST_OF_SECONDARY_IP_RANGES",
                "LIST_OF_SECONDARY_IP_RANGES",
                "PRIMARY_IP_RANGE",
                "ALL_IP_RANGES"
              ]
            },
            {
              "name": "string",
              "secondaryIpRangeNames": [
                "string",
                "string",
                "string",
                "string",
                "string"
              ],
              "sourceIpRangesToNat": [
                "LIST_OF_SECONDARY_IP_RANGES",
                "PRIMARY_IP_RANGE",
                "ALL_IP_RANGES",
                "PRIMARY_IP_RANGE",
                "PRIMARY_IP_RANGE",
                "LIST_OF_SECONDARY_IP_RANGES",
                "LIST_OF_SECONDARY_IP_RANGES",
                "PRIMARY_IP_RANGE",
                "LIST_OF_SECONDARY_IP_RANGES",
                "ALL_IP_RANGES"
              ]
            }
          ],
          "tcpEstablishedIdleTimeoutSec": 7,
          "tcpTransitoryIdleTimeoutSec": 8,
          "udpIdleTimeoutSec": 7
        }
      ],
      "network": "string",
      "region": "string",
      "selfLink": "string"
    },
    {
      "bgp": {
        "advertiseMode": "CUSTOM",
        "advertisedGroups": [
          "ALL_SUBNETS",
          "ALL_SUBNETS",
          "ALL_SUBNETS",
          "ALL_SUBNETS",
          "ALL_SUBNETS",
          "ALL_SUBNETS",
          "ALL_SUBNETS",
          "ALL_SUBNETS",
          "ALL_SUBNETS"
        ],
        "advertisedIpRanges": [
          {
            "description": "string",
            "range": "string"
          },
          {
            "description": "string",
            "range": "string"
          },
          {
            "description": "string",
            "range": "string"
          },
          {
            "description": "string",
            "range": "string"
          }
        ],
        "asn": 4
      },
      "bgpPeers": [
        {
          "advertiseMode": "DEFAULT",
          "advertisedGroups": [
            "ALL_SUBNETS",
            "ALL_SUBNETS",
            "ALL_SUBNETS",
            "ALL_SUBNETS",
            "ALL_SUBNETS",
            "ALL_SUBNETS",
            "ALL_SUBNETS",
            "ALL_SUBNETS",
            "ALL_SUBNETS"
          ],
          "advertisedIpRanges": [
            {
              "description": "string",
              "range": "string"
            },
            {
              "description": "string",
              "range": "string"
            }
          ],
          "advertisedRoutePriority": 2,
          "interfaceName": "string",
          "ipAddress": "string",
          "managementType": "MANAGED_BY_ATTACHMENT",
          "name": "string",
          "peerAsn": 6,
          "peerIpAddress": "string"
        }
      ],
      "creationTimestamp": "string",
      "description": "string",
      "id": "string",
      "interfaces": [
        {
          "ipRange": "string",
          "linkedInterconnectAttachment": "string",
          "linkedVpnTunnel": "string",
          "managementType": "MANAGED_BY_ATTACHMENT",
          "name": "string"
        },
        {
          "ipRange": "string",
          "linkedInterconnectAttachment": "string",
          "linkedVpnTunnel": "string",
          "managementType": "MANAGED_BY_USER",
          "name": "string"
        },
        {
          "ipRange": "string",
          "linkedInterconnectAttachment": "string",
          "linkedVpnTunnel": "string",
          "managementType": "MANAGED_BY_USER",
          "name": "string"
        }
      ],
      "kind": "compute#router",
      "name": "string",
      "nats": [
        {
          "drainNatIps": [
            "string",
            "string",
            "string",
            "string",
            "string",
            "string",
            "string",
            "string",
            "string"
          ],
          "icmpIdleTimeoutSec": 1,
          "logConfig": {
            "enable": true,
            "filter": "ERRORS_ONLY"
          },
          "minPortsPerVm": 7,
          "name": "string",
          "natIpAllocateOption": "AUTO_ONLY",
          "natIps": [
            "string"
          ],
          "sourceSubnetworkIpRangesToNat": "LIST_OF_SUBNETWORKS",
          "subnetworks": [
            {
              "name": "string",
              "secondaryIpRangeNames": [
                "string"
              ],
              "sourceIpRangesToNat": [
                "LIST_OF_SECONDARY_IP_RANGES",
                "ALL_IP_RANGES",
                "PRIMARY_IP_RANGE",
                "LIST_OF_SECONDARY_IP_RANGES",
                "ALL_IP_RANGES"
              ]
            },
            {
              "name": "string",
              "secondaryIpRangeNames": [
                "string",
                "string",
                "string",
                "string"
              ],
              "sourceIpRangesToNat": [
                "ALL_IP_RANGES",
                "LIST_OF_SECONDARY_IP_RANGES",
                "ALL_IP_RANGES",
                "ALL_IP_RANGES",
                "LIST_OF_SECONDARY_IP_RANGES"
              ]
            },
            {
              "name": "string",
              "secondaryIpRangeNames": [
                "string",
                "string",
                "string",
                "string",
                "string",
                "string",
                "string",
                "string",
                "string"
              ],
              "sourceIpRangesToNat": [
                "LIST_OF_SECONDARY_IP_RANGES",
                "LIST_OF_SECONDARY_IP_RANGES",
                "PRIMARY_IP_RANGE",
                "LIST_OF_SECONDARY_IP_RANGES"
              ]
            },
            {
              "name": "string",
              "secondaryIpRangeNames": [
                "string",
                "string",
                "string"
              ],
              "sourceIpRangesToNat": [
                "LIST_OF_SECONDARY_IP_RANGES",
                "PRIMARY_IP_RANGE",
                "PRIMARY_IP_RANGE",
                "LIST_OF_SECONDARY_IP_RANGES",
                "PRIMARY_IP_RANGE",
                "ALL_IP_RANGES",
                "LIST_OF_SECONDARY_IP_RANGES"
              ]
            },
            {
              "name": "string",
              "secondaryIpRangeNames": [
                "string",
                "string",
                "string",
                "string",
                "string",
                "string",
                "string"
              ],
              "sourceIpRangesToNat": [
                "LIST_OF_SECONDARY_IP_RANGES",
                "LIST_OF_SECONDARY_IP_RANGES",
                "LIST_OF_SECONDARY_IP_RANGES"
              ]
            },
            {
              "name": "string",
              "secondaryIpRangeNames": [
                "string",
                "string",
                "string"
              ],
              "sourceIpRangesToNat": [
                "PRIMARY_IP_RANGE",
                "ALL_IP_RANGES",
                "PRIMARY_IP_RANGE"
              ]
            },
            {
              "name": "string",
              "secondaryIpRangeNames": [
                "string",
                "string",
                "string"
              ],
              "sourceIpRangesToNat": [
                "LIST_OF_SECONDARY_IP_RANGES",
                "ALL_IP_RANGES",
                "LIST_OF_SECONDARY_IP_RANGES"
              ]
            },
            {
              "name": "string",
              "secondaryIpRangeNames": [
                "string"
              ],
              "sourceIpRangesToNat": [
                "PRIMARY_IP_RANGE",
                "ALL_IP_RANGES",
                "LIST_OF_SECONDARY_IP_RANGES",
                "ALL_IP_RANGES"
              ]
            }
          ],
          "tcpEstablishedIdleTimeoutSec": 9,
          "tcpTransitoryIdleTimeoutSec": 10,
          "udpIdleTimeoutSec": 6
        },
        {
          "drainNatIps": [
            "string",
            "string",
            "string",
            "string",
            "string"
          ],
          "icmpIdleTimeoutSec": 1,
          "logConfig": {
            "enable": true,
            "filter": "TRANSLATIONS_ONLY"
          },
          "minPortsPerVm": 7,
          "name": "string",
          "natIpAllocateOption": "AUTO_ONLY",
          "natIps": [
            "string",
            "string",
            "string",
            "string"
          ],
          "sourceSubnetworkIpRangesToNat": "LIST_OF_SUBNETWORKS",
          "subnetworks": [
            {
              "name": "string",
              "secondaryIpRangeNames": [
                "string",
                "string",
                "string",
                "string",
                "string",
                "string"
              ],
              "sourceIpRangesToNat": [
                "PRIMARY_IP_RANGE",
                "LIST_OF_SECONDARY_IP_RANGES",
                "ALL_IP_RANGES",
                "LIST_OF_SECONDARY_IP_RANGES",
                "PRIMARY_IP_RANGE",
                "ALL_IP_RANGES",
                "ALL_IP_RANGES"
              ]
            },
            {
              "name": "string",
              "secondaryIpRangeNames": [
                "string",
                "string",
                "string",
                "string",
                "string",
                "string",
                "string"
              ],
              "sourceIpRangesToNat": [
                "LIST_OF_SECONDARY_IP_RANGES",
                "PRIMARY_IP_RANGE",
                "LIST_OF_SECONDARY_IP_RANGES",
                "ALL_IP_RANGES",
                "LIST_OF_SECONDARY_IP_RANGES",
                "LIST_OF_SECONDARY_IP_RANGES",
                "ALL_IP_RANGES"
              ]
            },
            {
              "name": "string",
              "secondaryIpRangeNames": [
                "string",
                "string",
                "string",
                "string",
                "string",
                "string",
                "string",
                "string",
                "string",
                "string"
              ],
              "sourceIpRangesToNat": [
                "PRIMARY_IP_RANGE",
                "ALL_IP_RANGES",
                "ALL_IP_RANGES",
                "ALL_IP_RANGES"
              ]
            },
            {
              "name": "string",
              "secondaryIpRangeNames": [
                "string",
                "string",
                "string",
                "string",
                "string",
                "string"
              ],
              "sourceIpRangesToNat": [
                "ALL_IP_RANGES",
                "ALL_IP_RANGES",
                "PRIMARY_IP_RANGE",
                "ALL_IP_RANGES",
                "LIST_OF_SECONDARY_IP_RANGES",
                "ALL_IP_RANGES",
                "ALL_IP_RANGES"
              ]
            },
            {
              "name": "string",
              "secondaryIpRangeNames": [
                "string",
                "string",
                "string",
                "string",
                "string",
                "string",
                "string",
                "string",
                "string"
              ],
              "sourceIpRangesToNat": [
                "LIST_OF_SECONDARY_IP_RANGES",
                "ALL_IP_RANGES",
                "ALL_IP_RANGES",
                "ALL_IP_RANGES",
                "LIST_OF_SECONDARY_IP_RANGES",
                "LIST_OF_SECONDARY_IP_RANGES",
                "ALL_IP_RANGES"
              ]
            },
            {
              "name": "string",
              "secondaryIpRangeNames": [
                "string",
                "string",
                "string",
                "string",
                "string",
                "string",
                "string"
              ],
              "sourceIpRangesToNat": [
                "LIST_OF_SECONDARY_IP_RANGES",
                "LIST_OF_SECONDARY_IP_RANGES",
                "LIST_OF_SECONDARY_IP_RANGES",
                "ALL_IP_RANGES"
              ]
            },
            {
              "name": "string",
              "secondaryIpRangeNames": [
                "string",
                "string",
                "string",
                "string",
                "string",
                "string",
                "string",
                "string",
                "string"
              ],
              "sourceIpRangesToNat": [
                "PRIMARY_IP_RANGE",
                "PRIMARY_IP_RANGE",
                "ALL_IP_RANGES",
                "PRIMARY_IP_RANGE"
              ]
            },
            {
              "name": "string",
              "secondaryIpRangeNames": [
                "string",
                "string",
                "string",
                "string",
                "string",
                "string",
                "string",
                "string"
              ],
              "sourceIpRangesToNat": [
                "ALL_IP_RANGES",
                "LIST_OF_SECONDARY_IP_RANGES",
                "LIST_OF_SECONDARY_IP_RANGES",
                "PRIMARY_IP_RANGE",
                "ALL_IP_RANGES",
                "LIST_OF_SECONDARY_IP_RANGES",
                "PRIMARY_IP_RANGE"
              ]
            },
            {
              "name": "string",
              "secondaryIpRangeNames": [
                "string",
                "string",
                "string",
                "string",
                "string",
                "string",
                "string"
              ],
              "sourceIpRangesToNat": [
                "LIST_OF_SECONDARY_IP_RANGES",
                "LIST_OF_SECONDARY_IP_RANGES",
                "PRIMARY_IP_RANGE",
                "LIST_OF_SECONDARY_IP_RANGES"
              ]
            },
            {
              "name": "string",
              "secondaryIpRangeNames": [
                "string",
                "string",
                "string",
                "string"
              ],
              "sourceIpRangesToNat": [
                "PRIMARY_IP_RANGE",
                "LIST_OF_SECONDARY_IP_RANGES"
              ]
            }
          ],
          "tcpEstablishedIdleTimeoutSec": 9,
          "tcpTransitoryIdleTimeoutSec": 7,
          "udpIdleTimeoutSec": 10
        },
        {
          "drainNatIps": [
            "string",
            "string",
            "string",
            "string",
            "string",
            "string",
            "string",
            "string",
            "string"
          ],
          "icmpIdleTimeoutSec": 3,
          "logConfig": {
            "enable": false,
            "filter": "TRANSLATIONS_ONLY"
          },
          "minPortsPerVm": 6,
          "name": "string",
          "natIpAllocateOption": "MANUAL_ONLY",
          "natIps": [
            "string"
          ],
          "sourceSubnetworkIpRangesToNat": "ALL_SUBNETWORKS_ALL_PRIMARY_IP_RANGES",
          "subnetworks": [
            {
              "name": "string",
              "secondaryIpRangeNames": [
                "string",
                "string"
              ],
              "sourceIpRangesToNat": [
                "LIST_OF_SECONDARY_IP_RANGES",
                "LIST_OF_SECONDARY_IP_RANGES",
                "ALL_IP_RANGES",
                "PRIMARY_IP_RANGE",
                "ALL_IP_RANGES",
                "ALL_IP_RANGES",
                "LIST_OF_SECONDARY_IP_RANGES"
              ]
            },
            {
              "name": "string",
              "secondaryIpRangeNames": [
                "string",
                "string",
                "string",
                "string",
                "string",
                "string",
                "string"
              ],
              "sourceIpRangesToNat": [
                "LIST_OF_SECONDARY_IP_RANGES",
                "PRIMARY_IP_RANGE",
                "LIST_OF_SECONDARY_IP_RANGES",
                "PRIMARY_IP_RANGE",
                "LIST_OF_SECONDARY_IP_RANGES",
                "ALL_IP_RANGES",
                "PRIMARY_IP_RANGE"
              ]
            }
          ],
          "tcpEstablishedIdleTimeoutSec": 2,
          "tcpTransitoryIdleTimeoutSec": 1,
          "udpIdleTimeoutSec": 3
        },
        {
          "drainNatIps": [
            "string",
            "string",
            "string",
            "string",
            "string",
            "string",
            "string",
            "string"
          ],
          "icmpIdleTimeoutSec": 8,
          "logConfig": {
            "enable": true,
            "filter": "ALL"
          },
          "minPortsPerVm": 6,
          "name": "string",
          "natIpAllocateOption": "MANUAL_ONLY",
          "natIps": [
            "string",
            "string",
            "string",
            "string"
          ],
          "sourceSubnetworkIpRangesToNat": "ALL_SUBNETWORKS_ALL_PRIMARY_IP_RANGES",
          "subnetworks": [
            {
              "name": "string",
              "secondaryIpRangeNames": [
                "string",
                "string",
                "string",
                "string",
                "string"
              ],
              "sourceIpRangesToNat": [
                "ALL_IP_RANGES",
                "PRIMARY_IP_RANGE",
                "ALL_IP_RANGES",
                "ALL_IP_RANGES",
                "LIST_OF_SECONDARY_IP_RANGES",
                "PRIMARY_IP_RANGE",
                "ALL_IP_RANGES",
                "PRIMARY_IP_RANGE"
              ]
            },
            {
              "name": "string",
              "secondaryIpRangeNames": [
                "string",
                "string",
                "string",
                "string",
                "string"
              ],
              "sourceIpRangesToNat": [
                "PRIMARY_IP_RANGE"
              ]
            },
            {
              "name": "string",
              "secondaryIpRangeNames": [
                "string",
                "string",
                "string",
                "string",
                "string",
                "string",
                "string"
              ],
              "sourceIpRangesToNat": [
                "PRIMARY_IP_RANGE",
                "LIST_OF_SECONDARY_IP_RANGES",
                "LIST_OF_SECONDARY_IP_RANGES",
                "PRIMARY_IP_RANGE",
                "PRIMARY_IP_RANGE",
                "ALL_IP_RANGES",
                "ALL_IP_RANGES",
                "ALL_IP_RANGES",
                "ALL_IP_RANGES",
                "PRIMARY_IP_RANGE"
              ]
            },
            {
              "name": "string",
              "secondaryIpRangeNames": [
                "string",
                "string",
                "string",
                "string",
                "string",
                "string",
                "string"
              ],
              "sourceIpRangesToNat": [
                "PRIMARY_IP_RANGE",
                "LIST_OF_SECONDARY_IP_RANGES",
                "ALL_IP_RANGES"
              ]
            },
            {
              "name": "string",
              "secondaryIpRangeNames": [
                "string",
                "string",
                "string",
                "string",
                "string"
              ],
              "sourceIpRangesToNat": [
                "PRIMARY_IP_RANGE",
                "LIST_OF_SECONDARY_IP_RANGES",
                "PRIMARY_IP_RANGE",
                "PRIMARY_IP_RANGE"
              ]
            },
            {
              "name": "string",
              "secondaryIpRangeNames": [
                "string",
                "string",
                "string",
                "string"
              ],
              "sourceIpRangesToNat": [
                "PRIMARY_IP_RANGE",
                "LIST_OF_SECONDARY_IP_RANGES",
                "PRIMARY_IP_RANGE",
                "LIST_OF_SECONDARY_IP_RANGES",
                "PRIMARY_IP_RANGE",
                "ALL_IP_RANGES",
                "ALL_IP_RANGES",
                "LIST_OF_SECONDARY_IP_RANGES"
              ]
            },
            {
              "name": "string",
              "secondaryIpRangeNames": [
                "string",
                "string",
                "string",
                "string",
                "string",
                "string",
                "string",
                "string",
                "string",
                "string"
              ],
              "sourceIpRangesToNat": [
                "ALL_IP_RANGES"
              ]
            },
            {
              "name": "string",
              "secondaryIpRangeNames": [
                "string"
              ],
              "sourceIpRangesToNat": [
                "PRIMARY_IP_RANGE",
                "ALL_IP_RANGES",
                "PRIMARY_IP_RANGE",
                "PRIMARY_IP_RANGE",
                "PRIMARY_IP_RANGE",
                "ALL_IP_RANGES"
              ]
            },
            {
              "name": "string",
              "secondaryIpRangeNames": [
                "string",
                "string",
                "string",
                "string",
                "string"
              ],
              "sourceIpRangesToNat": [
                "LIST_OF_SECONDARY_IP_RANGES",
                "ALL_IP_RANGES",
                "ALL_IP_RANGES",
                "ALL_IP_RANGES",
                "LIST_OF_SECONDARY_IP_RANGES",
                "LIST_OF_SECONDARY_IP_RANGES",
                "PRIMARY_IP_RANGE",
                "LIST_OF_SECONDARY_IP_RANGES"
              ]
            },
            {
              "name": "string",
              "secondaryIpRangeNames": [
                "string",
                "string"
              ],
              "sourceIpRangesToNat": [
                "PRIMARY_IP_RANGE",
                "PRIMARY_IP_RANGE",
                "ALL_IP_RANGES"
              ]
            }
          ],
          "tcpEstablishedIdleTimeoutSec": 10,
          "tcpTransitoryIdleTimeoutSec": 10,
          "udpIdleTimeoutSec": 3
        }
      ],
      "network": "string",
      "region": "string",
      "selfLink": "string"
    }
  ],
  "kind": "compute#routerList",
  "nextPageToken": "string",
  "selfLink": "string",
  "warning": {
    "code": "NEXT_HOP_NOT_RUNNING",
    "data": [
      {
        "key": "string",
        "value": "string"
      }
    ],
    "message": "string"
  }
}