{
  "IPAddress": "string",
  "IPProtocol": "ICMP",
  "allPorts": false,
  "allowGlobalAccess": false,
  "backendService": "string",
  "creationTimestamp": "string",
  "description": "string",
  "fingerprint": "string",
  "id": "string",
  "ipVersion": "IPV6",
  "isMirroringCollector": true,
  "kind": "compute#forwardingRule",
  "loadBalancingScheme": "INTERNAL",
  "metadataFilters": [
    {
      "filterLabels": [
        {
          "name": "string",
          "value": "string"
        },
        {
          "name": "string",
          "value": "string"
        },
        {
          "name": "string",
          "value": "string"
        },
        {
          "name": "string",
          "value": "string"
        },
        {
          "name": "string",
          "value": "string"
        },
        {
          "name": "string",
          "value": "string"
        },
        {
          "name": "string",
          "value": "string"
        }
      ],
      "filterMatchCriteria": "MATCH_ALL"
    }
  ],
  "name": "string",
  "network": "string",
  "networkTier": "PREMIUM",
  "portRange": "string",
  "ports": [
    "string",
    "string",
    "string",
    "string",
    "string",
    "string",
    "string",
    "string",
    "string"
  ],
  "region": "string",
  "selfLink": "string",
  "serviceLabel": "string",
  "serviceName": "string",
  "subnetwork": "string",
  "target": "string"
}