{
  "actions": [
    {
      "name": "getProjectGlobalTargetTcpProxies",
      "protocol": "REST",
      "method": "GET",
      "entitypath": "{base_path}/{version}/projects/{pathv1}/global/targetTcpProxies?{query}",
      "requestSchema": "schema.json",
      "responseSchema": "schema.json",
      "timeout": 0,
      "sendEmpty": false,
      "sendGetBody": false,
      "requestDatatype": "JSON",
      "responseDatatype": "JSON",
      "headers": {},
      "responseObjects": [
        {
          "type": "default",
          "key": "",
          "mockFile": "mockdatafiles/getProjectGlobalTargetTcpProxies-default.json"
        }
      ]
    },
    {
      "name": "postProjectGlobalTargetTcpProxies",
      "protocol": "REST",
      "method": "POST",
      "entitypath": "{base_path}/{version}/projects/{pathv1}/global/targetTcpProxies?{query}",
      "requestSchema": "schema.json",
      "responseSchema": "schema.json",
      "timeout": 0,
      "sendEmpty": false,
      "requestDatatype": "JSON",
      "responseDatatype": "JSON",
      "headers": {},
      "responseObjects": [
        {
          "type": "default",
          "key": "",
          "mockFile": "mockdatafiles/postProjectGlobalTargetTcpProxies-default.json"
        }
      ]
    },
    {
      "name": "deleteProjectGlobalTargetTcpProxiesTargetTcpProxy",
      "protocol": "REST",
      "method": "DELETE",
      "entitypath": "{base_path}/{version}/projects/{pathv1}/global/targetTcpProxies/{pathv2}?{query}",
      "requestSchema": "schema.json",
      "responseSchema": "schema.json",
      "timeout": 0,
      "sendEmpty": false,
      "requestDatatype": "JSON",
      "responseDatatype": "JSON",
      "headers": {},
      "responseObjects": [
        {
          "type": "default",
          "key": "",
          "mockFile": "mockdatafiles/deleteProjectGlobalTargetTcpProxiesTargetTcpProxy-default.json"
        }
      ]
    },
    {
      "name": "getProjectGlobalTargetTcpProxiesTargetTcpProxy",
      "protocol": "REST",
      "method": "GET",
      "entitypath": "{base_path}/{version}/projects/{pathv1}/global/targetTcpProxies/{pathv2}?{query}",
      "requestSchema": "schema.json",
      "responseSchema": "schema.json",
      "timeout": 0,
      "sendEmpty": false,
      "sendGetBody": false,
      "requestDatatype": "JSON",
      "responseDatatype": "JSON",
      "headers": {},
      "responseObjects": [
        {
          "type": "default",
          "key": "",
          "mockFile": "mockdatafiles/getProjectGlobalTargetTcpProxiesTargetTcpProxy-default.json"
        }
      ]
    },
    {
      "name": "postProjectGlobalTargetTcpProxiesTargetTcpProxySetBackendService",
      "protocol": "REST",
      "method": "POST",
      "entitypath": "{base_path}/{version}/projects/{pathv1}/global/targetTcpProxies/{pathv2}/setBackendService?{query}",
      "requestSchema": "schema.json",
      "responseSchema": "schema.json",
      "timeout": 0,
      "sendEmpty": false,
      "requestDatatype": "JSON",
      "responseDatatype": "JSON",
      "headers": {},
      "responseObjects": [
        {
          "type": "default",
          "key": "",
          "mockFile": "mockdatafiles/postProjectGlobalTargetTcpProxiesTargetTcpProxySetBackendService-default.json"
        }
      ]
    },
    {
      "name": "postProjectGlobalTargetTcpProxiesTargetTcpProxySetProxyHeader",
      "protocol": "REST",
      "method": "POST",
      "entitypath": "{base_path}/{version}/projects/{pathv1}/global/targetTcpProxies/{pathv2}/setProxyHeader?{query}",
      "requestSchema": "schema.json",
      "responseSchema": "schema.json",
      "timeout": 0,
      "sendEmpty": false,
      "requestDatatype": "JSON",
      "responseDatatype": "JSON",
      "headers": {},
      "responseObjects": [
        {
          "type": "default",
          "key": "",
          "mockFile": "mockdatafiles/postProjectGlobalTargetTcpProxiesTargetTcpProxySetProxyHeader-default.json"
        }
      ]
    }
  ]
}