{
  "clientOperationId": "string",
  "creationTimestamp": "string",
  "description": "string",
  "endTime": "string",
  "error": {
    "errors": [
      {
        "code": "string",
        "location": "string",
        "message": "string"
      },
      {
        "code": "string",
        "location": "string",
        "message": "string"
      },
      {
        "code": "string",
        "location": "string",
        "message": "string"
      },
      {
        "code": "string",
        "location": "string",
        "message": "string"
      },
      {
        "code": "string",
        "location": "string",
        "message": "string"
      }
    ]
  },
  "httpErrorMessage": "string",
  "httpErrorStatusCode": 4,
  "id": "string",
  "insertTime": "string",
  "kind": "compute#operation",
  "name": "string",
  "operationType": "string",
  "progress": 4,
  "region": "string",
  "selfLink": "string",
  "startTime": "string",
  "status": "RUNNING",
  "statusMessage": "string",
  "targetId": "string",
  "targetLink": "string",
  "user": "string",
  "warnings": [
    {
      "code": "NOT_CRITICAL_ERROR",
      "data": [
        {
          "key": "string",
          "value": "string"
        },
        {
          "key": "string",
          "value": "string"
        },
        {
          "key": "string",
          "value": "string"
        }
      ],
      "message": "string"
    },
    {
      "code": "FIELD_VALUE_OVERRIDEN",
      "data": [
        {
          "key": "string",
          "value": "string"
        },
        {
          "key": "string",
          "value": "string"
        },
        {
          "key": "string",
          "value": "string"
        },
        {
          "key": "string",
          "value": "string"
        },
        {
          "key": "string",
          "value": "string"
        },
        {
          "key": "string",
          "value": "string"
        },
        {
          "key": "string",
          "value": "string"
        }
      ],
      "message": "string"
    },
    {
      "code": "REQUIRED_TOS_AGREEMENT",
      "data": [
        {
          "key": "string",
          "value": "string"
        },
        {
          "key": "string",
          "value": "string"
        },
        {
          "key": "string",
          "value": "string"
        },
        {
          "key": "string",
          "value": "string"
        }
      ],
      "message": "string"
    }
  ],
  "zone": "string"
}