{
  "actions": [
    {
      "name": "getNetworks",
      "protocol": "REST",
      "method": "GET",
      "entitypath": "{base_path}/{version}/networks?{query}",
      "requestSchema": "schema.json",
      "responseSchema": "schema.json",
      "timeout": 0,
      "sendEmpty": false,
      "sendGetBody": false,
      "requestDatatype": "JSON",
      "responseDatatype": "JSON",
      "headers": {},
      "responseObjects": [
        {
          "type": "default",
          "key": "",
          "mockFile": "mockdatafiles/getNetworks-default.json"
        }
      ]
    },
    {
      "name": "getNetworksid",
      "protocol": "REST",
      "method": "GET",
      "entitypath": "{base_path}/{version}/networks/{pathv1}?{query}",
      "requestSchema": "schema.json",
      "responseSchema": "schema.json",
      "timeout": 0,
      "sendEmpty": false,
      "sendGetBody": false,
      "requestDatatype": "JSON",
      "responseDatatype": "JSON",
      "headers": {},
      "responseObjects": [
        {
          "type": "default",
          "key": "",
          "mockFile": "mockdatafiles/getNetworksid-default.json"
        }
      ]
    },
    {
      "name": "deleteNetworksid",
      "protocol": "REST",
      "method": "DELETE",
      "entitypath": "{base_path}/{version}/networks/{pathv1}?{query}",
      "requestSchema": "schema.json",
      "responseSchema": "schema.json",
      "timeout": 0,
      "sendEmpty": false,
      "sendGetBody": false,
      "requestDatatype": "JSON",
      "responseDatatype": "JSON",
      "headers": {},
      "responseObjects": [
        {
          "type": "default",
          "key": "",
          "mockFile": ""
        }
      ]
    },
    {
      "name": "postNetworkscreate",
      "protocol": "REST",
      "method": "POST",
      "entitypath": "{base_path}/{version}/networks/create?{query}",
      "requestSchema": "schema.json",
      "responseSchema": "schema.json",
      "timeout": 0,
      "sendEmpty": false,
      "sendGetBody": false,
      "requestDatatype": "JSON",
      "responseDatatype": "JSON",
      "headers": {},
      "responseObjects": [
        {
          "type": "default",
          "key": "",
          "mockFile": "mockdatafiles/postNetworkscreate-default.json"
        }
      ]
    },
    {
      "name": "postNetworksidconnect",
      "protocol": "REST",
      "method": "POST",
      "entitypath": "{base_path}/{version}/networks/{pathv1}/connect?{query}",
      "requestSchema": "schema.json",
      "responseSchema": "schema.json",
      "timeout": 0,
      "sendEmpty": false,
      "sendGetBody": false,
      "requestDatatype": "JSON",
      "responseDatatype": "JSON",
      "headers": {},
      "responseObjects": [
        {
          "type": "default",
          "key": "",
          "mockFile": ""
        }
      ]
    },
    {
      "name": "postNetworksiddisconnect",
      "protocol": "REST",
      "method": "POST",
      "entitypath": "{base_path}/{version}/networks/{pathv1}/disconnect?{query}",
      "requestSchema": "schema.json",
      "responseSchema": "schema.json",
      "timeout": 0,
      "sendEmpty": false,
      "sendGetBody": false,
      "requestDatatype": "JSON",
      "responseDatatype": "JSON",
      "headers": {},
      "responseObjects": [
        {
          "type": "default",
          "key": "",
          "mockFile": ""
        }
      ]
    },
    {
      "name": "postNetworksprune",
      "protocol": "REST",
      "method": "POST",
      "entitypath": "{base_path}/{version}/networks/prune?{query}",
      "requestSchema": "schema.json",
      "responseSchema": "schema.json",
      "timeout": 0,
      "sendEmpty": false,
      "sendGetBody": false,
      "requestDatatype": "JSON",
      "responseDatatype": "JSON",
      "headers": {},
      "responseObjects": [
        {
          "type": "default",
          "key": "",
          "mockFile": "mockdatafiles/postNetworksprune-default.json"
        }
      ]
    }
  ]
}