{
  "Version": "1.13.0",
  "Os": "linux",
  "KernelVersion": "3.19.0-23-generic",
  "GoVersion": "go1.6.3",
  "GitCommit": "deadbee",
  "Arch": "amd64",
  "ApiVersion": "1.25",
  "MinAPIVersion": "1.12",
  "BuildTime": "2016-06-14T07:09:13.444803460+00:00",
  "Experimental": true
}