{
  "actions": [
    {
      "name": "getVolumes",
      "protocol": "REST",
      "method": "GET",
      "entitypath": "{base_path}/{version}/volumes?{query}",
      "requestSchema": "schema.json",
      "responseSchema": "schema.json",
      "timeout": 0,
      "sendEmpty": false,
      "sendGetBody": false,
      "requestDatatype": "JSON",
      "responseDatatype": "JSON",
      "headers": {},
      "responseObjects": [
        {
          "type": "default",
          "key": "",
          "mockFile": "mockdatafiles/getVolumes-default.json"
        }
      ]
    },
    {
      "name": "postVolumescreate",
      "protocol": "REST",
      "method": "POST",
      "entitypath": "{base_path}/{version}/volumes/create?{query}",
      "requestSchema": "schema.json",
      "responseSchema": "schema.json",
      "timeout": 0,
      "sendEmpty": false,
      "sendGetBody": false,
      "requestDatatype": "JSON",
      "responseDatatype": "JSON",
      "headers": {},
      "responseObjects": [
        {
          "type": "default",
          "key": "",
          "mockFile": "mockdatafiles/postVolumescreate-default.json"
        }
      ]
    },
    {
      "name": "getVolumesname",
      "protocol": "REST",
      "method": "GET",
      "entitypath": "{base_path}/{version}/volumes/{pathv1}?{query}",
      "requestSchema": "schema.json",
      "responseSchema": "schema.json",
      "timeout": 0,
      "sendEmpty": false,
      "sendGetBody": false,
      "requestDatatype": "JSON",
      "responseDatatype": "JSON",
      "headers": {},
      "responseObjects": [
        {
          "type": "default",
          "key": "",
          "mockFile": "mockdatafiles/getVolumesname-default.json"
        }
      ]
    },
    {
      "name": "deleteVolumesname",
      "protocol": "REST",
      "method": "DELETE",
      "entitypath": "{base_path}/{version}/volumes/{pathv1}?{query}",
      "requestSchema": "schema.json",
      "responseSchema": "schema.json",
      "timeout": 0,
      "sendEmpty": false,
      "sendGetBody": false,
      "requestDatatype": "JSON",
      "responseDatatype": "JSON",
      "headers": {},
      "responseObjects": [
        {
          "type": "default",
          "key": "",
          "mockFile": ""
        }
      ]
    },
    {
      "name": "postVolumesprune",
      "protocol": "REST",
      "method": "POST",
      "entitypath": "{base_path}/{version}/volumes/prune?{query}",
      "requestSchema": "schema.json",
      "responseSchema": "schema.json",
      "timeout": 0,
      "sendEmpty": false,
      "sendGetBody": false,
      "requestDatatype": "JSON",
      "responseDatatype": "JSON",
      "headers": {},
      "responseObjects": [
        {
          "type": "default",
          "key": "",
          "mockFile": "mockdatafiles/postVolumesprune-default.json"
        }
      ]
    }
  ]
}