{
  "actions": [
    {
      "name": "listTypes",
      "protocol": "REST",
      "method": "GET",
      "entitypath": "{base_path}/{version}?{query}",
      "requestSchema": "schema.json",
      "responseSchema": "schema.json",
      "timeout": 0,
      "sendEmpty": false,
      "sendGetBody": false,
      "requestDatatype": "URLENCODE",
      "responseDatatype": "XML2JSON",
      "headers": {},
      "responseObjects": [
        {
          "type": "default",
          "key": "",
          "mockFile": "mockdatafiles/listTypes-default.xml"
        }
      ]
    },
    {
      "name": "describeType",
      "protocol": "REST",
      "method": "GET",
      "entitypath": "{base_path}/{version}?{query}",
      "requestSchema": "schema.json",
      "responseSchema": "schema.json",
      "timeout": 0,
      "sendEmpty": false,
      "sendGetBody": false,
      "requestDatatype": "URLENCODE",
      "responseDatatype": "XML2JSON",
      "headers": {},
      "responseObjects": [
        {
          "type": "default",
          "key": "",
          "mockFile": "mockdatafiles/describeType-default.xml"
        }
      ]
    },
    {
      "name": "listTypeRegistrations",
      "protocol": "REST",
      "method": "GET",
      "entitypath": "{base_path}/{version}?{query}",
      "requestSchema": "schema.json",
      "responseSchema": "schema.json",
      "timeout": 0,
      "sendEmpty": false,
      "sendGetBody": false,
      "requestDatatype": "URLENCODE",
      "responseDatatype": "XML2JSON",
      "headers": {},
      "responseObjects": [
        {
          "type": "default",
          "key": "",
          "mockFile": "mockdatafiles/listTypeRegistrations-default.xml"
        }
      ]
    },
    {
      "name": "describeTypeRegistration",
      "protocol": "REST",
      "method": "GET",
      "entitypath": "{base_path}/{version}?{query}",
      "requestSchema": "schema.json",
      "responseSchema": "schema.json",
      "timeout": 0,
      "sendEmpty": false,
      "sendGetBody": false,
      "requestDatatype": "URLENCODE",
      "responseDatatype": "XML2JSON",
      "headers": {},
      "responseObjects": [
        {
          "type": "default",
          "key": "",
          "mockFile": "mockdatafiles/describeTypeRegistration-default.xml"
        }
      ]
    },
    {
      "name": "registerType",
      "protocol": "REST",
      "method": "GET",
      "entitypath": "{base_path}/{version}?{query}",
      "requestSchema": "schema.json",
      "responseSchema": "schema.json",
      "timeout": 0,
      "sendEmpty": false,
      "sendGetBody": false,
      "requestDatatype": "URLENCODE",
      "responseDatatype": "XML2JSON",
      "headers": {},
      "responseObjects": [
        {
          "type": "default",
          "key": "",
          "mockFile": "mockdatafiles/registerType-default.xml"
        }
      ]
    },
    {
      "name": "deregisterType",
      "protocol": "REST",
      "method": "GET",
      "entitypath": "{base_path}/{version}?{query}",
      "requestSchema": "schema.json",
      "responseSchema": "schema.json",
      "timeout": 0,
      "sendEmpty": false,
      "sendGetBody": false,
      "requestDatatype": "URLENCODE",
      "responseDatatype": "XML2JSON",
      "headers": {},
      "responseObjects": [
        {
          "type": "default",
          "key": "",
          "mockFile": "mockdatafiles/deregisterType-default.xml"
        }
      ]
    },
    {
      "name": "listTypeVersions",
      "protocol": "REST",
      "method": "GET",
      "entitypath": "{base_path}/{version}?{query}",
      "requestSchema": "schema.json",
      "responseSchema": "schema.json",
      "timeout": 0,
      "sendEmpty": false,
      "sendGetBody": false,
      "requestDatatype": "URLENCODE",
      "responseDatatype": "XML2JSON",
      "headers": {},
      "responseObjects": [
        {
          "type": "default",
          "key": "",
          "mockFile": "mockdatafiles/listTypeVersions-default.xml"
        }
      ]
    },
    {
      "name": "setTypeDefaultVersion",
      "protocol": "REST",
      "method": "GET",
      "entitypath": "{base_path}/{version}?{query}",
      "requestSchema": "schema.json",
      "responseSchema": "schema.json",
      "timeout": 0,
      "sendEmpty": false,
      "sendGetBody": false,
      "requestDatatype": "URLENCODE",
      "responseDatatype": "XML2JSON",
      "headers": {},
      "responseObjects": [
        {
          "type": "default",
          "key": "",
          "mockFile": "mockdatafiles/setTypeDefaultVersion-default.xml"
        }
      ]
    },
    {
      "name": "activateType",
      "protocol": "REST",
      "method": "GET",
      "entitypath": "{base_path}/{version}?{query}",
      "requestSchema": "schema.json",
      "responseSchema": "schema.json",
      "timeout": 0,
      "sendEmpty": false,
      "sendGetBody": false,
      "requestDatatype": "URLENCODE",
      "responseDatatype": "XML2JSON",
      "headers": {},
      "responseObjects": [
        {
          "type": "default",
          "key": "",
          "mockFile": "mockdatafiles/activateType-default.xml"
        }
      ]
    },
    {
      "name": "batchDescribeTypeConfigurations",
      "protocol": "REST",
      "method": "GET",
      "entitypath": "{base_path}/{version}?{query}",
      "requestSchema": "schema.json",
      "responseSchema": "schema.json",
      "timeout": 0,
      "sendEmpty": false,
      "sendGetBody": false,
      "requestDatatype": "URLENCODE",
      "responseDatatype": "XML2JSON",
      "headers": {},
      "responseObjects": [
        {
          "type": "default",
          "key": "",
          "mockFile": "mockdatafiles/batchDescribeTypeConfigurations-default.xml"
        }
      ]
    },
    {
      "name": "deactivateType",
      "protocol": "REST",
      "method": "GET",
      "entitypath": "{base_path}/{version}?{query}",
      "requestSchema": "schema.json",
      "responseSchema": "schema.json",
      "timeout": 0,
      "sendEmpty": false,
      "sendGetBody": false,
      "requestDatatype": "URLENCODE",
      "responseDatatype": "XML2JSON",
      "headers": {},
      "responseObjects": [
        {
          "type": "default",
          "key": "",
          "mockFile": "mockdatafiles/deactivateType-default.xml"
        }
      ]
    },
    {
      "name": "publishType",
      "protocol": "REST",
      "method": "GET",
      "entitypath": "{base_path}/{version}?{query}",
      "requestSchema": "schema.json",
      "responseSchema": "schema.json",
      "timeout": 0,
      "sendEmpty": false,
      "sendGetBody": false,
      "requestDatatype": "URLENCODE",
      "responseDatatype": "XML2JSON",
      "headers": {},
      "responseObjects": [
        {
          "type": "default",
          "key": "",
          "mockFile": "mockdatafiles/publishType-default.xml"
        }
      ]
    },
    {
      "name": "setTypeConfiguration",
      "protocol": "REST",
      "method": "GET",
      "entitypath": "{base_path}/{version}?{query}",
      "requestSchema": "schema.json",
      "responseSchema": "schema.json",
      "timeout": 0,
      "sendEmpty": false,
      "sendGetBody": false,
      "requestDatatype": "URLENCODE",
      "responseDatatype": "XML2JSON",
      "headers": {},
      "responseObjects": [
        {
          "type": "default",
          "key": "",
          "mockFile": "mockdatafiles/setTypeConfiguration-default.xml"
        }
      ]
    },
    {
      "name": "testType",
      "protocol": "REST",
      "method": "GET",
      "entitypath": "{base_path}/{version}?{query}",
      "requestSchema": "schema.json",
      "responseSchema": "schema.json",
      "timeout": 0,
      "sendEmpty": false,
      "sendGetBody": false,
      "requestDatatype": "URLENCODE",
      "responseDatatype": "XML2JSON",
      "headers": {},
      "responseObjects": [
        {
          "type": "default",
          "key": "",
          "mockFile": "mockdatafiles/testType-default.xml"
        }
      ]
    }
  ]
}