{
  "links": {
    "applies-to": "string",
    "vector": "string",
    "self": "string"
  },
  "max-loss": "string",
  "max-latency": 2,
  "max-jitter": 3,
  "min-mos": "string",
  "name": "string",
  "description": "string",
  "service-class": "string",
  "lb-strategy": "string",
  "required-qp": 7,
  "qp-preference": "string",
  "session-resiliency": "string",
  "peer-path-resiliency": "string",
  "path-quality-filter": "string",
  "best-effort": "string",
  "transport-state-enforcement": "string",
  "generated": "string",
  "ingress-source-nat": "string"
}