{
  "links": {
    "self": "string"
  },
  "hmac": "string",
  "hmac-mode": "string",
  "name": "string",
  "description": "string",
  "hmac-cipher": "string",
  "hmac-key": "string",
  "encryption-cipher": "string",
  "encryption-key": "string",
  "encryption-iv": "string",
  "encrypt": "string",
  "adaptive-encryption": "string"
}