[
  {
    "links": {
      "self": "string"
    },
    "code": 5,
    "description": "string",
    "encoded-type": "string",
    "quantity": "string",
    "value": [
      "string",
      "string",
      "string",
      "string"
    ]
  },
  {
    "links": {
      "self": "string"
    },
    "code": 9,
    "description": "string",
    "encoded-type": "string",
    "quantity": "string",
    "value": [
      "string",
      "string",
      "string",
      "string",
      "string"
    ]
  }
]