[
  {
    "ipAddress": "string",
    "sourceNatIpAddresses": [
      "string"
    ],
    "deviceInterface": "string",
    "networkInterface": "string",
    "qualityPoints": 2,
    "linkLatency": 4,
    "jitter": 4,
    "packetLoss": 7
  }
]