{
  "links": {
    "next-hop-interface": "string",
    "self": "string"
  },
  "next-hop": [
    "string",
    "string",
    "string",
    "string",
    "string",
    "string",
    "string",
    "string",
    "string"
  ],
  "blackhole": "string",
  "destination-prefix": "string",
  "distance": 1,
  "description": "string"
}