[
  {
    "name": "string",
    "description": "string",
    "maxSessions": "string",
    "sessionRate": "string",
    "sessionHighWaterMark": 4,
    "sessionLowWaterMark": 5
  },
  {
    "name": "string",
    "description": "string",
    "maxSessions": "string",
    "sessionRate": "string",
    "sessionHighWaterMark": 2,
    "sessionLowWaterMark": 6
  },
  {
    "name": "string",
    "description": "string",
    "maxSessions": "string",
    "sessionRate": "string",
    "sessionHighWaterMark": 9,
    "sessionLowWaterMark": 4
  },
  {
    "name": "string",
    "description": "string",
    "maxSessions": "string",
    "sessionRate": "string",
    "sessionHighWaterMark": 1,
    "sessionLowWaterMark": 4
  }
]