{
  "links": {
    "address-family": "string",
    "timers": "string",
    "transport": "string",
    "multihop": "string",
    "neighbor-policy": "string",
    "self": "string"
  },
  "neighbor-address": "string",
  "neighbor-as": 3,
  "local-as": 5,
  "shutdown": "string",
  "auth-password": "string",
  "description": "string",
  "outbound-policy-advertise": "string"
}