[
  {
    "links": {
      "transport": "string",
      "self": "string"
    },
    "name": "string",
    "description": "string",
    "service-class": "string",
    "timeout": 3,
    "nat-keep-alive": "string"
  },
  {
    "links": {
      "transport": "string",
      "self": "string"
    },
    "name": "string",
    "description": "string",
    "service-class": "string",
    "timeout": 10,
    "nat-keep-alive": "string"
  },
  {
    "links": {
      "transport": "string",
      "self": "string"
    },
    "name": "string",
    "description": "string",
    "service-class": "string",
    "timeout": 6,
    "nat-keep-alive": "string"
  },
  {
    "links": {
      "transport": "string",
      "self": "string"
    },
    "name": "string",
    "description": "string",
    "service-class": "string",
    "timeout": 8,
    "nat-keep-alive": "string"
  }
]