{
  "links": {
    "self": "string"
  },
  "state": "string",
  "desired-tx-interval": 8,
  "required-min-rx-interval": 3,
  "required-min-echo-interval": 7,
  "authentication-type": "string",
  "multiplier": 5,
  "link-test-interval": 6,
  "link-test-length": 8,
  "dscp": 4
}