{
  "links": {
    "address-family": "string",
    "neighbor": "string",
    "redistribute": "string",
    "timers": "string",
    "confederation": "string",
    "route-selection-options": "string",
    "self": "string"
  },
  "description": "string",
  "type": "string",
  "local-as": 6,
  "router-id": "string"
}