{
  "links": {
    "self": "string"
  },
  "type": "string",
  "router-name": [
    "string",
    "string",
    "string",
    "string",
    "string"
  ],
  "group-name": [
    "string",
    "string",
    "string"
  ]
}