{
  "links": {
    "prefix-limit": "string",
    "route-reflector": "string",
    "as-path-options": "string",
    "self": "string"
  },
  "afi-safi": "string",
  "send-default-route": "string",
  "next-hop-self": "string",
  "remove-private-as": "string"
}