{
  "links": {
    "next-hop": "string",
    "host": "string",
    "reachability-detection": "string",
    "self": "string"
  },
  "destination": "string",
  "nat-target": "string",
  "port-target": 3,
  "peer": "string",
  "next-peer": [
    "string",
    "string",
    "string",
    "string",
    "string",
    "string"
  ],
  "use-learned-routes": "string",
  "routing-stack": "string",
  "name": "string",
  "service-name": "string",
  "generated": "string",
  "service-route-policy": "string"
}