{
  "links": {
    "self": "string"
  },
  "community-attribute": [
    "string",
    "string",
    "string",
    "string",
    "string",
    "string"
  ],
  "additive": "string",
  "none": "string",
  "ip-address": "string",
  "peer-address": "string",
  "set": 6,
  "add": 1,
  "subtract": 1,
  "type": "string",
  "as": 5,
  "aggregator-address": "string",
  "exclude": "string",
  "prepend": "string",
  "community-filter": "string",
  "route-target": [
    "string"
  ],
  "site-of-origin": [
    "string",
    "string"
  ],
  "local-preference": 6,
  "originator-id": "string",
  "origin": "string",
  "bgp-weight": 6,
  "tag": 7,
  "statement": "string",
  "policy": "string"
}