[
  {
    "links": {
      "network-interface": "string",
      "pppoe": "string",
      "lte": "string",
      "traffic-engineering": "string",
      "load-balancing": "string",
      "session-optimization": "string",
      "self": "string"
    },
    "name": "string",
    "description": "string",
    "type": "string",
    "pci-address": "string",
    "link-settings": "string",
    "mode": "string",
    "target-interface": "string",
    "bridge-name": "string",
    "network-namespace": "string",
    "enabled": "string",
    "forwarding": "string",
    "capture-filter": [
      "string",
      "string",
      "string",
      "string",
      "string",
      "string",
      "string",
      "string",
      "string",
      "string"
    ],
    "shared-phys-address": "string",
    "strip-vlan": "string",
    "promiscuous-mode": "string"
  },
  {
    "links": {
      "network-interface": "string",
      "pppoe": "string",
      "lte": "string",
      "traffic-engineering": "string",
      "load-balancing": "string",
      "session-optimization": "string",
      "self": "string"
    },
    "name": "string",
    "description": "string",
    "type": "string",
    "pci-address": "string",
    "link-settings": "string",
    "mode": "string",
    "target-interface": "string",
    "bridge-name": "string",
    "network-namespace": "string",
    "enabled": "string",
    "forwarding": "string",
    "capture-filter": [
      "string"
    ],
    "shared-phys-address": "string",
    "strip-vlan": "string",
    "promiscuous-mode": "string"
  },
  {
    "links": {
      "network-interface": "string",
      "pppoe": "string",
      "lte": "string",
      "traffic-engineering": "string",
      "load-balancing": "string",
      "session-optimization": "string",
      "self": "string"
    },
    "name": "string",
    "description": "string",
    "type": "string",
    "pci-address": "string",
    "link-settings": "string",
    "mode": "string",
    "target-interface": "string",
    "bridge-name": "string",
    "network-namespace": "string",
    "enabled": "string",
    "forwarding": "string",
    "capture-filter": [
      "string",
      "string",
      "string",
      "string",
      "string",
      "string",
      "string",
      "string",
      "string"
    ],
    "shared-phys-address": "string",
    "strip-vlan": "string",
    "promiscuous-mode": "string"
  }
]