[
  {
    "links": {
      "self": "string"
    },
    "percentage": 4,
    "delay": 3
  },
  {
    "links": {
      "self": "string"
    },
    "percentage": 4,
    "delay": 4
  },
  {
    "links": {
      "self": "string"
    },
    "percentage": 3,
    "delay": 7
  }
]