[
  {
    "serviceName": "string",
    "route": {
      "ipPrefix": "string",
      "l4Port": 7,
      "l4PortUpper": 8,
      "protocol": "string",
      "tenant": "string",
      "nextHops": [
        {
          "devicePort": 7,
          "gateway": "string",
          "nodeId": 7,
          "van": 4
        },
        {
          "devicePort": 4,
          "gateway": "string",
          "nodeId": 8,
          "van": 4
        },
        {
          "devicePort": 10,
          "gateway": "string",
          "nodeId": 8,
          "van": 10
        }
      ]
    }
  },
  {
    "serviceName": "string",
    "route": {
      "ipPrefix": "string",
      "l4Port": 4,
      "l4PortUpper": 10,
      "protocol": "string",
      "tenant": "string",
      "nextHops": [
        {
          "devicePort": 9,
          "gateway": "string",
          "nodeId": 9,
          "van": 3
        }
      ]
    }
  }
]