{
  "links": {
    "static-route": "string",
    "custom": "string",
    "vendor-specific-information": "string",
    "vendor-identifying-vendor-specific-information": "string",
    "self": "string"
  },
  "link-layer-address": "string",
  "client-identifier": "string",
  "circuit-identifier": "string",
  "address": "string",
  "router": [
    "string",
    "string",
    "string",
    "string",
    "string",
    "string",
    "string",
    "string",
    "string"
  ],
  "domain-name": "string",
  "interface-mtu": 3,
  "domain-server": [
    "string",
    "string",
    "string",
    "string",
    "string",
    "string",
    "string",
    "string",
    "string",
    "string"
  ],
  "ntp-server": [
    "string",
    "string",
    "string",
    "string",
    "string",
    "string",
    "string"
  ],
  "smtp-server": [
    "string"
  ],
  "pop-server": [
    "string",
    "string",
    "string",
    "string",
    "string",
    "string",
    "string"
  ]
}