{
  "links": {
    "bfd": "string",
    "self": "string"
  },
  "name": "string",
  "generated": "string",
  "description": "string",
  "authority-name": "string",
  "router-name": "string",
  "inter-router-security": "string"
}