[
  {
    "id": "string",
    "permutations": [
      {
        "value": "string",
        "parameters": [
          {
            "name": "string",
            "value": "string"
          },
          {
            "name": "string",
            "value": "string"
          },
          {
            "name": "string",
            "value": "string"
          }
        ]
      },
      {
        "value": "string",
        "parameters": [
          {
            "name": "string",
            "value": "string"
          },
          {
            "name": "string",
            "value": "string"
          },
          {
            "name": "string",
            "value": "string"
          }
        ]
      },
      {
        "value": "string",
        "parameters": [
          {
            "name": "string",
            "value": "string"
          },
          {
            "name": "string",
            "value": "string"
          },
          {
            "name": "string",
            "value": "string"
          },
          {
            "name": "string",
            "value": "string"
          }
        ]
      },
      {
        "value": "string",
        "parameters": [
          {
            "name": "string",
            "value": "string"
          },
          {
            "name": "string",
            "value": "string"
          },
          {
            "name": "string",
            "value": "string"
          },
          {
            "name": "string",
            "value": "string"
          },
          {
            "name": "string",
            "value": "string"
          },
          {
            "name": "string",
            "value": "string"
          },
          {
            "name": "string",
            "value": "string"
          }
        ]
      },
      {
        "value": "string",
        "parameters": [
          {
            "name": "string",
            "value": "string"
          },
          {
            "name": "string",
            "value": "string"
          },
          {
            "name": "string",
            "value": "string"
          },
          {
            "name": "string",
            "value": "string"
          },
          {
            "name": "string",
            "value": "string"
          },
          {
            "name": "string",
            "value": "string"
          },
          {
            "name": "string",
            "value": "string"
          },
          {
            "name": "string",
            "value": "string"
          },
          {
            "name": "string",
            "value": "string"
          }
        ]
      }
    ]
  }
]