[
  {
    "links": {
      "self": "string"
    },
    "name": "string",
    "address": "string",
    "search-base": "string",
    "server-type": "string",
    "port": "string",
    "bind-type": "string",
    "distinguished-name": "string",
    "password": "string"
  }
]