{
  "links": {
    "self": "string"
  },
  "peer-address": "string",
  "peer-local": "string",
  "type": "string",
  "prefix-filter": "string",
  "as-path-filter": "string",
  "community-filter": "string",
  "extended-community-filter": "string",
  "next-hop-node": "string",
  "next-hop-interface": "string",
  "metric": 4,
  "origin": "string",
  "probability": 7,
  "tag": 2
}