TABLE	Database
Logiciel	Heavydyn
VersionBDD	1
Locale	fr-FR
TimeZone
TABLE	Dossiers
Nom	Démo Heavydyn FR
Client
ContactClient
Dossier
Localite
Date	28/04/2021
Ouvrage
Commentaire
Smoothing	True
UnitDeplNom	1/100 mm
UnitDeplRatio	1e-5
UnitForceNom	kN
UnitForceRatio	1000
TABLE	PVs
Nom	PV-01
Date	28/03/2021
Operateur	SP
Voie	Gauche
PartieOuvrage	
Sens	Voir plan
Climat	
Commentaire	Données démo non représentatives
TABLE	Sequences
Nom	FR-65KN
TABLE	Etapes
Numero	1
TypeDrop	Distance
ValeurDrop	0,1
TABLE	Etapes
Numero	2
TypeDrop	Force
ValeurDrop	65
TABLE	Etapes
Numero	3
TypeDrop	Force
ValeurDrop	65
TABLE	Plateformes
Type	Voirie
Couche	Couche de base
Materiau	Béton bitumineux
GTR	
Etat	Séche
ClassDeflection	Custom
SeuilDeflection	69
TABLE	Machines
Serial	HVY-124H
Attribution	Rincent NDT
MAC	60-9A-88-63-3E-F8-17-4A
LicStart	2018-09-22T23:59:00Z
LicEnd	2050-09-22T23:59:00Z
CertStart	2020-12-29T23:59:00Z
CertEnd	2021-12-21T23:59:00Z
TABLE	ParamsAcqu
NbSample	1500
FreqAcqu	30000
TABLE	Calibrations
Infos	Default values calibration
Date	20/06/2018
DPlaque	0,3
PositionCapteurs	-300,000	-200,000	   0,000	 200,000	 300,000	 600,000	 900,000	1200,000	1500,000	1800,000	2100,000
IndexD0	0
TABLE	Voies
VoieAcqu	0
ChannelAdc	
Distance	0
Nom	FELH
Type	LoadCell
Gain	3.903e-8
V0	0
TABLE	Voies
VoieAcqu	1
ChannelAdc	
Distance	-300
Nom	FG-133
Type	Geophone
Gain	2.985e+1
V0	0
TABLE	Voies
VoieAcqu	2
ChannelAdc	
Distance	-200
Nom	FG-135
Type	Geophone
Gain	3.053e+1
V0	0
TABLE	Voies
VoieAcqu	3
ChannelAdc	
Distance	0
Nom	FG-150
Type	Geophone
Gain	3.087e+1
V0	0
TABLE	Voies
VoieAcqu	4
ChannelAdc	
Distance	200
Nom	FG-136
Type	Geophone
Gain	3.138e+1
V0	0
TABLE	Voies
VoieAcqu	5
ChannelAdc	
Distance	300
Nom	FG-137
Type	Geophone
Gain	3.136e+1
V0	0
TABLE	Voies
VoieAcqu	6
ChannelAdc	
Distance	600
Nom	FG-139
Type	Geophone
Gain	3.063e+1
V0	0
TABLE	Voies
VoieAcqu	7
ChannelAdc	
Distance	900
Nom	FG-140
Type	Geophone
Gain	3.045e+1
V0	0
TABLE	Voies
VoieAcqu	8
ChannelAdc	
Distance	1200
Nom	FG-141
Type	Geophone
Gain	3.102e+1
V0	0
TABLE	Voies
VoieAcqu	9
ChannelAdc	
Distance	1500
Nom	FG-142
Type	Geophone
Gain	3.080e+1
V0	0
TABLE	Voies
VoieAcqu	10
ChannelAdc	
Distance	1800
Nom	FG-143
Type	Geophone
Gain	3.083e+1
V0	0
TABLE	Voies
VoieAcqu	11
ChannelAdc	
Distance	2100
Nom	FG-144
Type	Geophone
Gain	3.092e+1
V0	0
TABLE	Sensors
Nom	AirTemp
Type	AirTemp
Gain	0,392
V0	99,77
TABLE	Sensors
Nom	SurfTemp
Type	SurfTemp
Gain	1
V0	0
TABLE	Sensors
Nom	DMI
Type	Dmi
Gain	180
V0	0
TABLE	ResultatsPV
Point_Nombre	26
PointsOK_Nombre	26
PointOK_Max	0
PointOK_Min	0
PointsOK_Moyenne	0
PointsOK_St	0
PointsPass_Nombre	15
PointsFailNombre	11
TABLE	ArrayResult
Latitude	48,674729	48,674556	48,674397	48,674214	48,67399	48,673875	48,673557	48,673406	48,673278	48,673217	48,673177	48,673134	48,673092	48,673012	48,672943	48,672806	48,672577	48,672347	48,67212	48,671918	48,67168	48,671458	48,67117	48,670871	48,67057	48,670337
Longitude	2,201283	2,200985	2,200639	2,200279	2,199906	2,199729	2,199338	2,199122	2,198954	2,198884	2,198846	2,198796	2,198759	2,198678	2,198609	2,198474	2,198216	2,197979	2,197748	2,19754	2,197271	2,197042	2,196741	2,196422	2,196102	2,195829
Tair	14,271288875210907	13,68100338339997	13,68100338339997	13,68100338339997	13,68100338339997	13,68100338339997	13,68100338339997	13,68100338339997	13,68100338339997	13,48423506521577	13,877732776100848	13,68100338339997	13,68100338339997	13,48423506521577	13,877732776100848	14,074540019768367	14,468057193395106	14,468057193395106	14,468057193395106	14,468057193395106	14,664844974320966	14,664844974320966	14,664844974320966	14,664844974320966	14,468057193395106	14,664844974320966
Tsurf	12,799	11,529	12,672	13,815	11,91	12,799	10,005	11,275	15,466	12,164	11,148	12,545	13,307	13,815	15,974	15,593	13,815	16,482	16,863	13,053	17,625	17,117	15,466	11,656	15,847	13,18
Tman	0	0	0	0	0	0	0	0	0	0	0	0	0	0	0	0	0	0	0	0	0	0	0	0	0	0
ForceMax	64	64	65	65	65	65	64	64	65	56	60	63	48	58	63	60	64	63	63	64	64	64	61	64	64	64
D_0300	48	36	32	34	40	33	60	43	57	201	126	65	>300	176	83	112	47	58	54	40	49	36	93	46	41	39
D_0200	53	40	37	39	46	38	73	51	63	222	140	77	255	203	95	140	56	68	64	45	58	42	103	54	45	47
D0000	62	47	45	47	57	49	94	64	73	249	160	95	201	243	117	182	71	86	82	56	76	54	121	72	55	63
D0200	55	40	37	39	45	39	71	50	63	218	127	76	>300	194	97	141	56	70	63	45	59	42	103	55	45	46
D0300	48	34	31	32	38	32	55	40	54	186	104	63	284	151	79	110	46	57	50	37	47	35	89	44	39	36
D0600	29	22	19	19	22	19	26	23	35	105	56	37	102	70	45	50	27	32	28	22	26	21	52	24	25	20
D0900	19	15	13	13	15	13	14	14	23	55	31	22	44	31	27	22	18	19	18	16	16	14	29	15	16	12
D1200	13	11	9	9	10	10	10	10	15	22	17	13	14	17	16	10	12	13	12	11	11	10	16	10	11	7
D1500	9	8	6	7	7	8	7	7	11	5	11	9	4	11	10	6	9	9	9	8	8	7	11	7	8	5
D1800	7	6	5	6	6	6	6	6	8	0,0	7	7	0,0	6	7	4	7	7	6	7	6	6	7	5	6	4
D2100	6	5	4	5	4	5	5	5	5	0,0	4	5	0,0	3	5	1	6	5	5	5	5	5	4	4	4	3
TABLE	ReportPoints
Numero	1
Latitude	48,674729
Longitude	2,201283
DOP	4,8
Chainage	0
Tair	14,271
Tsurf	12,799
Tman	0
Commentaire	Données démo non représentatives
Date	28/03/2022 10:14:10
TABLE	Drops
Numero	1
PulseTime	24
ForceMax	64
D_0300	49
D_0200	54
D0000	64
D0200	56
D0300	48
D0600	29
D0900	19
D1200	13
D1500	9
D1800	7
D2100	6
TABLE	Drops
Numero	2
PulseTime	24
ForceMax	64
D_0300	48
D_0200	53
D0000	62
D0200	55
D0300	48
D0600	29
D0900	19
D1200	13
D1500	9
D1800	7
D2100	6
TABLE	Drops
Numero	3
PulseTime	24
ForceMax	64
D_0300	48
D_0200	53
D0000	62
D0200	55
D0300	48
D0600	29
D0900	19
D1200	13
D1500	9
D1800	7
D2100	6
TABLE	ReportPoints
Numero	2
Latitude	48,674556
Longitude	2,200985
DOP	1,5
Chainage	30
Tair	13,681
Tsurf	11,529
Tman	0
Commentaire	Données démo non représentatives
Date	28/03/2022 10:25:29
TABLE	Drops
Numero	1
PulseTime	23
ForceMax	66
D_0300	37
D_0200	41
D0000	49
D0200	41
D0300	36
D0600	23
D0900	16
D1200	11
D1500	8
D1800	6
D2100	5
TABLE	Drops
Numero	2
PulseTime	23
ForceMax	65
D_0300	36
D_0200	40
D0000	47
D0200	40
D0300	35
D0600	23
D0900	16
D1200	11
D1500	8
D1800	6
D2100	5
TABLE	Drops
Numero	3
PulseTime	23
ForceMax	64
D_0300	36
D_0200	40
D0000	47
D0200	40
D0300	34
D0600	22
D0900	15
D1200	11
D1500	8
D1800	6
D2100	5
TABLE	ReportPoints
Numero	3
Latitude	48,674397
Longitude	2,200639
DOP	1,5
Chainage	62,2
Tair	13,681
Tsurf	12,672
Tman	0
Commentaire	Données démo non représentatives
Date	28/03/2022 10:26:17
TABLE	Drops
Numero	1
PulseTime	23
ForceMax	66
D_0300	34
D_0200	39
D0000	47
D0200	39
D0300	33
D0600	20
D0900	13
D1200	9
D1500	6
D1800	5
D2100	4
TABLE	Drops
Numero	2
PulseTime	23
ForceMax	65
D_0300	33
D_0200	37
D0000	45
D0200	37
D0300	31
D0600	19
D0900	13
D1200	9
D1500	6
D1800	5
D2100	4
TABLE	Drops
Numero	3
PulseTime	23
ForceMax	65
D_0300	32
D_0200	37
D0000	45
D0200	37
D0300	31
D0600	19
D0900	13
D1200	9
D1500	6
D1800	5
D2100	4
TABLE	ReportPoints
Numero	4
Latitude	48,674214
Longitude	2,200279
DOP	1,5
Chainage	96,3
Tair	13,681
Tsurf	13,815
Tman	0
Commentaire	Données démo non représentatives
Date	28/03/2022 10:27:01
TABLE	Drops
Numero	1
PulseTime	24
ForceMax	66
D_0300	37
D_0200	43
D0000	52
D0200	43
D0300	35
D0600	20
D0900	13
D1200	9
D1500	7
D1800	5
D2100	4
TABLE	Drops
Numero	2
PulseTime	24
ForceMax	66
D_0300	34
D_0200	40
D0000	48
D0200	39
D0300	32
D0600	19
D0900	13
D1200	9
D1500	7
D1800	6
D2100	5
TABLE	Drops
Numero	3
PulseTime	24
ForceMax	65
D_0300	34
D_0200	39
D0000	47
D0200	39
D0300	32
D0600	19
D0900	13
D1200	9
D1500	7
D1800	6
D2100	5
TABLE	ReportPoints
Numero	5
Latitude	48,67399
Longitude	2,199906
DOP	1,5
Chainage	134,2
Tair	13,681
Tsurf	11,91
Tman	0
Commentaire	Données démo non représentatives
Date	28/03/2022 10:27:52
TABLE	Drops
Numero	1
PulseTime	24
ForceMax	66
D_0300	43
D_0200	49
D0000	61
D0200	49
D0300	41
D0600	23
D0900	15
D1200	10
D1500	7
D1800	6
D2100	4
TABLE	Drops
Numero	2
PulseTime	24
ForceMax	65
D_0300	40
D_0200	46
D0000	57
D0200	45
D0300	38
D0600	22
D0900	15
D1200	10
D1500	7
D1800	6
D2100	4
TABLE	Drops
Numero	3
PulseTime	24
ForceMax	65
D_0300	40
D_0200	46
D0000	57
D0200	45
D0300	38
D0600	22
D0900	15
D1200	10
D1500	7
D1800	6
D2100	4
TABLE	ReportPoints
Numero	6
Latitude	48,673875
Longitude	2,199729
DOP	1,5
Chainage	152,5
Tair	13,681
Tsurf	12,799
Tman	0
Commentaire	Données démo non représentatives
Date	28/03/2022 10:28:33
TABLE	Drops
Numero	1
PulseTime	24
ForceMax	66
D_0300	35
D_0200	41
D0000	53
D0200	42
D0300	35
D0600	20
D0900	14
D1200	10
D1500	8
D1800	6
D2100	5
TABLE	Drops
Numero	2
PulseTime	24
ForceMax	65
D_0300	33
D_0200	38
D0000	50
D0200	39
D0300	32
D0600	19
D0900	13
D1200	10
D1500	8
D1800	6
D2100	5
TABLE	Drops
Numero	3
PulseTime	24
ForceMax	65
D_0300	33
D_0200	38
D0000	49
D0200	39
D0300	32
D0600	19
D0900	13
D1200	10
D1500	8
D1800	6
D2100	5
TABLE	ReportPoints
Numero	7
Latitude	48,673557
Longitude	2,199338
DOP	1,5
Chainage	196,9
Tair	13,681
Tsurf	10,005
Tman	0
Commentaire	Données démo non représentatives
Date	28/03/2022 10:29:23
TABLE	Drops
Numero	1
PulseTime	25
ForceMax	63
D_0300	65
D_0200	79
D0000	112
D0200	82
D0300	61
D0600	28
D0900	15
D1200	10
D1500	7
D1800	6
D2100	5
TABLE	Drops
Numero	2
PulseTime	25
ForceMax	64
D_0300	60
D_0200	73
D0000	96
D0200	73
D0300	56
D0600	26
D0900	14
D1200	10
D1500	7
D1800	6
D2100	5
TABLE	Drops
Numero	3
PulseTime	24
ForceMax	64
D_0300	60
D_0200	73
D0000	94
D0200	71
D0300	55
D0600	26
D0900	14
D1200	10
D1500	7
D1800	6
D2100	5
TABLE	ReportPoints
Numero	8
Latitude	48,673406
Longitude	2,199122
DOP	1,8
Chainage	223,1
Tair	13,681
Tsurf	11,275
Tman	0
Commentaire	Données démo non représentatives
Date	28/03/2022 10:30:04
TABLE	Drops
Numero	1
PulseTime	24
ForceMax	65
D_0300	46
D_0200	55
D0000	69
D0200	53
D0300	43
D0600	24
D0900	15
D1200	10
D1500	7
D1800	6
D2100	5
TABLE	Drops
Numero	2
PulseTime	24
ForceMax	64
D_0300	43
D_0200	51
D0000	65
D0200	50
D0300	40
D0600	23
D0900	15
D1200	10
D1500	7
D1800	6
D2100	5
TABLE	Drops
Numero	3
PulseTime	24
ForceMax	64
D_0300	43
D_0200	51
D0000	64
D0200	50
D0300	40
D0600	23
D0900	14
D1200	10
D1500	7
D1800	6
D2100	5
TABLE	ReportPoints
Numero	9
Latitude	48,673278
Longitude	2,198954
DOP	1,5
Chainage	243
Tair	13,681
Tsurf	15,466
Tman	0
Commentaire	Données démo non représentatives
Date	28/03/2022 10:30:46
TABLE	Drops
Numero	1
PulseTime	25
ForceMax	64
D_0300	61
D_0200	68
D0000	80
D0200	67
D0300	58
D0600	37
D0900	23
D1200	15
D1500	10
D1800	8
D2100	5
TABLE	Drops
Numero	2
PulseTime	24
ForceMax	65
D_0300	57
D_0200	64
D0000	74
D0200	63
D0300	55
D0600	35
D0900	23
D1200	15
D1500	11
D1800	8
D2100	5
TABLE	Drops
Numero	3
PulseTime	24
ForceMax	65
D_0300	57
D_0200	63
D0000	73
D0200	63
D0300	54
D0600	35
D0900	23
D1200	15
D1500	11
D1800	8
D2100	5
TABLE	ReportPoints
Numero	10
Latitude	48,673217
Longitude	2,198884
DOP	1,5
Chainage	254,1
Tair	13,484
Tsurf	12,164
Tman	0
Commentaire	Données démo non représentatives
Date	28/03/2022 10:31:23
TABLE	Drops
Numero	1
PulseTime	27
ForceMax	55
D_0300	210
D_0200	236
D0000	240
D0200	240
D0300	197
D0600	108
D0900	52
D1200	19
D1500	4
D1800	0,0
D2100	0,0
TABLE	Drops
Numero	2
PulseTime	26
ForceMax	56
D_0300	202
D_0200	225
D0000	246
D0200	228
D0300	190
D0600	107
D0900	54
D1200	22
D1500	5
D1800	0,0
D2100	0,0
TABLE	Drops
Numero	3
PulseTime	26
ForceMax	56
D_0300	201
D_0200	222
D0000	249
D0200	218
D0300	186
D0600	105
D0900	55
D1200	22
D1500	5
D1800	0,0
D2100	0,0
TABLE	ReportPoints
Numero	11
Latitude	48,673177
Longitude	2,198846
DOP	1,5
Chainage	256,6
Tair	13,878
Tsurf	11,148
Tman	0
Commentaire	Données démo non représentatives
Date	28/03/2022 10:32:26
TABLE	Drops
Numero	1
PulseTime	25
ForceMax	61
D_0300	130
D_0200	142
D0000	167
D0200	130
D0300	104
D0600	53
D0900	30
D1200	16
D1500	10
D1800	7
D2100	4
TABLE	Drops
Numero	2
PulseTime	25
ForceMax	61
D_0300	126
D_0200	140
D0000	160
D0200	127
D0300	103
D0600	56
D0900	30
D1200	17
D1500	11
D1800	7
D2100	4
TABLE	Drops
Numero	3
PulseTime	25
ForceMax	60
D_0300	126
D_0200	140
D0000	160
D0200	127
D0300	104
D0600	56
D0900	31
D1200	17
D1500	11
D1800	7
D2100	4
TABLE	ReportPoints
Numero	12
Latitude	48,673134
Longitude	2,198796
DOP	1,5
Chainage	259,8
Tair	13,681
Tsurf	12,545
Tman	0
Commentaire	Données démo non représentatives
Date	28/03/2022 10:33:07
TABLE	Drops
Numero	1
PulseTime	24
ForceMax	64
D_0300	68
D_0200	81
D0000	102
D0200	80
D0300	66
D0600	38
D0900	22
D1200	13
D1500	9
D1800	7
D2100	4
TABLE	Drops
Numero	2
PulseTime	25
ForceMax	63
D_0300	65
D_0200	76
D0000	95
D0200	75
D0300	63
D0600	37
D0900	22
D1200	13
D1500	9
D1800	7
D2100	5
TABLE	Drops
Numero	3
PulseTime	25
ForceMax	63
D_0300	65
D_0200	77
D0000	95
D0200	76
D0300	63
D0600	37
D0900	22
D1200	13
D1500	9
D1800	7
D2100	5
TABLE	ReportPoints
Numero	13
Latitude	48,673092
Longitude	2,198759
DOP	1,5
Chainage	264,2
Tair	13,681
Tsurf	13,307
Tman	0
Commentaire	Données démo non représentatives
Date	28/03/2022 10:34:37
TABLE	Drops
Numero	1
PulseTime	30
ForceMax	47
D_0300	> 300
D_0200	293
D0000	192
D0200	> 300
D0300	245
D0600	97
D0900	40
D1200	13
D1500	4
D1800	1
D2100	0,0
TABLE	Drops
Numero	2
PulseTime	30
ForceMax	48
D_0300	> 300
D_0200	253
D0000	197
D0200	> 300
D0300	289
D0600	101
D0900	43
D1200	14
D1500	4
D1800	0,0
D2100	0,0
TABLE	Drops
Numero	3
PulseTime	29
ForceMax	48
D_0300	> 300
D_0200	255
D0000	201
D0200	> 300
D0300	284
D0600	102
D0900	44
D1200	14
D1500	4
D1800	0,0
D2100	0,0
TABLE	ReportPoints
Numero	14
Latitude	48,673012
Longitude	2,198678
DOP	1,5
Chainage	267,4
Tair	13,484
Tsurf	13,815
Tman	0
Commentaire	Données démo non représentatives
Date	28/03/2022 10:35:19
TABLE	Drops
Numero	1
PulseTime	27
ForceMax	58
D_0300	179
D_0200	211
D0000	246
D0200	202
D0300	156
D0600	68
D0900	29
D1200	16
D1500	10
D1800	6
D2100	3
TABLE	Drops
Numero	2
PulseTime	27
ForceMax	57
D_0300	175
D_0200	202
D0000	244
D0200	194
D0300	151
D0600	69
D0900	30
D1200	17
D1500	10
D1800	6
D2100	3
TABLE	Drops
Numero	3
PulseTime	27
ForceMax	58
D_0300	176
D_0200	203
D0000	243
D0200	194
D0300	151
D0600	70
D0900	31
D1200	17
D1500	11
D1800	6
D2100	3
TABLE	ReportPoints
Numero	15
Latitude	48,672943
Longitude	2,198609
DOP	4,8
Chainage	48,6
Tair	13,878
Tsurf	15,974
Tman	0
Commentaire	Données démo non représentatives
Date	28/03/2022 10:39:08
TABLE	Drops
Numero	1
PulseTime	25
ForceMax	61
D_0300	86
D_0200	99
D0000	126
D0200	100
D0300	81
D0600	45
D0900	26
D1200	15
D1500	9
D1800	7
D2100	5
TABLE	Drops
Numero	2
PulseTime	25
ForceMax	63
D_0300	83
D_0200	96
D0000	121
D0200	98
D0300	79
D0600	45
D0900	26
D1200	16
D1500	10
D1800	7
D2100	5
TABLE	Drops
Numero	3
PulseTime	25
ForceMax	63
D_0300	83
D_0200	95
D0000	117
D0200	97
D0300	79
D0600	45
D0900	27
D1200	16
D1500	10
D1800	7
D2100	5
TABLE	ReportPoints
Numero	16
Latitude	48,672806
Longitude	2,198474
DOP	4,8
Chainage	67,7
Tair	14,075
Tsurf	15,593
Tman	0
Commentaire	Données démo non représentatives
Date	28/03/2022 10:40:00
TABLE	Drops
Numero	1
PulseTime	26
ForceMax	60
D_0300	117
D_0200	149
D0000	202
D0200	152
D0300	115
D0600	50
D0900	22
D1200	10
D1500	6
D1800	4
D2100	2
TABLE	Drops
Numero	2
PulseTime	26
ForceMax	60
D_0300	111
D_0200	139
D0000	184
D0200	141
D0300	110
D0600	50
D0900	22
D1200	10
D1500	6
D1800	4
D2100	1
TABLE	Drops
Numero	3
PulseTime	26
ForceMax	60
D_0300	112
D_0200	140
D0000	182
D0200	141
D0300	110
D0600	50
D0900	22
D1200	10
D1500	6
D1800	4
D2100	1
TABLE	ReportPoints
Numero	17
Latitude	48,672577
Longitude	2,198216
DOP	4
Chainage	101
Tair	14,468
Tsurf	13,815
Tman	0
Commentaire	Données démo non représentatives
Date	28/03/2022 10:41:05
TABLE	Drops
Numero	1
PulseTime	24
ForceMax	65
D_0300	50
D_0200	58
D0000	75
D0200	58
D0300	47
D0600	27
D0900	18
D1200	12
D1500	9
D1800	7
D2100	6
TABLE	Drops
Numero	2
PulseTime	24
ForceMax	64
D_0300	47
D_0200	55
D0000	71
D0200	55
D0300	45
D0600	26
D0900	18
D1200	12
D1500	9
D1800	7
D2100	6
TABLE	Drops
Numero	3
PulseTime	24
ForceMax	64
D_0300	47
D_0200	56
D0000	71
D0200	56
D0300	46
D0600	27
D0900	18
D1200	12
D1500	9
D1800	7
D2100	6
TABLE	ReportPoints
Numero	18
Latitude	48,672347
Longitude	2,197979
DOP	4
Chainage	130,9
Tair	14,468
Tsurf	16,482
Tman	0
Commentaire	Données démo non représentatives
Date	28/03/2022 10:41:56
TABLE	Drops
Numero	1
PulseTime	24
ForceMax	65
D_0300	62
D_0200	73
D0000	92
D0200	74
D0300	60
D0600	31
D0900	19
D1200	12
D1500	9
D1800	7
D2100	5
TABLE	Drops
Numero	2
PulseTime	24
ForceMax	63
D_0300	59
D_0200	68
D0000	87
D0200	70
D0300	58
D0600	32
D0900	19
D1200	12
D1500	9
D1800	7
D2100	5
TABLE	Drops
Numero	3
PulseTime	24
ForceMax	63
D_0300	58
D_0200	68
D0000	86
D0200	70
D0300	57
D0600	32
D0900	19
D1200	13
D1500	9
D1800	7
D2100	5
TABLE	ReportPoints
Numero	19
Latitude	48,67212
Longitude	2,197748
DOP	1,5
Chainage	161,4
Tair	14,468
Tsurf	16,863
Tman	0
Commentaire	Données démo non représentatives
Date	28/03/2022 10:42:46
TABLE	Drops
Numero	1
PulseTime	24
ForceMax	64
D_0300	57
D_0200	68
D0000	88
D0200	67
D0300	54
D0600	29
D0900	17
D1200	12
D1500	8
D1800	6
D2100	5
TABLE	Drops
Numero	2
PulseTime	25
ForceMax	63
D_0300	54
D_0200	64
D0000	82
D0200	63
D0300	51
D0600	28
D0900	18
D1200	12
D1500	9
D1800	6
D2100	5
TABLE	Drops
Numero	3
PulseTime	24
ForceMax	63
D_0300	54
D_0200	64
D0000	82
D0200	63
D0300	50
D0600	28
D0900	18
D1200	12
D1500	9
D1800	6
D2100	5
TABLE	ReportPoints
Numero	20
Latitude	48,671918
Longitude	2,19754
DOP	1,5
Chainage	189,5
Tair	14,468
Tsurf	13,053
Tman	0
Commentaire	Données démo non représentatives
Date	28/03/2022 10:43:37
TABLE	Drops
Numero	1
PulseTime	24
ForceMax	66
D_0300	41
D_0200	48
D0000	59
D0200	47
D0300	39
D0600	23
D0900	16
D1200	11
D1500	8
D1800	7
D2100	5
TABLE	Drops
Numero	2
PulseTime	24
ForceMax	65
D_0300	40
D_0200	46
D0000	57
D0200	45
D0300	38
D0600	23
D0900	16
D1200	11
D1500	9
D1800	7
D2100	5
TABLE	Drops
Numero	3
PulseTime	24
ForceMax	64
D_0300	40
D_0200	45
D0000	56
D0200	45
D0300	37
D0600	22
D0900	16
D1200	11
D1500	8
D1800	7
D2100	5
TABLE	ReportPoints
Numero	21
Latitude	48,67168
Longitude	2,197271
DOP	1,8
Chainage	222,4
Tair	14,665
Tsurf	17,625
Tman	0
Commentaire	Données démo non représentatives
Date	28/03/2022 10:44:25
TABLE	Drops
Numero	1
PulseTime	24
ForceMax	65
D_0300	51
D_0200	61
D0000	80
D0200	61
D0300	49
D0600	26
D0900	16
D1200	11
D1500	8
D1800	6
D2100	5
TABLE	Drops
Numero	2
PulseTime	24
ForceMax	64
D_0300	49
D_0200	58
D0000	76
D0200	58
D0300	47
D0600	26
D0900	16
D1200	11
D1500	8
D1800	6
D2100	5
TABLE	Drops
Numero	3
PulseTime	24
ForceMax	64
D_0300	49
D_0200	58
D0000	76
D0200	59
D0300	47
D0600	26
D0900	16
D1200	11
D1500	8
D1800	6
D2100	5
TABLE	ReportPoints
Numero	22
Latitude	48,671458
Longitude	2,197042
DOP	1,5
Chainage	253,5
Tair	14,665
Tsurf	17,117
Tman	0
Commentaire	Données démo non représentatives
Date	28/03/2022 10:45:14
TABLE	Drops
Numero	1
PulseTime	24
ForceMax	66
D_0300	37
D_0200	44
D0000	57
D0200	44
D0300	36
D0600	21
D0900	14
D1200	10
D1500	7
D1800	6
D2100	5
TABLE	Drops
Numero	2
PulseTime	24
ForceMax	64
D_0300	36
D_0200	42
D0000	54
D0200	42
D0300	35
D0600	21
D0900	14
D1200	10
D1500	7
D1800	6
D2100	5
TABLE	Drops
Numero	3
PulseTime	24
ForceMax	64
D_0300	36
D_0200	42
D0000	54
D0200	42
D0300	35
D0600	21
D0900	14
D1200	10
D1500	7
D1800	6
D2100	5
TABLE	ReportPoints
Numero	23
Latitude	48,67117
Longitude	2,196741
DOP	1,5
Chainage	292,6
Tair	14,665
Tsurf	15,466
Tman	0
Commentaire	Données démo non représentatives
Date	28/03/2022 10:45:57
TABLE	Drops
Numero	1
PulseTime	25
ForceMax	62
D_0300	95
D_0200	106
D0000	125
D0200	106
D0300	90
D0600	51
D0900	28
D1200	16
D1500	10
D1800	7
D2100	4
TABLE	Drops
Numero	2
PulseTime	25
ForceMax	61
D_0300	92
D_0200	103
D0000	121
D0200	103
D0300	89
D0600	52
D0900	28
D1200	16
D1500	11
D1800	7
D2100	4
TABLE	Drops
Numero	3
PulseTime	25
ForceMax	61
D_0300	93
D_0200	103
D0000	121
D0200	103
D0300	89
D0600	52
D0900	29
D1200	16
D1500	11
D1800	7
D2100	4
TABLE	ReportPoints
Numero	24
Latitude	48,670871
Longitude	2,196422
DOP	1,8
Chainage	333,6
Tair	14,665
Tsurf	11,656
Tman	0
Commentaire	Données démo non représentatives
Date	28/03/2022 10:46:41
TABLE	Drops
Numero	1
PulseTime	25
ForceMax	65
D_0300	47
D_0200	57
D0000	77
D0200	59
D0300	46
D0600	25
D0900	15
D1200	10
D1500	7
D1800	5
D2100	4
TABLE	Drops
Numero	2
PulseTime	25
ForceMax	64
D_0300	46
D_0200	54
D0000	73
D0200	56
D0300	44
D0600	24
D0900	15
D1200	10
D1500	7
D1800	5
D2100	4
TABLE	Drops
Numero	3
PulseTime	25
ForceMax	64
D_0300	46
D_0200	54
D0000	72
D0200	55
D0300	44
D0600	24
D0900	15
D1200	10
D1500	7
D1800	5
D2100	4
TABLE	ReportPoints
Numero	25
Latitude	48,67057
Longitude	2,196102
DOP	1,5
Chainage	375,2
Tair	14,468
Tsurf	15,847
Tman	0
Commentaire	Données démo non représentatives
Date	28/03/2022 10:47:33
TABLE	Drops
Numero	1
PulseTime	24
ForceMax	65
D_0300	42
D_0200	47
D0000	57
D0200	47
D0300	41
D0600	26
D0900	16
D1200	11
D1500	7
D1800	5
D2100	4
TABLE	Drops
Numero	2
PulseTime	24
ForceMax	64
D_0300	41
D_0200	45
D0000	55
D0200	45
D0300	39
D0600	25
D0900	16
D1200	11
D1500	8
D1800	6
D2100	4
TABLE	Drops
Numero	3
PulseTime	25
ForceMax	64
D_0300	41
D_0200	45
D0000	55
D0200	45
D0300	39
D0600	25
D0900	16
D1200	11
D1500	8
D1800	6
D2100	4
TABLE	ReportPoints
Numero	26
Latitude	48,670337
Longitude	2,195829
DOP	1,5
Chainage	407,1
Tair	14,665
Tsurf	13,18
Tman	0
Commentaire	Données démo non représentatives
Date	28/03/2022 10:48:21
TABLE	Drops
Numero	1
PulseTime	24
ForceMax	65
D_0300	41
D_0200	50
D0000	68
D0200	49
D0300	39
D0600	20
D0900	12
D1200	7
D1500	5
D1800	4
D2100	3
TABLE	Drops
Numero	2
PulseTime	24
ForceMax	64
D_0300	39
D_0200	47
D0000	63
D0200	46
D0300	36
D0600	20
D0900	12
D1200	7
D1500	5
D1800	4
D2100	3
TABLE	Drops
Numero	3
PulseTime	25
ForceMax	64
D_0300	39
D_0200	47
D0000	63
D0200	46
D0300	36
D0600	20
D0900	12
D1200	7
D1500	5
D1800	4
D2100	3