module gitlab.com/innostream/dependencies/grule-rule-engine

go 1.21

require (
	github.com/antlr/antlr4/runtime/Go/antlr v1.4.10
	github.com/bmatcuk/doublestar v1.3.4
	github.com/google/uuid v1.3.0
	github.com/hyperjumptech/hyper-mux v1.1.0
	github.com/sirupsen/logrus v1.9.3
	github.com/stretchr/testify v1.8.4
	go.uber.org/zap v1.25.0
	gopkg.in/src-d/go-billy.v4 v4.3.2
	gopkg.in/src-d/go-git.v4 v4.13.1
)

require (
	github.com/NYTimes/gziphandler v1.1.1 // indirect
	github.com/davecgh/go-spew v1.1.1 // indirect
	github.com/emirpasic/gods v1.12.0 // indirect
	github.com/jbenet/go-context v0.0.0-20150711004518-d14ea06fba99 // indirect
	github.com/kevinburke/ssh_config v0.0.0-20190725054713-01f96b0aa0cd // indirect
	github.com/mitchellh/go-homedir v1.1.0 // indirect
	github.com/pmezard/go-difflib v1.0.0 // indirect
	github.com/rs/cors v1.8.0 // indirect
	github.com/sergi/go-diff v1.0.0 // indirect
	github.com/src-d/gcfg v1.4.0 // indirect
	github.com/xanzy/ssh-agent v0.2.1 // indirect
	go.uber.org/multierr v1.10.0 // indirect
	golang.org/x/crypto v0.1.0 // indirect
	golang.org/x/net v0.7.0 // indirect
	golang.org/x/sys v0.5.0 // indirect
	gopkg.in/warnings.v0 v0.1.2 // indirect
	gopkg.in/yaml.v3 v3.0.1 // indirect
)
