<svg width="25" height="24" viewBox="0 0 25 24" fill="none" xmlns="http://www.w3.org/2000/svg">
<g clip-path="url(#clip0_3613_157067)">
<g clip-path="url(#clip1_3613_157067)">
<path d="M6.37001 8.51C5.84001 8.51 5.40001 8.94 5.40001 9.48C5.40001 10.02 5.83001 10.45 6.37001 10.45C6.91001 10.45 7.34001 10.02 7.34001 9.48C7.34001 8.94 6.91001 8.51 6.37001 8.51Z" fill="#A94645"/>
<path d="M13.42 9.29C13.28 9.29 13.13 9.26 12.99 9.19C11.15 8.31 9.71001 8.64 9.03001 8.92C8.52001 9.13 7.93001 8.88 7.73001 8.36C7.52001 7.85 7.77001 7.27 8.28001 7.06C9.27001 6.66 11.31 6.17 13.85 7.38C14.35 7.62 14.56 8.21 14.32 8.71C14.15 9.07 13.79 9.28 13.42 9.28V9.29Z" fill="#A94645"/>
<path d="M23.19 8.9C23.41 8.5 23.5 8.05 23.46 7.61C23.38 6.84 22.88 6.18 22.09 5.78C22.06 5.76 22.02 5.75 21.99 5.74C20.88 5.33 19.77 5.7 19.17 6.7C18.71 7.47 18.8 8.43 19.32 9.22C19.26 9.24 19.2 9.26 19.14 9.29C18.18 6.01 14.71 3.72 10.46 3.72C9.49001 3.72 8.55001 3.85 7.64001 4.12C6.27001 3.16 4.70001 3 3.83001 3H3.72001C2.90001 3.02 2.42001 3.51 2.23001 3.96C2.04001 4.42 2.06001 5.12 2.66001 5.71C3.01001 6.05 3.27001 6.41 3.42001 6.74C3.13001 7.07 2.87001 7.41 2.64001 7.77L1.92001 7.89C0.88001 8.07 0.26001 8.8 0.26001 9.86V12.89C0.26001 13.95 0.88001 14.68 1.92001 14.86L2.32001 14.93C2.88001 16.08 3.62001 16.74 4.63001 17.28L4.33001 19.01C4.26001 19.4 4.37001 19.81 4.63001 20.11C4.89001 20.42 5.26001 20.59 5.67001 20.59H8.99001C9.74001 20.59 10.34 19.98 10.34 19.24V19.02H10.61V19.24C10.61 19.99 11.22 20.59 11.96 20.59H15.28C15.67 20.59 16.04 20.42 16.32 20.11C16.58 19.8 16.69 19.4 16.62 19.01L16.3 17.14C18.2 15.71 19.34 13.61 19.42 11.34C19.79 11.21 20.48 10.94 21.17 10.6C21.95 10.87 22.78 10.94 23.35 10.89C23.9 10.85 24.31 10.36 24.27 9.81C24.23 9.27 23.78 8.86 23.21 8.89L23.19 8.9ZM14.65 15.84C14.31 16.06 14.13 16.46 14.2 16.85L14.5 18.59H12.6V17.95C12.6 17.66 12.48 17.39 12.26 17.2C12.04 17.01 11.76 16.92 11.47 16.96C10.81 17.04 10.13 17.04 9.45001 16.96C9.16001 16.92 8.88001 17.01 8.67001 17.2C8.46001 17.39 8.33001 17.66 8.33001 17.95V18.59H6.43001L6.72001 16.88C6.80001 16.43 6.56001 15.99 6.15001 15.8C4.83001 15.19 4.36001 14.73 3.95001 13.66C3.82001 13.33 3.53001 13.09 3.18001 13.03L2.25001 12.87V9.85L3.42001 9.65C3.72001 9.6 3.99001 9.41 4.13001 9.14C4.40001 8.63 4.77001 8.15 5.22001 7.72C5.45001 7.49 5.56001 7.17 5.51001 6.85C5.40001 6.17 5.09001 5.56 4.72001 5.06C5.37001 5.17 6.13001 5.42 6.75001 5.97C7.02001 6.21 7.41001 6.29 7.75001 6.17C8.61001 5.87 9.51001 5.71 10.44 5.71C14.08 5.71 16.98 7.73 17.35 10.52L17.39 11.14C17.39 12.97 16.35 14.72 14.62 15.82L14.65 15.84ZM21.2 8.21C21.2 8.21 21.14 8.26 21.12 8.28C20.91 8.05 20.84 7.82 20.9 7.72C20.95 7.63 21 7.57 21.11 7.57C21.15 7.57 21.19 7.57 21.25 7.59C21.4 7.67 21.47 7.76 21.48 7.81C21.48 7.88 21.42 8.04 21.21 8.2L21.2 8.21Z" fill="#A94645"/>
</g>
</g>
<defs>
<clipPath id="clip0_3613_157067">
<rect width="24" height="24" fill="white" transform="translate(0.25)"/>
</clipPath>
<clipPath id="clip1_3613_157067">
<rect width="24" height="17.6" fill="white" transform="translate(0.25 3)"/>
</clipPath>
</defs>
</svg>
