<svg width="50" height="50" viewBox="0 0 80 80" xmlns="http://www.w3.org/2000/svg">
    <style>
        .fr-artwork-decorative {
        fill: #ECECFF;
        }
        .fr-artwork-minor {
        fill: #E1000F;
        }
        .fr-artwork-major {
        fill: #4550e5;
        }
    </style>
    <g class="fr-artwork-decorative" id="artwork-decorative">
       <path class="cls-3" d="M66,2c-.55,0-1-.45-1-1S65.45,0,66,0s1,.45,1,1-.45,1-1,1Z"/>
    <path class="cls-3" d="M5,5c-.55,0-1-.45-1-1s.45-1,1-1,1,.45,1,1-.45,1-1,1Z"/>
    <path class="cls-3" d="M1,67c-.55,0-1-.45-1-1s.45-1,1-1,1,.45,1,1-.45,1-1,1Z"/>

    </g>
    <g class="fr-artwork-minor" id="artwork-minor">
     <path class="cls-1" d="M25,50c0-.55.45-1,1-1h28c.55,0,1,.45,1,1v12c0,.55-.45,1-1,1h-28c-.55,0-1-.45-1-1v-12ZM27,51v10h26v-10h-26Z"/>
    <path class="cls-1" d="M38,54c0-.55.45-1,1-1h10c.55,0,1,.45,1,1s-.45,1-1,1h-10c-.55,0-1-.45-1-1Z"/>
    <path class="cls-1" d="M30,54c0-.55.45-1,1-1h2c.55,0,1,.45,1,1s-.45,1-1,1h-2c-.55,0-1-.45-1-1Z"/>
    <path class="cls-1" d="M30,58c0-.55.45-1,1-1h6c.55,0,1,.45,1,1s-.45,1-1,1h-6c-.55,0-1-.45-1-1Z"/>
    <path class="cls-1" d="M41,58c0-.55.45-1,1-1s1,.45,1,1-.45,1-1,1-1-.45-1-1Z"/>
    <path class="cls-1" d="M46,58c0-.55.45-1,1-1h2c.55,0,1,.45,1,1s-.45,1-1,1h-2c-.55,0-1-.45-1-1Z"/>
    </g>
    <g class="fr-artwork-major" id="artwork-major">
      <path class="cls-2" d="M12,23c0-.55.45-1,1-1h54c.55,0,1,.45,1,1v9c0,.55-.45,1-1,1H13c-.55,0-1-.45-1-1v-9ZM14,24v7h52v-7H14Z"/>
      <path class="cls-2" d="M17.61,16.31c.19-.2.45-.31.72-.31h43.34c.27,0,.54.11.72.31l5.33,5.6c.28.29.35.72.19,1.08-.16.37-.52.61-.92.61H13c-.4,0-.76-.24-.92-.61-.16-.37-.08-.79.19-1.08l5.33-5.6ZM18.76,18l-3.43,3.6h49.34l-3.43-3.6H18.76Z"/>
      <path class="cls-2" d="M15.2,31.99c0-.55.45-.99,1-.99h47.8c.27,0,.52.11.71.29.19.19.29.44.29.71l-.2,36c0,.55-.45.99-1,.99H16c-.27,0-.52-.11-.71-.29-.19-.19-.29-.44-.29-.71l.2-36ZM17.19,33l-.19,34h45.8l.19-34H17.19Z"/>
      <path class="cls-2" d="M30,38c0-.55.45-1,1-1h18c.55,0,1,.45,1,1v7c0,.55-.45,1-1,1h-18c-.55,0-1-.45-1-1v-7ZM32,39v5h16v-5h-16Z"/>
      <path class="cls-2" d="M21,13c0-.55.45-1,1-1h24c.55,0,1,.45,1,1s-.45,1-1,1h-24c-.55,0-1-.45-1-1Z"/>
      <path class="cls-2" d="M51,13c0-.55.45-1,1-1h5c.55,0,1,.45,1,1s-.45,1-1,1h-5c-.55,0-1-.45-1-1Z"/>
    </g>
</svg>
