module gitlab.com/ignitionrobotics/web/ign-go/v6

go 1.19

require (
	github.com/auth0/go-jwt-middleware v0.0.0-20200507191422-d30d7b9ece63
	github.com/aws/aws-sdk-go v1.31.8
	github.com/caarlos0/env/v6 v6.10.1
	github.com/codegangsta/negroni v1.0.0
	github.com/dgrijalva/jwt-go v3.2.0+incompatible
	github.com/fatih/structtag v1.2.0
	github.com/go-chi/chi/v5 v5.0.7
	github.com/go-chi/render v1.0.1
	github.com/go-sql-driver/mysql v1.5.0
	github.com/gorilla/mux v1.8.0
	github.com/grpc-ecosystem/go-grpc-middleware v1.3.0
	github.com/jinzhu/gorm v1.9.16
	github.com/jpillora/go-ogle-analytics v0.0.0-20161213085824-14b04e0594ef
	github.com/mssola/user_agent v0.5.3
	github.com/pkg/errors v0.9.1
	github.com/prometheus/client_golang v1.7.1
	github.com/rollbar/rollbar-go v1.2.0
	github.com/satori/go.uuid v1.2.0
	github.com/stretchr/testify v1.8.0
	github.com/urfave/negroni v1.0.0
	gitlab.com/ignitionrobotics/web/scheduler v0.5.0
	go.opentelemetry.io/contrib/instrumentation/google.golang.org/grpc/otelgrpc v0.32.0
	go.opentelemetry.io/contrib/instrumentation/net/http/otelhttp v0.36.1
	go.opentelemetry.io/contrib/propagators/jaeger v1.7.0
	go.opentelemetry.io/otel v1.10.0
	go.opentelemetry.io/otel/exporters/jaeger v1.7.0
	go.opentelemetry.io/otel/sdk v1.7.0
	go.opentelemetry.io/otel/trace v1.10.0
	golang.org/x/crypto v0.0.0-20200622213623-75b288015ac9
	google.golang.org/grpc v1.46.0
	google.golang.org/protobuf v1.28.0
	k8s.io/api v0.24.3
)

require (
	github.com/beorn7/perks v1.0.1 // indirect
	github.com/cespare/xxhash/v2 v2.1.1 // indirect
	github.com/davecgh/go-spew v1.1.1 // indirect
	github.com/felixge/httpsnoop v1.0.3 // indirect
	github.com/go-logr/logr v1.2.3 // indirect
	github.com/go-logr/stdr v1.2.2 // indirect
	github.com/gogo/protobuf v1.3.2 // indirect
	github.com/golang/protobuf v1.5.2 // indirect
	github.com/google/gofuzz v1.1.0 // indirect
	github.com/jinzhu/inflection v1.0.0 // indirect
	github.com/jmespath/go-jmespath v0.3.0 // indirect
	github.com/json-iterator/go v1.1.12 // indirect
	github.com/matttproud/golang_protobuf_extensions v1.0.1 // indirect
	github.com/modern-go/concurrent v0.0.0-20180306012644-bacd9c7ef1dd // indirect
	github.com/modern-go/reflect2 v1.0.2 // indirect
	github.com/opentracing/opentracing-go v1.1.0 // indirect
	github.com/pmezard/go-difflib v1.0.0 // indirect
	github.com/prometheus/client_model v0.2.0 // indirect
	github.com/prometheus/common v0.10.0 // indirect
	github.com/prometheus/procfs v0.1.3 // indirect
	github.com/stretchr/objx v0.4.0 // indirect
	go.opentelemetry.io/otel/metric v0.32.1 // indirect
	golang.org/x/net v0.0.0-20220127200216-cd36cc0744dd // indirect
	golang.org/x/sys v0.0.0-20220209214540-3681064d5158 // indirect
	golang.org/x/text v0.3.7 // indirect
	google.golang.org/genproto v0.0.0-20201019141844-1ed22bb0c154 // indirect
	gopkg.in/inf.v0 v0.9.1 // indirect
	gopkg.in/yaml.v2 v2.4.0 // indirect
	gopkg.in/yaml.v3 v3.0.1 // indirect
	k8s.io/apimachinery v0.24.3 // indirect
	k8s.io/klog/v2 v2.60.1 // indirect
	k8s.io/utils v0.0.0-20220210201930-3a6ce19ff2f9 // indirect
	sigs.k8s.io/json v0.0.0-20211208200746-9f7c6b3444d2 // indirect
	sigs.k8s.io/structured-merge-diff/v4 v4.2.1 // indirect
)
