{
  "meta": {
    "title": "test minimum DMP",
    "creationDate": null,
    "lastModifiedDate": null,
    "dmpLanguage": "fra",
    "dmpId": null,
    "contact": {
      "person": {
        "nameType": null,
        "lastName": "Lieby",
        "firstName": "Paulette",
        "mbox": "paulette.lieby@france-bioinformatique.fr"
      },
      "role": null
    },
    "license": {
    }
  },
  "project": {
    "title": "test minimum DMP",
    "description": null,
    "principalInvestigator": {
    }
  },
  "contributor": [
    {
      "nameType": "Personne",
      "lastName": "Lieby",
      "firstName": "Paulette",
      "mbox": "paulette.lieby@france-bioinformatique.fr",
      "role": [
        "Personne contact"
      ]
    }
  ],
  "researchOutput": [
    {
      "research_output_id": null,
      "researchOutputDescription": {
        "title": "Produit de recherche 1",
        "datasetId": null,
        "type": null,
        "containsPersonalData": "Non",
        "contact": {
        }
      },
      "reuse": null,
      "personalDataIssues": null,
      "legalIssues": null,
      "ethicalIssues": null,
      "dataCollection": {
        "facility": [],
        "methodReference": [],
        "contributor": [],
        "cost": []
      },
      "dataProcessing": {
        "description": null,
        "methodReference": [],
        "facility": [],
        "contributor": [],
        "cost": [],
        "mesoUCACalculRequest": []
      },
      "dataStorage": {
        "facility": [],
        "backupPolicy": [],
        "contributor": [],
        "cost": []
      },
      "documentationQuality": null,
      "qualityAssuranceMethod": null,
      "sharing": {
        "host": [],
        "distribution": [],
        "contributor": [],
        "cost": []
      },
      "preservationIssues": null
    }
  ]
}
