{
  "dmp": {
    "created": "2024-04-11T00:00:00",
    "description": null,
    "dmp_id": {
      "identifier": "identifiant",
      "type": "doi"
    },
    "language": "fra",
    "modified": "2024-04-11T00:00:00",
    "title": "paule's PGD structure développé par l'IFB",
    "contact": {
      "contact_id": {
        "identifier": "0000-0002-9289-9652",
        "type": "orcid"
      },
      "mbox": "paulette.lieby@france-bioinformatique.fr",
      "name": "Lieby "
    },
    "contributor": [
      {
        "name": "Lieby Paulette",
        "mbox": "paulette.lieby@france-bioinformatique.fr",
        "role": [
          "Coordinateur du projet",
          "Personne contact (PR 1, PR 3, PR 2, PR 6, PR 4, PR 5)"
        ],
        "contributor_id": {
          "identifier": null,
          "type": null
        }
      },
      {
        "name": "Lieby ",
        "mbox": "paulette.lieby@france-bioinformatique.fr",
        "role": [
          "Responsable du plan"
        ],
        "contributor_id": {
          "identifier": "0000-0002-9289-9652",
          "type": "orcid"
        }
      }
    ],
    "cost": [

    ],
    "project": [
      {
        "description": null,
        "title": "Plan de Paulette",
        "start": null,
        "end": null,
        "funding": [

        ]
      }
    ],
    "dataset": [
      {
        "dataset_id": {
          "identifier": "no identifier given",
          "type": "other"
        },
        "description": "un jeu de données A",
        "issued": null,
        "keyword": [
          [

          ]
        ],
        "language": null,
        "personal_data": "no",
        "preservation_statement": null,
        "title": "A-Image",
        "type": "Image",
        "sensitive_data": "no",
        "distribution": [
          {
            "access_url": "https://www.principale.com",
            "available_until": null,
            "byte_size": null,
            "data_access": "closed",
            "description": null,
            "download_url": null,
            "format": [
              "Format RAW"
            ],
            "title": "Y",
            "host": {
              "backup_frequency": "",
              "backup_type": "",
              "storage_type": "",
              "description": null,
              "availability": null,
              "certified_with": null,
              "geo_location": null,
              "pid_system": [

              ],
              "support_versioning": null,
              "title": null,
              "url": null
            },
            "license": [
              {
                "license_ref": null,
                "start_date": null
              }
            ]
          },
          {
            "access_url": "https://autre.machin.chose",
            "available_until": null,
            "byte_size": null,
            "data_access": "closed",
            "description": null,
            "download_url": null,
            "format": [
              "Format RAW"
            ],
            "title": "X",
            "host": {
              "backup_frequency": "",
              "backup_type": "",
              "storage_type": "",
              "description": null,
              "availability": null,
              "certified_with": null,
              "geo_location": null,
              "pid_system": [

              ],
              "support_versioning": null,
              "title": null,
              "url": null
            },
            "license": [
              {
                "license_ref": null,
                "start_date": null
              }
            ]
          },
          {
            "access_url": "https://truc.muche",
            "available_until": null,
            "byte_size": null,
            "data_access": "open",
            "description": null,
            "download_url": null,
            "format": [
              "Format RAW"
            ],
            "title": "Z",
            "host": {
              "backup_frequency": "",
              "backup_type": "",
              "storage_type": "",
              "description": null,
              "availability": null,
              "certified_with": null,
              "geo_location": null,
              "pid_system": [

              ],
              "support_versioning": null,
              "title": null,
              "url": null
            },
            "license": [
              {
                "license_ref": null,
                "start_date": null
              }
            ]
          }
        ],
        "data_quality_assurance": [

        ],
        "metadata": [

        ],
        "security_and_privacy": [
          {
            "description": null,
            "title": "Security measures"
          }
        ],
        "technical_resource": [

        ]
      },
      {
        "dataset_id": {
          "identifier": "no identifier given",
          "type": "other"
        },
        "description": "un jeu de données A",
        "issued": null,
        "keyword": [
          [

          ]
        ],
        "language": null,
        "personal_data": "no",
        "preservation_statement": null,
        "title": "A-Jeux_de_donnees_cytometrie",
        "type": "Jeux de données cytométrie",
        "sensitive_data": "no",
        "distribution": [
          {
            "access_url": "https://autre.machin.chose",
            "available_until": null,
            "byte_size": null,
            "data_access": "closed",
            "description": null,
            "download_url": null,
            "format": [
              "Spectral unmixed FCS files"
            ],
            "title": "X",
            "host": {
              "backup_frequency": "",
              "backup_type": "",
              "storage_type": "",
              "description": null,
              "availability": null,
              "certified_with": null,
              "geo_location": null,
              "pid_system": [

              ],
              "support_versioning": null,
              "title": null,
              "url": null
            },
            "license": [
              {
                "license_ref": null,
                "start_date": null
              }
            ]
          },
          {
            "access_url": "https://www.principale.com",
            "available_until": null,
            "byte_size": null,
            "data_access": "closed",
            "description": null,
            "download_url": null,
            "format": [
              "Spectral unmixed FCS files"
            ],
            "title": "Y",
            "host": {
              "backup_frequency": "",
              "backup_type": "",
              "storage_type": "",
              "description": null,
              "availability": null,
              "certified_with": null,
              "geo_location": null,
              "pid_system": [

              ],
              "support_versioning": null,
              "title": null,
              "url": null
            },
            "license": [
              {
                "license_ref": null,
                "start_date": null
              }
            ]
          },
          {
            "access_url": "https://truc.muche",
            "available_until": null,
            "byte_size": null,
            "data_access": "open",
            "description": null,
            "download_url": null,
            "format": [
              "Spectral unmixed FCS files"
            ],
            "title": "Z",
            "host": {
              "backup_frequency": "",
              "backup_type": "",
              "storage_type": "",
              "description": null,
              "availability": null,
              "certified_with": null,
              "geo_location": null,
              "pid_system": [

              ],
              "support_versioning": null,
              "title": null,
              "url": null
            },
            "license": [
              {
                "license_ref": null,
                "start_date": null
              }
            ]
          }
        ],
        "data_quality_assurance": [

        ],
        "metadata": [

        ],
        "security_and_privacy": [
          {
            "description": null,
            "title": "Security measures"
          }
        ],
        "technical_resource": [

        ]
      },
      {
        "dataset_id": {
          "identifier": "no identifier given",
          "type": "other"
        },
        "description": "un jeu de données B",
        "issued": null,
        "keyword": [
          [

          ]
        ],
        "language": null,
        "personal_data": "no",
        "preservation_statement": null,
        "title": "B-Image",
        "type": "Image",
        "sensitive_data": "no",
        "distribution": [
          {
            "access_url": "https://autre.machin.chose",
            "available_until": null,
            "byte_size": null,
            "data_access": "open",
            "description": null,
            "download_url": null,
            "format": [
              "OME-TIFF ou autre format standard supporté par Bio-Formats (DICOM par exemple), ou tout autre logiciel libre"
            ],
            "title": "X",
            "host": {
              "backup_frequency": "",
              "backup_type": "",
              "storage_type": "",
              "description": null,
              "availability": null,
              "certified_with": null,
              "geo_location": null,
              "pid_system": [

              ],
              "support_versioning": null,
              "title": null,
              "url": null
            },
            "license": [
              {
                "license_ref": null,
                "start_date": null
              }
            ]
          },
          {
            "access_url": "https://www.principale.com",
            "available_until": null,
            "byte_size": null,
            "data_access": "open",
            "description": null,
            "download_url": null,
            "format": [
              "OME-TIFF ou autre format standard supporté par Bio-Formats (DICOM par exemple), ou tout autre logiciel libre"
            ],
            "title": "Y",
            "host": {
              "backup_frequency": "",
              "backup_type": "",
              "storage_type": "",
              "description": null,
              "availability": null,
              "certified_with": null,
              "geo_location": null,
              "pid_system": [

              ],
              "support_versioning": null,
              "title": null,
              "url": null
            },
            "license": [
              {
                "license_ref": null,
                "start_date": null
              }
            ]
          },
          {
            "access_url": "https://truc.muche",
            "available_until": null,
            "byte_size": null,
            "data_access": "open",
            "description": null,
            "download_url": null,
            "format": [
              "OME-TIFF ou autre format standard supporté par Bio-Formats (DICOM par exemple), ou tout autre logiciel libre"
            ],
            "title": "Z",
            "host": {
              "backup_frequency": "",
              "backup_type": "",
              "storage_type": "",
              "description": null,
              "availability": null,
              "certified_with": null,
              "geo_location": null,
              "pid_system": [

              ],
              "support_versioning": null,
              "title": null,
              "url": null
            },
            "license": [
              {
                "license_ref": null,
                "start_date": null
              }
            ]
          }
        ],
        "data_quality_assurance": [

        ],
        "metadata": [

        ],
        "security_and_privacy": [
          {
            "description": null,
            "title": "Security measures"
          }
        ],
        "technical_resource": [

        ]
      },
      {
        "dataset_id": {
          "identifier": "no identifier given",
          "type": "other"
        },
        "description": "un jeu de données B",
        "issued": null,
        "keyword": [
          [

          ]
        ],
        "language": null,
        "personal_data": "no",
        "preservation_statement": null,
        "title": "B-Jeux_de_donnees_proteomiques",
        "type": "Jeux de données protéomiques",
        "sensitive_data": "no",
        "distribution": [
          {
            "access_url": "https://www.principale.com",
            "available_until": null,
            "byte_size": null,
            "data_access": "open",
            "description": null,
            "download_url": null,
            "format": [
              "Format standard (.mzml, .mztab, cf. PSI)"
            ],
            "title": "Y",
            "host": {
              "backup_frequency": "",
              "backup_type": "",
              "storage_type": "",
              "description": null,
              "availability": null,
              "certified_with": null,
              "geo_location": null,
              "pid_system": [

              ],
              "support_versioning": null,
              "title": null,
              "url": null
            },
            "license": [
              {
                "license_ref": null,
                "start_date": null
              }
            ]
          },
          {
            "access_url": "https://truc.muche",
            "available_until": null,
            "byte_size": null,
            "data_access": "open",
            "description": null,
            "download_url": null,
            "format": [
              "Format standard (.mzml, .mztab, cf. PSI)"
            ],
            "title": "Z",
            "host": {
              "backup_frequency": "",
              "backup_type": "",
              "storage_type": "",
              "description": null,
              "availability": null,
              "certified_with": null,
              "geo_location": null,
              "pid_system": [

              ],
              "support_versioning": null,
              "title": null,
              "url": null
            },
            "license": [
              {
                "license_ref": null,
                "start_date": null
              }
            ]
          },
          {
            "access_url": "https://autre.machin.chose",
            "available_until": null,
            "byte_size": null,
            "data_access": "open",
            "description": null,
            "download_url": null,
            "format": [
              "Format standard (.mzml, .mztab, cf. PSI)"
            ],
            "title": "X",
            "host": {
              "backup_frequency": "",
              "backup_type": "",
              "storage_type": "",
              "description": null,
              "availability": null,
              "certified_with": null,
              "geo_location": null,
              "pid_system": [

              ],
              "support_versioning": null,
              "title": null,
              "url": null
            },
            "license": [
              {
                "license_ref": null,
                "start_date": null
              }
            ]
          }
        ],
        "data_quality_assurance": [

        ],
        "metadata": [

        ],
        "security_and_privacy": [
          {
            "description": null,
            "title": "Security measures"
          }
        ],
        "technical_resource": [

        ]
      },
      {
        "dataset_id": {
          "identifier": "no identifier given",
          "type": "other"
        },
        "description": "un jeu de données C",
        "issued": null,
        "keyword": [
          [

          ]
        ],
        "language": null,
        "personal_data": "no",
        "preservation_statement": null,
        "title": "C",
        "type": null,
        "sensitive_data": null,
        "distribution": [
          {
            "access_url": "https://truc.muche",
            "available_until": null,
            "byte_size": null,
            "data_access": "open",
            "description": null,
            "download_url": null,
            "format": [

            ],
            "title": "Z",
            "host": {
              "backup_frequency": "",
              "backup_type": "",
              "storage_type": "",
              "description": null,
              "availability": null,
              "certified_with": null,
              "geo_location": null,
              "pid_system": [

              ],
              "support_versioning": null,
              "title": null,
              "url": null
            },
            "license": [
              {
                "license_ref": null,
                "start_date": null
              }
            ]
          },
          {
            "access_url": "https://autre.machin.chose",
            "available_until": null,
            "byte_size": null,
            "data_access": "open",
            "description": null,
            "download_url": null,
            "format": [

            ],
            "title": "X",
            "host": {
              "backup_frequency": "",
              "backup_type": "",
              "storage_type": "",
              "description": null,
              "availability": null,
              "certified_with": null,
              "geo_location": null,
              "pid_system": [

              ],
              "support_versioning": null,
              "title": null,
              "url": null
            },
            "license": [
              {
                "license_ref": null,
                "start_date": null
              }
            ]
          },
          {
            "access_url": "https://www.principale.com",
            "available_until": null,
            "byte_size": null,
            "data_access": "open",
            "description": null,
            "download_url": null,
            "format": [

            ],
            "title": "Y",
            "host": {
              "backup_frequency": "",
              "backup_type": "",
              "storage_type": "",
              "description": null,
              "availability": null,
              "certified_with": null,
              "geo_location": null,
              "pid_system": [

              ],
              "support_versioning": null,
              "title": null,
              "url": null
            },
            "license": [
              {
                "license_ref": null,
                "start_date": null
              }
            ]
          }
        ],
        "data_quality_assurance": [

        ],
        "metadata": [

        ],
        "security_and_privacy": [
          {
            "description": null,
            "title": "Security measures"
          }
        ],
        "technical_resource": [

        ]
      },
      {
        "dataset_id": {
          "identifier": "no identifier given",
          "type": "other"
        },
        "description": null,
        "issued": null,
        "keyword": [
          [

          ]
        ],
        "language": null,
        "personal_data": "no",
        "preservation_statement": null,
        "title": "D",
        "type": null,
        "sensitive_data": null,
        "distribution": [
          {
            "access_url": "https://truc.muche",
            "available_until": null,
            "byte_size": null,
            "data_access": "closed",
            "description": null,
            "download_url": null,
            "format": [

            ],
            "title": "Z",
            "host": {
              "backup_frequency": "",
              "backup_type": "",
              "storage_type": "",
              "description": null,
              "availability": null,
              "certified_with": null,
              "geo_location": null,
              "pid_system": [

              ],
              "support_versioning": null,
              "title": null,
              "url": null
            },
            "license": [
              {
                "license_ref": null,
                "start_date": null
              }
            ]
          },
          {
            "access_url": "https://autre.machin.chose",
            "available_until": null,
            "byte_size": null,
            "data_access": "closed",
            "description": null,
            "download_url": null,
            "format": [

            ],
            "title": "X",
            "host": {
              "backup_frequency": "",
              "backup_type": "",
              "storage_type": "",
              "description": null,
              "availability": null,
              "certified_with": null,
              "geo_location": null,
              "pid_system": [

              ],
              "support_versioning": null,
              "title": null,
              "url": null
            },
            "license": [
              {
                "license_ref": null,
                "start_date": null
              }
            ]
          },
          {
            "access_url": "https://www.principale.com",
            "available_until": null,
            "byte_size": null,
            "data_access": "closed",
            "description": null,
            "download_url": null,
            "format": [

            ],
            "title": "Y",
            "host": {
              "backup_frequency": "",
              "backup_type": "",
              "storage_type": "",
              "description": null,
              "availability": null,
              "certified_with": null,
              "geo_location": null,
              "pid_system": [

              ],
              "support_versioning": null,
              "title": null,
              "url": null
            },
            "license": [
              {
                "license_ref": null,
                "start_date": null
              }
            ]
          }
        ],
        "data_quality_assurance": [

        ],
        "metadata": [

        ],
        "security_and_privacy": [
          {
            "description": null,
            "title": "Security measures"
          }
        ],
        "technical_resource": [

        ]
      }
    ],
    "ethical_issues_exist": "no",
    "ethical_issues_description": "A-Image :  / A-Jeux_de_donnees_cytometrie :  / B-Image :  / B-Jeux_de_donnees_proteomiques :  / C :  / D : ",
    "ethical_issues_report": "A-Image :  / A-Jeux_de_donnees_cytometrie :  / B-Image :  / B-Jeux_de_donnees_proteomiques :  / C :  / D : "
  }
}