{
    "version": 6,
    "cmakeMinimumRequired": {
        "major": 3,
        "minor": 21,
        "patch": 0
    },
    "configurePresets": [
        {
            "name": "common",
            "hidden": true,
            "generator": "Ninja",
            "cacheVariables": {
                "CMAKE_EXPORT_COMPILE_COMMANDS": "ON"
            }
        },
        {
            "name": "debug",
            "hidden": true,
            "inherits": "common",
            "binaryDir": "${sourceDir}/build/debug",
            "cacheVariables": {
                "CMAKE_BUILD_TYPE": "Debug"
            }
        },
        {
            "name": "release",
            "hidden": true,
            "inherits": "common",
            "binaryDir": "${sourceDir}/build/release",
            "cacheVariables": {
                "CMAKE_BUILD_TYPE": "release"
            }
        },
        {
            "name": "compiler-clang",
            "hidden": true,
            "cacheVariables": {
                "CMAKE_C_COMPILER": "clang",
                "CMAKE_CXX_COMPILER": "clang++"
            }
        },
        {
            "name": "compiler-gcc",
            "hidden": true,
            "cacheVariables": {
                "CMAKE_C_COMPILER": "gcc",
                "CMAKE_CXX_COMPILER": "g++"
            }
        },
        {
            "name": "compiler-msvc",
            "hidden": true,
            "cacheVariables": {
                "CMAKE_C_COMPILER": "cl",
                "CMAKE_CXX_COMPILER": "cl"
            }
        },
        {
            "name": "debug-clang",
            "inherits": [
                "debug",
                "compiler-clang"
            ]
        },
        {
            "name": "release-clang",
            "inherits": [
                "release",
                "compiler-clang"
            ]
        },
        {
            "name": "debug-gcc",
            "inherits": [
                "debug",
                "compiler-gcc"
            ]
        },
        {
            "name": "release-gcc",
            "inherits": [
                "release",
                "compiler-gcc"
            ]
        },
        {
            "name": "debug-msvc",
            "inherits": [
                "debug",
                "compiler-msvc"
            ]
        },
        {
            "name": "release-msvc",
            "inherits": [
                "release",
                "compiler-msvc"
            ]
        }
    ],
    "buildPresets": [
        {
            "name": "debug-clang",
            "configurePreset": "debug-clang"
        },
        {
            "name": "release-clang",
            "configurePreset": "release-clang"
        },
        {
            "name": "debug-gcc",
            "configurePreset": "debug-gcc"
        },
        {
            "name": "release-gcc",
            "configurePreset": "release-gcc"
        },
        {
            "name": "debug-msvc",
            "configurePreset": "debug-msvc"
        },
        {
            "name": "release-msvc",
            "configurePreset": "release-msvc"
        }
    ],
    "packagePresets": [
        {
            "name": "release-linux",
            "configurePreset": "release-gcc",
            "generators": [
                "DEB",
                "ZIP"
            ]
        },
        {
            "name": "release-windows",
            "displayName": "Windows Packages",
            "configurePreset": "release-msvc",
            "generators": [
                "ZIP"
            ]
        }
    ],
    "workflowPresets": [
        {
            "name": "release-linux",
            "steps": [
                {
                    "type": "configure",
                    "name": "release-gcc"
                },
                {
                    "type": "build",
                    "name": "release-gcc"
                },
                {
                    "type": "package",
                    "name": "release-linux"
                }
            ]
        },
        {
            "name": "release-windows",
            "steps": [
                {
                    "type": "configure",
                    "name": "release-msvc"
                },
                {
                    "type": "build",
                    "name": "release-msvc"
                },
                {
                    "type": "package",
                    "name": "release-windows"
                }
            ]
        }
    ]
}