{
  "zenodoId": 4687795,
  "doi": "10.5281/zenodo.4687795",
  "name": "ghs_built_1990_100_share",
  "profile": "raster-data-resource",
  "datapackage_version": "1.0",
  "version": "0.17.0",
  "created": "2019-07-17 04:31:57",
  "title": "Estimated share of gross floor area per construction period in 2012 ",
  "description": "The map shows the estimated share of gross floor area per construction period in  [m2/m2] unit",
  "keywords": [
    "EU28",
    "EUROPE",
    "heated density map",
    "raster"
  ],
  "licenses": [
    {
      "id": "CC-BY-4.0",
      "title": "Creative Commons Attribution 4.0 International",
      "url": "https://creativecommons.org/licenses/by/4.0/legalcode"
    }
  ],
  "sources": [
    {
      "path": "",
      "name": ""
    }
  ],
  "contributors": [
    {
      "organization": "e-think / tu wien",
      "role": "author",
      "email": "mueller@e-think.ac.at",
      "title": "Andreas Mueller"
    }
  ],
  "id": "3cee7aae-b138-383c-aace-b1e851041478",
  "resources": [
    {
      "name": "GHS_BUILT_1990_100_share",
      "title": "Estimated share of gross floor area per construction period in 2012 ",
      "path": "data/GHS_BUILT_1990_100_share.tif",
      "unit": "m2/m2",
      "description": "The map shows the estimated share of gross floor area per construction period in  [m2/m2] unit",
      "temporal": {
        "start": "2012-01-01 00:00:00",
        "end": "2012-12-31 24:00:00"
      },
      "format": "tif",
      "bytes": "11495",
      "raster": {
        "epsg": "3035",
        "num_of_bands": 1,
        "extent": {
          "minx": 1547000.0,
          "miny": 941000.0,
          "maxx": 6527000.0,
          "maxy": 5308000.0
        },
        "resolution": {
          "yRes": -100.0,
          "xRes": 100.0
        },
        "dimension": {
          "rows": 43670,
          "columns": 49800
        },
        "origin": [
          1547000.0,
          5308000.0
        ],
        "transformation": {
          "operator": "*",
          "value": 1.0
        },
        "nodata": 0.0,
        "band1": {
          "statistics": {
            "max": 0.992339015007019,
            "mean": 0.27788049886836774,
            "Stdev": 0.33557185905427156,
            "min": 2.9553143576777074e-06
          }
        }
      }
    }
  ]
}