
REGISTER
--------
2019-04-01 Z 
            a                                             -1.20              -1.20 $
            e                                              1.00               1.00 €
------------------------------------------------------------------------------------
2019-04-02 Z 
            a                                           -120.00            -120.00 USD
            e                                            100.00             100.00 EUR
--------------------------------------------------------------------------------------
