[gd_scene load_steps=2 format=2]

[ext_resource path="res://Assets/GUI/Escape Menu/ExitGame_Pressed.png" type="Texture" id=1]

[node name="Btn_Keluar" type="TextureButton"]
margin_right = 122.0
margin_bottom = 34.0
rect_scale = Vector2( 0.5, 0.5 )
texture_pressed = ExtResource( 1 )
__meta__ = {
"_edit_use_anchors_": false
}
