[gd_scene load_steps=2 format=2]

[ext_resource path="res://Scene/GUI/Camera2D.gd" type="Script" id=1]

[node name="Camera2D" type="Camera2D"]
current = true
smoothing_enabled = true
script = ExtResource( 1 )

[node name="Tween" type="Tween" parent="."]
