[gd_scene load_steps=5 format=2]

[ext_resource path="res://Assets/Tilesets/Serene_Village_v1.5/Serene_Village_16x16.png" type="Texture" id=1]
[ext_resource path="res://Scene/Misc/Blockade.gd" type="Script" id=2]

[sub_resource type="RectangleShape2D" id=1]

[sub_resource type="RectangleShape2D" id=2]
extents = Vector2( 12.818, 12.3541 )

[node name="Blockade" type="Sprite"]
texture = ExtResource( 1 )
region_enabled = true
region_rect = Rect2( 189.079, 20, 20.9214, 20 )
script = ExtResource( 2 )

[node name="StaticBody2D" type="StaticBody2D" parent="."]

[node name="CollisionShape2D" type="CollisionShape2D" parent="StaticBody2D"]
shape = SubResource( 1 )

[node name="Area2D" type="Area2D" parent="."]
collision_layer = 2
collision_mask = 2147483650

[node name="CollisionShape2D" type="CollisionShape2D" parent="Area2D"]
shape = SubResource( 2 )
[connection signal="area_entered" from="Area2D" to="." method="_on_Area2D_area_entered"]
[connection signal="area_exited" from="Area2D" to="." method="_on_Area2D_area_exited"]
