[gd_scene load_steps=7 format=2]

[ext_resource path="res://Assets/Characters/Pedagang/Pedagang.png" type="Texture" id=1]
[ext_resource path="res://Scene/NPC/InteractableArea.tscn" type="PackedScene" id=2]
[ext_resource path="res://Scene/NPC/NPC.gd" type="Script" id=3]
[ext_resource path="res://Scene/GUI/Emote Bubble/Emote Bubble.tscn" type="PackedScene" id=4]

[sub_resource type="RectangleShape2D" id=1]
extents = Vector2( 6.61709, 9.65919 )

[sub_resource type="Animation" id=2]
resource_name = "Idle"
length = 0.8
loop = true
tracks/0/type = "value"
tracks/0/path = NodePath(".:frame")
tracks/0/interp = 1
tracks/0/loop_wrap = true
tracks/0/imported = false
tracks/0/enabled = true
tracks/0/keys = {
"times": PoolRealArray( 0, 0.1, 0.2, 0.3, 0.4, 0.5, 0.6, 0.7 ),
"transitions": PoolRealArray( 1, 1, 1, 1, 1, 1, 1, 1 ),
"update": 1,
"values": [ 0, 1, 2, 3, 4, 5, 6, 7 ]
}

[node name="Pedagang" type="Sprite"]
pause_mode = 2
texture = ExtResource( 1 )
hframes = 8
frame = 7
script = ExtResource( 3 )
npc_name = "Pedagang"

[node name="StaticBody2D" type="StaticBody2D" parent="."]
position = Vector2( 0, -7.081 )

[node name="CollisionShape2D" type="CollisionShape2D" parent="StaticBody2D"]
position = Vector2( -0.432949, 13.0811 )
shape = SubResource( 1 )

[node name="AnimationPlayer" type="AnimationPlayer" parent="."]
autoplay = "Idle"
anims/Idle = SubResource( 2 )

[node name="InteractableArea" parent="." instance=ExtResource( 2 )]
visible = false
position = Vector2( 0, 7.568 )
scale = Vector2( 0.7, 0.7 )

[node name="Emote Bubble" parent="." instance=ExtResource( 4 )]
position = Vector2( -7.77982, -11.0628 )
scale = Vector2( 0.75, 0.75 )
[connection signal="area_entered" from="InteractableArea" to="." method="_on_InteractableArea_area_entered"]
[connection signal="area_exited" from="InteractableArea" to="." method="_on_InteractableArea_area_exited"]
