{
    "inputs_header": "#### Entrées\n\nLa fonction a les entrées suivantes :\n\n",
    "reports_header": "#### Rapports\n\nLa fonction génère les rapports suivants :\n\n",
    "functions_navigation_template": "\n\n{n} fonctions sont proposées par ce plugin. Vous pouvez cliquer sur les icônes suivantes pour accéder à la fonction qui vous intéresse ou simplement faire défiler vers le bas.\n\n{nav}\n\n",
    "hook_config_template": "## Configuration\n\nDes [hooks](https://opentestfactory.org/guides/hooks.html) peuvent être définis pour les fonctions fournies. Cela peut être fait dans les définitions de workflow ou au niveau de l'orchestrateur afin qu'ils s'appliquent à tous vos workflows.\n\nLa configuration au niveau de l'orchestrateur s'effectue en définissant la variable d'environnement\n`{NAME}_PROVIDER_HOOKS`.\n\nVeuillez vous référer à \"[Hooks for plugin providers](https://opentestfactory.org/plugins/configuring-a-provider-plugin.html)\" pour plus d'informations.\n\n",
    "required": "obligatoire",
    "optional": "facultatif",
    "## Functions": "## Fonctions"
}