{
  "$schema": "https://docs.renovatebot.com/renovate-schema.json",
  "extends": [
    "local>HenixDevelopment/forge-squash/renovate-runner//presets/default",
    "local>HenixDevelopment/forge-squash/renovate-runner//presets/automergePatch"
  ]
}
