{
	"info": {
		"_postman_id": "cd273979-8d32-43c2-8774-dc194bd9640a",
		"name": "Terminology65 - with apikey",
		"schema": "https://schema.getpostman.com/json/collection/v2.1.0/collection.json"
	},
	"item": [
		{
			"name": "Ayurveda",
			"item": [
				{
					"name": "Search - Ayurveda विकार(sa) - स्थौल्यम्",
					"request": {
						"method": "GET",
						"header": [
							{
								"key": "apikey",
								"type": "text",
								"value": "{{apikey}}"
							}
						],
						"url": {
							"raw": "{{serverUrl}}/api/search/search?term=स्थौल्यम्&state=active&semantictag=विकार&acceptability=synonyms&returnlimit=50&fullconcept=false&refsetid=997321000189101",
							"host": [
								"{{serverUrl}}"
							],
							"path": [
								"api",
								"search",
								"search"
							],
							"query": [
								{
									"key": "term",
									"value": "स्थौल्यम्",
									"description": "Term/text or Concept ID to be searched. Example- fever, 22298006 "
								},
								{
									"key": "state",
									"value": "active",
									"description": "State of a component. Possible values - active, inactive, both. "
								},
								{
									"key": "semantictag",
									"value": "विकार",
									"description": "The Semantic Tag in which SNOMED CT term/text or concept id will be searched. "
								},
								{
									"key": "acceptability",
									"value": "synonyms",
									"description": "Possible values - preferred, preferredexcludingfsn, synonyms, acceptable, all."
								},
								{
									"key": "returnlimit",
									"value": "50",
									"description": "Maximum number of matching terms to be fetched."
								},
								{
									"key": "fullconcept",
									"value": "false"
								},
								{
									"key": "refsetid",
									"value": "997321000189101"
								}
							]
						}
					},
					"response": []
				},
				{
					"name": "Search - Ayurveda finding - yello",
					"request": {
						"method": "GET",
						"header": [
							{
								"key": "apikey",
								"value": "{{apikey}}",
								"type": "text"
							}
						],
						"url": {
							"raw": "{{serverUrl}}/api/search/search?term=yello&state=active&semantictag=finding&acceptability=synonyms&returnlimit=50&fullconcept=false&refsetid=997321000189101",
							"host": [
								"{{serverUrl}}"
							],
							"path": [
								"api",
								"search",
								"search"
							],
							"query": [
								{
									"key": "term",
									"value": "yello",
									"description": "Term/text or Concept ID to be searched. Example- fever, 22298006 "
								},
								{
									"key": "state",
									"value": "active",
									"description": "State of a component. Possible values - active, inactive, both. "
								},
								{
									"key": "semantictag",
									"value": "finding",
									"description": "The Semantic Tag in which SNOMED CT term/text or concept id will be searched. "
								},
								{
									"key": "acceptability",
									"value": "synonyms",
									"description": "Possible values - preferred, preferredexcludingfsn, synonyms, acceptable, all."
								},
								{
									"key": "returnlimit",
									"value": "50",
									"description": "Maximum number of matching terms to be fetched."
								},
								{
									"key": "fullconcept",
									"value": "false"
								},
								{
									"key": "refsetid",
									"value": "997321000189101"
								}
							]
						}
					},
					"response": []
				},
				{
					"name": "Search - Ayurveda disorder - infer",
					"request": {
						"method": "GET",
						"header": [
							{
								"key": "apikey",
								"value": "{{apikey}}",
								"type": "text"
							}
						],
						"url": {
							"raw": "{{serverUrl}}/api/search/search?term=infer&state=active&semantictag=disorder&acceptability=synonyms&returnlimit=50&fullconcept=false&refsetid=997321000189101",
							"host": [
								"{{serverUrl}}"
							],
							"path": [
								"api",
								"search",
								"search"
							],
							"query": [
								{
									"key": "term",
									"value": "infer",
									"description": "Term/text or Concept ID to be searched. Example- fever, 22298006 "
								},
								{
									"key": "state",
									"value": "active",
									"description": "State of a component. Possible values - active, inactive, both. "
								},
								{
									"key": "semantictag",
									"value": "disorder",
									"description": "The Semantic Tag in which SNOMED CT term/text or concept id will be searched. "
								},
								{
									"key": "acceptability",
									"value": "synonyms",
									"description": "Possible values - preferred, preferredexcludingfsn, synonyms, acceptable, all."
								},
								{
									"key": "returnlimit",
									"value": "50",
									"description": "Maximum number of matching terms to be fetched."
								},
								{
									"key": "fullconcept",
									"value": "false"
								},
								{
									"key": "refsetid",
									"value": "997321000189101"
								}
							]
						}
					},
					"response": []
				},
				{
					"name": "Search - Ayurveda लिङ्ग(sa) - पुरीष",
					"request": {
						"method": "GET",
						"header": [
							{
								"key": "apikey",
								"value": "{{apikey}}",
								"type": "text"
							}
						],
						"url": {
							"raw": "{{serverUrl}}/api/search/search?term=पुरीष&state=active&semantictag=लिङ्ग&acceptability=synonyms&returnlimit=50&fullconcept=false&refsetid=997321000189101",
							"host": [
								"{{serverUrl}}"
							],
							"path": [
								"api",
								"search",
								"search"
							],
							"query": [
								{
									"key": "term",
									"value": "पुरीष",
									"description": "Term/text or Concept ID to be searched. Example- fever, 22298006 "
								},
								{
									"key": "state",
									"value": "active",
									"description": "State of a component. Possible values - active, inactive, both. "
								},
								{
									"key": "semantictag",
									"value": "लिङ्ग",
									"description": "The Semantic Tag in which SNOMED CT term/text or concept id will be searched. "
								},
								{
									"key": "acceptability",
									"value": "synonyms",
									"description": "Possible values - preferred, preferredexcludingfsn, synonyms, acceptable, all."
								},
								{
									"key": "returnlimit",
									"value": "50",
									"description": "Maximum number of matching terms to be fetched."
								},
								{
									"key": "fullconcept",
									"value": "false"
								},
								{
									"key": "refsetid",
									"value": "997321000189101"
								}
							]
						}
					},
					"response": []
				},
				{
					"name": "Search - Ayurveda शारीर(sa) - बस्ति",
					"request": {
						"method": "GET",
						"header": [
							{
								"key": "apikey",
								"value": "{{apikey}}",
								"type": "text"
							}
						],
						"url": {
							"raw": "{{serverUrl}}/api/search/search?term= बस्ति&state=active&semantictag=शारीर&acceptability=synonyms&returnlimit=50&fullconcept=false&refsetid=997321000189101",
							"host": [
								"{{serverUrl}}"
							],
							"path": [
								"api",
								"search",
								"search"
							],
							"query": [
								{
									"key": "term",
									"value": " बस्ति",
									"description": "Term/text or Concept ID to be searched. Example- fever, 22298006 "
								},
								{
									"key": "state",
									"value": "active",
									"description": "State of a component. Possible values - active, inactive, both. "
								},
								{
									"key": "semantictag",
									"value": "शारीर",
									"description": "The Semantic Tag in which SNOMED CT term/text or concept id will be searched. "
								},
								{
									"key": "acceptability",
									"value": "synonyms",
									"description": "Possible values - preferred, preferredexcludingfsn, synonyms, acceptable, all."
								},
								{
									"key": "returnlimit",
									"value": "50",
									"description": "Maximum number of matching terms to be fetched."
								},
								{
									"key": "fullconcept",
									"value": "false"
								},
								{
									"key": "refsetid",
									"value": "997321000189101"
								}
							]
						}
					},
					"response": []
				}
			],
			"protocolProfileBehavior": {}
		},
		{
			"name": "Unani",
			"item": [
				{
					"name": "Search - Unani finding - yello",
					"request": {
						"method": "GET",
						"header": [
							{
								"key": "apikey",
								"value": "{{apikey}}",
								"type": "text"
							}
						],
						"url": {
							"raw": "{{serverUrl}}/api/search/search?term=yello&state=active&semantictag=finding&acceptability=synonyms&returnlimit=50&fullconcept=false&refsetid=997341000189105",
							"host": [
								"{{serverUrl}}"
							],
							"path": [
								"api",
								"search",
								"search"
							],
							"query": [
								{
									"key": "term",
									"value": "yello",
									"description": "Term/text or Concept ID to be searched. Example- fever, 22298006 "
								},
								{
									"key": "state",
									"value": "active",
									"description": "State of a component. Possible values - active, inactive, both. "
								},
								{
									"key": "semantictag",
									"value": "finding",
									"description": "The Semantic Tag in which SNOMED CT term/text or concept id will be searched. "
								},
								{
									"key": "acceptability",
									"value": "synonyms",
									"description": "Possible values - preferred, preferredexcludingfsn, synonyms, acceptable, all."
								},
								{
									"key": "returnlimit",
									"value": "50",
									"description": "Maximum number of matching terms to be fetched."
								},
								{
									"key": "fullconcept",
									"value": "false"
								},
								{
									"key": "refsetid",
									"value": "997341000189105"
								}
							]
						}
					},
					"response": []
				},
				{
					"name": "Search - Unani உடற்கூறு(ta) - பதினோ",
					"request": {
						"method": "GET",
						"header": [
							{
								"key": "apikey",
								"type": "text",
								"value": "{{apikey}}"
							}
						],
						"url": {
							"raw": "{{serverUrl}}/api/search/search?term=பதினோ&state=active&semantictag=உடற்கூறு&acceptability=synonyms&returnlimit=50&fullconcept=false&refsetid=997341000189105",
							"host": [
								"{{serverUrl}}"
							],
							"path": [
								"api",
								"search",
								"search"
							],
							"query": [
								{
									"key": "term",
									"value": "பதினோ",
									"description": "Term/text or Concept ID to be searched. Example- fever, 22298006 "
								},
								{
									"key": "state",
									"value": "active",
									"description": "State of a component. Possible values - active, inactive, both. "
								},
								{
									"key": "semantictag",
									"value": "உடற்கூறு",
									"description": "The Semantic Tag in which SNOMED CT term/text or concept id will be searched. "
								},
								{
									"key": "acceptability",
									"value": "synonyms",
									"description": "Possible values - preferred, preferredexcludingfsn, synonyms, acceptable, all."
								},
								{
									"key": "returnlimit",
									"value": "50",
									"description": "Maximum number of matching terms to be fetched."
								},
								{
									"key": "fullconcept",
									"value": "false"
								},
								{
									"key": "refsetid",
									"value": "997341000189105"
								}
							]
						}
					},
					"response": []
				},
				{
					"name": "Search - Unani جسمانی ساخت(ur) -  زائدہ ابریہ",
					"request": {
						"method": "GET",
						"header": [
							{
								"key": "apikey",
								"type": "text",
								"value": "{{apikey}}"
							}
						],
						"url": {
							"raw": "{{serverUrl}}/api/search/search?term= زائدہ ابریہ&state=active&semantictag=جسمانی ساخت&acceptability=synonyms&returnlimit=50&fullconcept=false&refsetid=997341000189105",
							"host": [
								"{{serverUrl}}"
							],
							"path": [
								"api",
								"search",
								"search"
							],
							"query": [
								{
									"key": "term",
									"value": " زائدہ ابریہ",
									"description": "Term/text or Concept ID to be searched. Example- fever, 22298006 "
								},
								{
									"key": "state",
									"value": "active",
									"description": "State of a component. Possible values - active, inactive, both. "
								},
								{
									"key": "semantictag",
									"value": "جسمانی ساخت",
									"description": "The Semantic Tag in which SNOMED CT term/text or concept id will be searched. "
								},
								{
									"key": "acceptability",
									"value": "synonyms",
									"description": "Possible values - preferred, preferredexcludingfsn, synonyms, acceptable, all."
								},
								{
									"key": "returnlimit",
									"value": "50",
									"description": "Maximum number of matching terms to be fetched."
								},
								{
									"key": "fullconcept",
									"value": "false"
								},
								{
									"key": "refsetid",
									"value": "997341000189105"
								}
							]
						}
					},
					"response": []
				},
				{
					"name": "Search - Unani body structure - neck",
					"request": {
						"method": "GET",
						"header": [
							{
								"key": "apikey",
								"value": "{{apikey}}",
								"type": "text"
							}
						],
						"url": {
							"raw": "{{serverUrl}}/api/search/search?term=neck&state=active&semantictag=body structure&acceptability=synonyms&returnlimit=50&fullconcept=false&refsetid=997341000189105",
							"host": [
								"{{serverUrl}}"
							],
							"path": [
								"api",
								"search",
								"search"
							],
							"query": [
								{
									"key": "term",
									"value": "neck",
									"description": "Term/text or Concept ID to be searched. Example- fever, 22298006 "
								},
								{
									"key": "state",
									"value": "active",
									"description": "State of a component. Possible values - active, inactive, both. "
								},
								{
									"key": "semantictag",
									"value": "body structure",
									"description": "The Semantic Tag in which SNOMED CT term/text or concept id will be searched. "
								},
								{
									"key": "acceptability",
									"value": "synonyms",
									"description": "Possible values - preferred, preferredexcludingfsn, synonyms, acceptable, all."
								},
								{
									"key": "returnlimit",
									"value": "50",
									"description": "Maximum number of matching terms to be fetched."
								},
								{
									"key": "fullconcept",
									"value": "false"
								},
								{
									"key": "refsetid",
									"value": "997341000189105"
								}
							]
						}
					},
					"response": []
				}
			],
			"protocolProfileBehavior": {}
		},
		{
			"name": "Siddha",
			"item": [
				{
					"name": "Search - Siddha finding - yello",
					"request": {
						"method": "GET",
						"header": [
							{
								"key": "apikey",
								"value": "{{apikey}}",
								"type": "text"
							}
						],
						"url": {
							"raw": "{{serverUrl}}/api/search/search?term=yello&state=active&semantictag=finding&acceptability=synonyms&returnlimit=50&fullconcept=false&refsetid=997331000189104",
							"host": [
								"{{serverUrl}}"
							],
							"path": [
								"api",
								"search",
								"search"
							],
							"query": [
								{
									"key": "term",
									"value": "yello",
									"description": "Term/text or Concept ID to be searched. Example- fever, 22298006 "
								},
								{
									"key": "state",
									"value": "active",
									"description": "State of a component. Possible values - active, inactive, both. "
								},
								{
									"key": "semantictag",
									"value": "finding",
									"description": "The Semantic Tag in which SNOMED CT term/text or concept id will be searched. "
								},
								{
									"key": "acceptability",
									"value": "synonyms",
									"description": "Possible values - preferred, preferredexcludingfsn, synonyms, acceptable, all."
								},
								{
									"key": "returnlimit",
									"value": "50",
									"description": "Maximum number of matching terms to be fetched."
								},
								{
									"key": "fullconcept",
									"value": "false"
								},
								{
									"key": "refsetid",
									"value": "997331000189104"
								}
							]
						}
					},
					"response": []
				}
			],
			"protocolProfileBehavior": {}
		},
		{
			"name": "Explore - Alldescendents",
			"request": {
				"method": "GET",
				"header": [
					{
						"key": "apikey",
						"value": "{{apikey}}",
						"type": "text"
					}
				],
				"url": {
					"raw": "{{serverUrl}}/api/explore/alldescendants?id=297968009",
					"host": [
						"{{serverUrl}}"
					],
					"path": [
						"api",
						"explore",
						"alldescendants"
					],
					"query": [
						{
							"key": "id",
							"value": "297968009",
							"description": "SNOMED CT Concept Identifier. Example- 22298006"
						}
					]
				}
			},
			"response": []
		},
		{
			"name": "Explore - Parents",
			"request": {
				"method": "GET",
				"header": [
					{
						"key": "apikey",
						"value": "{{apikey}}",
						"type": "text"
					}
				],
				"url": {
					"raw": "{{serverUrl}}/api/explore/parents?id=22298006",
					"host": [
						"{{serverUrl}}"
					],
					"path": [
						"api",
						"explore",
						"parents"
					],
					"query": [
						{
							"key": "id",
							"value": "22298006",
							"description": "SNOMED CT Concept Identifier. Example- 22298006"
						}
					]
				}
			},
			"response": []
		},
		{
			"name": "Explore - Generic option from brand",
			"request": {
				"method": "GET",
				"header": [
					{
						"key": "apikey",
						"value": "{{apikey}}",
						"type": "text"
					}
				],
				"url": {
					"raw": "{{serverUrl}}/api/explore/parents?id=486501000189100",
					"host": [
						"{{serverUrl}}"
					],
					"path": [
						"api",
						"explore",
						"parents"
					],
					"query": [
						{
							"key": "id",
							"value": "486501000189100",
							"description": "SNOMED CT Concept Identifier. Example- 22298006"
						}
					]
				}
			},
			"response": []
		},
		{
			"name": "Explore - Children",
			"request": {
				"method": "GET",
				"header": [
					{
						"key": "apikey",
						"value": "{{apikey}}",
						"type": "text"
					}
				],
				"url": {
					"raw": "{{serverUrl}}/api/explore/children?id=272141005",
					"host": [
						"{{serverUrl}}"
					],
					"path": [
						"api",
						"explore",
						"children"
					],
					"query": [
						{
							"key": "id",
							"value": "272141005",
							"description": "SNOMED CT Concept Identifier. Example- 22298006"
						}
					]
				}
			},
			"response": []
		},
		{
			"name": "Explore - Packaged options from generic",
			"request": {
				"method": "GET",
				"header": [
					{
						"key": "apikey",
						"value": "{{apikey}}",
						"type": "text"
					}
				],
				"url": {
					"raw": "{{serverUrl}}/api/explore/children?id=322236009",
					"host": [
						"{{serverUrl}}"
					],
					"path": [
						"api",
						"explore",
						"children"
					],
					"query": [
						{
							"key": "id",
							"value": "322236009",
							"description": "SNOMED CT Concept Identifier. Example- 22298006"
						}
					]
				}
			},
			"response": []
		},
		{
			"name": "Explore - substance >> branded drugs",
			"request": {
				"method": "GET",
				"header": [
					{
						"key": "apikey",
						"type": "text",
						"value": "{{apikey}}"
					}
				],
				"url": {
					"raw": "{{serverUrl}}/api/explore/concept?attribute=has precise active ingredient&destinationid=72770009&apikey=demo&semantictag=real clinical drug",
					"host": [
						"{{serverUrl}}"
					],
					"path": [
						"api",
						"explore",
						"concept"
					],
					"query": [
						{
							"key": "attribute",
							"value": "has precise active ingredient"
						},
						{
							"key": "destinationid",
							"value": "72770009"
						},
						{
							"key": "apikey",
							"value": "demo"
						},
						{
							"key": "semantictag",
							"value": "real clinical drug"
						}
					]
				}
			},
			"response": []
		},
		{
			"name": "Explore - substance >> clinical drugs",
			"request": {
				"method": "GET",
				"header": [
					{
						"key": "apikey",
						"type": "text",
						"value": "{{apikey}}"
					}
				],
				"url": {
					"raw": "{{serverUrl}}/api/explore/concept?attribute=has precise active ingredient&destinationid=72770009&apikey=demo&semantictag=clinical drug",
					"host": [
						"{{serverUrl}}"
					],
					"path": [
						"api",
						"explore",
						"concept"
					],
					"query": [
						{
							"key": "attribute",
							"value": "has precise active ingredient"
						},
						{
							"key": "destinationid",
							"value": "72770009"
						},
						{
							"key": "apikey",
							"value": "demo"
						},
						{
							"key": "semantictag",
							"value": "clinical drug"
						}
					]
				}
			},
			"response": []
		},
		{
			"name": "Suggest - disorder - covid",
			"request": {
				"method": "GET",
				"header": [
					{
						"key": "apikey",
						"value": "{{apikey}}",
						"type": "text"
					}
				],
				"url": {
					"raw": "{{serverUrl}}/api/search/suggest?term=covid&state=active&semantictag=disorder&acceptability=synonyms&returnlimit=50",
					"host": [
						"{{serverUrl}}"
					],
					"path": [
						"api",
						"search",
						"suggest"
					],
					"query": [
						{
							"key": "term",
							"value": "covid",
							"description": "Term/text or Concept ID to be searched. Example- fever, 22298006 "
						},
						{
							"key": "state",
							"value": "active",
							"description": "State of a component. Possible values - active, inactive, both. "
						},
						{
							"key": "semantictag",
							"value": "disorder",
							"description": "The Semantic Tag in which SNOMED CT term/text or concept id will be searched. "
						},
						{
							"key": "acceptability",
							"value": "synonyms",
							"description": "Possible values - preferred, preferredexcludingfsn, synonyms, acceptable, all."
						},
						{
							"key": "returnlimit",
							"value": "50",
							"description": "Maximum number of matching terms to be fetched."
						}
					]
				}
			},
			"response": []
		},
		{
			"name": "Explore - Concepts by attribute",
			"request": {
				"method": "GET",
				"header": [
					{
						"key": "apikey",
						"value": "{{apikey}}",
						"type": "text"
					}
				],
				"url": {
					"raw": "{{serverUrl}}/api/explore/concept?attribute=procedure site direct&destinationid=66754008&semantictag=procedure",
					"host": [
						"{{serverUrl}}"
					],
					"path": [
						"api",
						"explore",
						"concept"
					],
					"query": [
						{
							"key": "attribute",
							"value": "procedure site direct",
							"description": "SNOMED CT relationship value"
						},
						{
							"key": "destinationid",
							"value": "66754008",
							"description": "SNOMED CT Concept Identifier. Example- 22298006"
						},
						{
							"key": "semantictag",
							"value": "procedure",
							"description": "The Semantic Tag in which SNOMED CT term/text or concept id will be searched. "
						}
					]
				}
			},
			"response": []
		},
		{
			"name": "Suggest",
			"request": {
				"method": "GET",
				"header": [
					{
						"key": "apikey",
						"value": "{{apikey}}",
						"type": "text"
					}
				],
				"url": {
					"raw": "{{serverUrl}}/api/search/suggest?term=headache&state=active&semantictag=finding&acceptability=preferred&returnlimit=50&refsetid=null&parentid=null",
					"host": [
						"{{serverUrl}}"
					],
					"path": [
						"api",
						"search",
						"suggest"
					],
					"query": [
						{
							"key": "term",
							"value": "headache",
							"description": "Term/text or Concept ID to be searched. Example- fever, 22298006 "
						},
						{
							"key": "state",
							"value": "active",
							"description": "State of a component. Possible values - active, inactive, both. "
						},
						{
							"key": "semantictag",
							"value": "finding",
							"description": "The Semantic Tag in which SNOMED CT term/text or concept id will be searched. "
						},
						{
							"key": "acceptability",
							"value": "preferred",
							"description": "Possible values - preferred, preferredexcludingfsn, synonyms, acceptable, all."
						},
						{
							"key": "returnlimit",
							"value": "50",
							"description": "Maximum number of matching terms to be fetched."
						},
						{
							"key": "refsetid",
							"value": "null",
							"description": "Refset Identifier. Example - 721144007"
						},
						{
							"key": "parentid",
							"value": "null",
							"description": "SNOMED CT Concept Identifier. Example- 22298006"
						}
					]
				}
			},
			"response": []
		},
		{
			"name": "Suggest - disorder - migrai",
			"request": {
				"method": "GET",
				"header": [
					{
						"key": "apikey",
						"value": "{{apikey}}",
						"type": "text"
					}
				],
				"url": {
					"raw": "{{serverUrl}}/api/search/suggest?term=migrai&state=active&semantictag=disorder&acceptability=synonyms&returnlimit=50",
					"host": [
						"{{serverUrl}}"
					],
					"path": [
						"api",
						"search",
						"suggest"
					],
					"query": [
						{
							"key": "term",
							"value": "migrai",
							"description": "Term/text or Concept ID to be searched. Example- fever, 22298006 "
						},
						{
							"key": "state",
							"value": "active",
							"description": "State of a component. Possible values - active, inactive, both. "
						},
						{
							"key": "semantictag",
							"value": "disorder",
							"description": "The Semantic Tag in which SNOMED CT term/text or concept id will be searched. "
						},
						{
							"key": "acceptability",
							"value": "synonyms",
							"description": "Possible values - preferred, preferredexcludingfsn, synonyms, acceptable, all."
						},
						{
							"key": "returnlimit",
							"value": "50",
							"description": "Maximum number of matching terms to be fetched."
						}
					]
				}
			},
			"response": []
		},
		{
			"name": "suggest - clinical drug(gen) - paracet",
			"request": {
				"method": "GET",
				"header": [
					{
						"key": "apikey",
						"value": "{{apikey}}",
						"type": "text"
					}
				],
				"url": {
					"raw": "{{serverUrl}}/api/search/suggest?term=paracet&state=active&semantictag=clinical drug&acceptability=preferredexcludingfsn&returnlimit=50&groupbyconcept=false",
					"host": [
						"{{serverUrl}}"
					],
					"path": [
						"api",
						"search",
						"suggest"
					],
					"query": [
						{
							"key": "term",
							"value": "paracet",
							"description": "Term/text or Concept ID to be searched. Example- fever, 22298006 "
						},
						{
							"key": "state",
							"value": "active",
							"description": "State of a component. Possible values - active, inactive, both. "
						},
						{
							"key": "semantictag",
							"value": "clinical drug",
							"description": "The Semantic Tag in which SNOMED CT term/text or concept id will be searched. "
						},
						{
							"key": "acceptability",
							"value": "preferredexcludingfsn",
							"description": "Possible values - preferred, preferredexcludingfsn, synonyms, acceptable, all."
						},
						{
							"key": "returnlimit",
							"value": "50",
							"description": "Maximum number of matching terms to be fetched."
						},
						{
							"key": "groupbyconcept",
							"value": "false",
							"description": "If true, then method will return set of CompositeDescription which will contain one description from one concept. "
						}
					]
				}
			},
			"response": []
		},
		{
			"name": "suggest - medicinal product - paraceta",
			"request": {
				"method": "GET",
				"header": [
					{
						"key": "apikey",
						"value": "{{apikey}}",
						"type": "text"
					}
				],
				"url": {
					"raw": "{{serverUrl}}/api/search/suggest?term=paracetamol&state=active&semantictag=medicinal product&acceptability=preferredexcludingfsn&returnlimit=50&groupbyconcept=false",
					"host": [
						"{{serverUrl}}"
					],
					"path": [
						"api",
						"search",
						"suggest"
					],
					"query": [
						{
							"key": "term",
							"value": "paracetamol",
							"description": "Term/text or Concept ID to be searched. Example- fever, 22298006 "
						},
						{
							"key": "state",
							"value": "active",
							"description": "State of a component. Possible values - active, inactive, both. "
						},
						{
							"key": "semantictag",
							"value": "medicinal product",
							"description": "The Semantic Tag in which SNOMED CT term/text or concept id will be searched. "
						},
						{
							"key": "acceptability",
							"value": "preferredexcludingfsn",
							"description": "Possible values - preferred, preferredexcludingfsn, synonyms, acceptable, all."
						},
						{
							"key": "returnlimit",
							"value": "50",
							"description": "Maximum number of matching terms to be fetched."
						},
						{
							"key": "groupbyconcept",
							"value": "false",
							"description": "If true, then method will return set of CompositeDescription which will contain one description from one concept. "
						}
					]
				}
			},
			"response": []
		},
		{
			"name": "suggest - real medicinal product - dolo",
			"request": {
				"method": "GET",
				"header": [
					{
						"key": "apikey",
						"value": "{{apikey}}",
						"type": "text"
					}
				],
				"url": {
					"raw": "{{serverUrl}}/api/search/suggest?term=dolo&state=active&semantictag=real medicinal product&acceptability=preferredexcludingfsn&returnlimit=50&groupbyconcept=false",
					"host": [
						"{{serverUrl}}"
					],
					"path": [
						"api",
						"search",
						"suggest"
					],
					"query": [
						{
							"key": "term",
							"value": "dolo",
							"description": "Term/text or Concept ID to be searched. Example- fever, 22298006 "
						},
						{
							"key": "state",
							"value": "active",
							"description": "State of a component. Possible values - active, inactive, both. "
						},
						{
							"key": "semantictag",
							"value": "real medicinal product",
							"description": "The Semantic Tag in which SNOMED CT term/text or concept id will be searched. "
						},
						{
							"key": "acceptability",
							"value": "preferredexcludingfsn",
							"description": "Possible values - preferred, preferredexcludingfsn, synonyms, acceptable, all."
						},
						{
							"key": "returnlimit",
							"value": "50",
							"description": "Maximum number of matching terms to be fetched."
						},
						{
							"key": "groupbyconcept",
							"value": "false",
							"description": "If true, then method will return set of CompositeDescription which will contain one description from one concept. "
						}
					]
				}
			},
			"response": []
		},
		{
			"name": "suggest - real clinical drug(brand)- dolo",
			"request": {
				"method": "GET",
				"header": [
					{
						"key": "apikey",
						"value": "{{apikey}}",
						"type": "text"
					}
				],
				"url": {
					"raw": "{{serverUrl}}/api/search/suggest?term=dolo&state=active&semantictag=real clinical drug&acceptability=preferredexcludingfsn&returnlimit=50&groupbyconcept=false",
					"host": [
						"{{serverUrl}}"
					],
					"path": [
						"api",
						"search",
						"suggest"
					],
					"query": [
						{
							"key": "term",
							"value": "dolo",
							"description": "Term/text or Concept ID to be searched. Example- fever, 22298006 "
						},
						{
							"key": "state",
							"value": "active",
							"description": "State of a component. Possible values - active, inactive, both. "
						},
						{
							"key": "semantictag",
							"value": "real clinical drug",
							"description": "The Semantic Tag in which SNOMED CT term/text or concept id will be searched. "
						},
						{
							"key": "acceptability",
							"value": "preferredexcludingfsn",
							"description": "Possible values - preferred, preferredexcludingfsn, synonyms, acceptable, all."
						},
						{
							"key": "returnlimit",
							"value": "50",
							"description": "Maximum number of matching terms to be fetched."
						},
						{
							"key": "groupbyconcept",
							"value": "false",
							"description": "If true, then method will return set of CompositeDescription which will contain one description from one concept. "
						}
					]
				}
			},
			"response": []
		},
		{
			"name": "Search",
			"request": {
				"method": "GET",
				"header": [
					{
						"key": "apikey",
						"value": "{{apikey}}",
						"type": "text"
					}
				],
				"url": {
					"raw": "{{serverUrl}}/api/search/search?term=mode&state=active&semantictag=qualifier value&acceptability=preferredexcludingfsn&returnlimit=50&groupbyconcept=false&refsetid=null&parentid=272141005&fullconcept=false",
					"host": [
						"{{serverUrl}}"
					],
					"path": [
						"api",
						"search",
						"search"
					],
					"query": [
						{
							"key": "term",
							"value": "mode",
							"description": "Term/text or Concept ID to be searched. Example- fever, 22298006 "
						},
						{
							"key": "state",
							"value": "active",
							"description": "State of a component. Possible values - active, inactive, both. "
						},
						{
							"key": "semantictag",
							"value": "qualifier value",
							"description": "The Semantic Tag in which SNOMED CT term/text or concept id will be searched. "
						},
						{
							"key": "acceptability",
							"value": "preferredexcludingfsn",
							"description": "Possible values - preferred, preferredexcludingfsn, synonyms, acceptable, all."
						},
						{
							"key": "returnlimit",
							"value": "50",
							"description": "Maximum number of matching terms to be fetched."
						},
						{
							"key": "groupbyconcept",
							"value": "false",
							"description": "If true, then method will return set of CompositeDescription which will contain one description from one concept. "
						},
						{
							"key": "refsetid",
							"value": "null",
							"description": "Refset Identifier. Example - 721144007"
						},
						{
							"key": "parentid",
							"value": "272141005",
							"description": "SNOMED CT Concept Identifier. Example- 22298006"
						},
						{
							"key": "fullconcept",
							"value": "false"
						}
					]
				}
			},
			"response": []
		},
		{
			"name": "Search - disorder - migrai",
			"request": {
				"method": "GET",
				"header": [
					{
						"key": "apikey",
						"value": "{{apikey}}",
						"type": "text"
					}
				],
				"url": {
					"raw": "{{serverUrl}}/api/search/search?term=migrai&state=active&semantictag=disorder&acceptability=synonyms&returnlimit=50&fullconcept=false",
					"host": [
						"{{serverUrl}}"
					],
					"path": [
						"api",
						"search",
						"search"
					],
					"query": [
						{
							"key": "term",
							"value": "migrai",
							"description": "Term/text or Concept ID to be searched. Example- fever, 22298006 "
						},
						{
							"key": "state",
							"value": "active",
							"description": "State of a component. Possible values - active, inactive, both. "
						},
						{
							"key": "semantictag",
							"value": "disorder",
							"description": "The Semantic Tag in which SNOMED CT term/text or concept id will be searched. "
						},
						{
							"key": "acceptability",
							"value": "synonyms",
							"description": "Possible values - preferred, preferredexcludingfsn, synonyms, acceptable, all."
						},
						{
							"key": "returnlimit",
							"value": "50",
							"description": "Maximum number of matching terms to be fetched."
						},
						{
							"key": "fullconcept",
							"value": "false"
						}
					]
				}
			},
			"response": []
		},
		{
			"name": "Search - disorder - covid",
			"request": {
				"method": "GET",
				"header": [
					{
						"key": "apikey",
						"value": "{{apikey}}",
						"type": "text"
					}
				],
				"url": {
					"raw": "{{serverUrl}}/api/search/search?term=covid&state=active&semantictag=disorder&acceptability=synonyms&returnlimit=50&fullconcept=false",
					"host": [
						"{{serverUrl}}"
					],
					"path": [
						"api",
						"search",
						"search"
					],
					"query": [
						{
							"key": "term",
							"value": "covid",
							"description": "Term/text or Concept ID to be searched. Example- fever, 22298006 "
						},
						{
							"key": "state",
							"value": "active",
							"description": "State of a component. Possible values - active, inactive, both. "
						},
						{
							"key": "semantictag",
							"value": "disorder",
							"description": "The Semantic Tag in which SNOMED CT term/text or concept id will be searched. "
						},
						{
							"key": "acceptability",
							"value": "synonyms",
							"description": "Possible values - preferred, preferredexcludingfsn, synonyms, acceptable, all."
						},
						{
							"key": "returnlimit",
							"value": "50",
							"description": "Maximum number of matching terms to be fetched."
						},
						{
							"key": "fullconcept",
							"value": "false"
						}
					]
				}
			},
			"response": []
		},
		{
			"name": "Search - geographic location - banga",
			"request": {
				"method": "GET",
				"header": [
					{
						"key": "apikey",
						"value": "{{apikey}}",
						"type": "text"
					}
				],
				"url": {
					"raw": "{{serverUrl}}/api/search/search?term=bangalo&state=active&semantictag=geographic location&acceptability=synonyms&returnlimit=50&groupbyconcept=false&fullconcept=false",
					"host": [
						"{{serverUrl}}"
					],
					"path": [
						"api",
						"search",
						"search"
					],
					"query": [
						{
							"key": "term",
							"value": "bangalo",
							"description": "Term/text or Concept ID to be searched. Example- fever, 22298006 "
						},
						{
							"key": "state",
							"value": "active",
							"description": "State of a component. Possible values - active, inactive, both. "
						},
						{
							"key": "semantictag",
							"value": "geographic location",
							"description": "The Semantic Tag in which SNOMED CT term/text or concept id will be searched. "
						},
						{
							"key": "acceptability",
							"value": "synonyms",
							"description": "Possible values - preferred, preferredexcludingfsn, synonyms, acceptable, all."
						},
						{
							"key": "returnlimit",
							"value": "50",
							"description": "Maximum number of matching terms to be fetched."
						},
						{
							"key": "groupbyconcept",
							"value": "false",
							"description": "If true, then method will return set of CompositeDescription which will contain one description from one concept. "
						},
						{
							"key": "fullconcept",
							"value": "false"
						}
					]
				}
			},
			"response": []
		},
		{
			"name": "Search - clinical drug(gen) - paracet",
			"request": {
				"method": "GET",
				"header": [
					{
						"key": "apikey",
						"value": "{{apikey}}",
						"type": "text"
					}
				],
				"url": {
					"raw": "{{serverUrl}}/api/search/search?term=paracet&state=active&semantictag=clinical drug&acceptability=preferredexcludingfsn&returnlimit=50&groupbyconcept=false&fullconcept=false",
					"host": [
						"{{serverUrl}}"
					],
					"path": [
						"api",
						"search",
						"search"
					],
					"query": [
						{
							"key": "term",
							"value": "paracet",
							"description": "Term/text or Concept ID to be searched. Example- fever, 22298006 "
						},
						{
							"key": "state",
							"value": "active",
							"description": "State of a component. Possible values - active, inactive, both. "
						},
						{
							"key": "semantictag",
							"value": "clinical drug",
							"description": "The Semantic Tag in which SNOMED CT term/text or concept id will be searched. "
						},
						{
							"key": "acceptability",
							"value": "preferredexcludingfsn",
							"description": "Possible values - preferred, preferredexcludingfsn, synonyms, acceptable, all."
						},
						{
							"key": "returnlimit",
							"value": "50",
							"description": "Maximum number of matching terms to be fetched."
						},
						{
							"key": "groupbyconcept",
							"value": "false",
							"description": "If true, then method will return set of CompositeDescription which will contain one description from one concept. "
						},
						{
							"key": "fullconcept",
							"value": "false"
						}
					]
				}
			},
			"response": []
		},
		{
			"name": "Search - real clinical drug(brand) - dolo",
			"request": {
				"method": "GET",
				"header": [
					{
						"key": "apikey",
						"value": "{{apikey}}",
						"type": "text"
					}
				],
				"url": {
					"raw": "{{serverUrl}}/api/search/search?term=dolo&state=active&semantictag=real clinical drug&acceptability=synonyms&returnlimit=50&groupbyconcept=false&fullconcept=false",
					"host": [
						"{{serverUrl}}"
					],
					"path": [
						"api",
						"search",
						"search"
					],
					"query": [
						{
							"key": "term",
							"value": "dolo",
							"description": "Term/text or Concept ID to be searched. Example- fever, 22298006 "
						},
						{
							"key": "state",
							"value": "active",
							"description": "State of a component. Possible values - active, inactive, both. "
						},
						{
							"key": "semantictag",
							"value": "real clinical drug",
							"description": "The Semantic Tag in which SNOMED CT term/text or concept id will be searched. "
						},
						{
							"key": "acceptability",
							"value": "synonyms"
						},
						{
							"key": "returnlimit",
							"value": "50",
							"description": "Maximum number of matching terms to be fetched."
						},
						{
							"key": "groupbyconcept",
							"value": "false",
							"description": "If true, then method will return set of CompositeDescription which will contain one description from one concept. "
						},
						{
							"key": "fullconcept",
							"value": "false"
						}
					]
				}
			},
			"response": []
		},
		{
			"name": "Search - drug",
			"request": {
				"method": "GET",
				"header": [
					{
						"key": "apikey",
						"value": "{{apikey}}",
						"type": "text"
					}
				],
				"url": {
					"raw": "{{serverUrl}}/api/search/search?term=acarbose&state=active&semantictag=clinical drug&acceptability=preferredexcludingfsn&returnlimit=50&groupbyconcept=false&fullconcept=false",
					"host": [
						"{{serverUrl}}"
					],
					"path": [
						"api",
						"search",
						"search"
					],
					"query": [
						{
							"key": "term",
							"value": "acarbose",
							"description": "Term/text or Concept ID to be searched. Example- fever, 22298006 "
						},
						{
							"key": "state",
							"value": "active",
							"description": "State of a component. Possible values - active, inactive, both. "
						},
						{
							"key": "semantictag",
							"value": "clinical drug",
							"description": "The Semantic Tag in which SNOMED CT term/text or concept id will be searched. "
						},
						{
							"key": "acceptability",
							"value": "preferredexcludingfsn",
							"description": "Possible values - preferred, preferredexcludingfsn, synonyms, acceptable, all."
						},
						{
							"key": "returnlimit",
							"value": "50",
							"description": "Maximum number of matching terms to be fetched."
						},
						{
							"key": "groupbyconcept",
							"value": "false",
							"description": "If true, then method will return set of CompositeDescription which will contain one description from one concept. "
						},
						{
							"key": "fullconcept",
							"value": "false"
						}
					]
				}
			},
			"response": []
		},
		{
			"name": "Search - substance",
			"request": {
				"method": "GET",
				"header": [
					{
						"key": "apikey",
						"value": "{{apikey}}",
						"type": "text"
					}
				],
				"url": {
					"raw": "{{serverUrl}}/api/search/search?term=metopro&state=active&semantictag=substance&acceptability=preferredexcludingfsn&returnlimit=50&groupbyconcept=false&refsetid=null&fullconcept=false",
					"host": [
						"{{serverUrl}}"
					],
					"path": [
						"api",
						"search",
						"search"
					],
					"query": [
						{
							"key": "term",
							"value": "metopro",
							"description": "Term/text or Concept ID to be searched. Example- fever, 22298006 "
						},
						{
							"key": "state",
							"value": "active",
							"description": "State of a component. Possible values - active, inactive, both. "
						},
						{
							"key": "semantictag",
							"value": "substance",
							"description": "The Semantic Tag in which SNOMED CT term/text or concept id will be searched. "
						},
						{
							"key": "acceptability",
							"value": "preferredexcludingfsn",
							"description": "Possible values - preferred, preferredexcludingfsn, synonyms, acceptable, all."
						},
						{
							"key": "returnlimit",
							"value": "50",
							"description": "Maximum number of matching terms to be fetched."
						},
						{
							"key": "groupbyconcept",
							"value": "false",
							"description": "If true, then method will return set of CompositeDescription which will contain one description from one concept. "
						},
						{
							"key": "refsetid",
							"value": "null",
							"description": "Refset Identifier. Example - 721144007"
						},
						{
							"key": "fullconcept",
							"value": "false"
						}
					]
				}
			},
			"response": []
		},
		{
			"name": "Search - additional dosage instructions",
			"request": {
				"method": "GET",
				"header": [
					{
						"key": "apikey",
						"type": "text",
						"value": "{{apikey}}"
					}
				],
				"url": {
					"raw": "{{serverUrl}}/api/search/search?term=with water&state=active&semantictag=qualifier value&acceptability=synonyms&returnlimit=50&groupbyconcept=false&parentid=419492006&fullconcept=false",
					"host": [
						"{{serverUrl}}"
					],
					"path": [
						"api",
						"search",
						"search"
					],
					"query": [
						{
							"key": "term",
							"value": "with water",
							"description": "Term/text or Concept ID to be searched. Example- fever, 22298006 "
						},
						{
							"key": "state",
							"value": "active",
							"description": "State of a component. Possible values - active, inactive, both. "
						},
						{
							"key": "semantictag",
							"value": "qualifier value",
							"description": "The Semantic Tag in which SNOMED CT term/text or concept id will be searched. "
						},
						{
							"key": "acceptability",
							"value": "synonyms"
						},
						{
							"key": "returnlimit",
							"value": "50",
							"description": "Maximum number of matching terms to be fetched."
						},
						{
							"key": "groupbyconcept",
							"value": "false",
							"description": "If true, then method will return set of CompositeDescription which will contain one description from one concept. "
						},
						{
							"key": "parentid",
							"value": "419492006"
						},
						{
							"key": "fullconcept",
							"value": "false"
						}
					]
				}
			},
			"response": []
		},
		{
			"name": "Search - dosage frequencies",
			"request": {
				"method": "GET",
				"header": [
					{
						"key": "apikey",
						"type": "text",
						"value": "{{apikey}}"
					}
				],
				"url": {
					"raw": "{{serverUrl}}/api/search/search?term=three&state=active&semantictag=qualifier value&acceptability=synonyms&returnlimit=50&groupbyconcept=false&parentid=272123002&fullconcept=false",
					"host": [
						"{{serverUrl}}"
					],
					"path": [
						"api",
						"search",
						"search"
					],
					"query": [
						{
							"key": "term",
							"value": "three",
							"description": "Term/text or Concept ID to be searched. Example- fever, 22298006 "
						},
						{
							"key": "state",
							"value": "active",
							"description": "State of a component. Possible values - active, inactive, both. "
						},
						{
							"key": "semantictag",
							"value": "qualifier value",
							"description": "The Semantic Tag in which SNOMED CT term/text or concept id will be searched. "
						},
						{
							"key": "acceptability",
							"value": "synonyms"
						},
						{
							"key": "returnlimit",
							"value": "50",
							"description": "Maximum number of matching terms to be fetched."
						},
						{
							"key": "groupbyconcept",
							"value": "false",
							"description": "If true, then method will return set of CompositeDescription which will contain one description from one concept. "
						},
						{
							"key": "parentid",
							"value": "272123002"
						},
						{
							"key": "fullconcept",
							"value": "false"
						}
					]
				}
			},
			"response": []
		},
		{
			"name": "Search - route of administration",
			"request": {
				"method": "GET",
				"header": [
					{
						"key": "apikey",
						"type": "text",
						"value": "{{apikey}}"
					}
				],
				"url": {
					"raw": "{{serverUrl}}/api/search/search?term=oral&state=active&semantictag=qualifier value&acceptability=synonyms&returnlimit=50&groupbyconcept=false&parentid=284009009&fullconcept=false",
					"host": [
						"{{serverUrl}}"
					],
					"path": [
						"api",
						"search",
						"search"
					],
					"query": [
						{
							"key": "term",
							"value": "oral"
						},
						{
							"key": "state",
							"value": "active",
							"description": "State of a component. Possible values - active, inactive, both. "
						},
						{
							"key": "semantictag",
							"value": "qualifier value",
							"description": "The Semantic Tag in which SNOMED CT term/text or concept id will be searched. "
						},
						{
							"key": "acceptability",
							"value": "synonyms"
						},
						{
							"key": "returnlimit",
							"value": "50",
							"description": "Maximum number of matching terms to be fetched."
						},
						{
							"key": "groupbyconcept",
							"value": "false",
							"description": "If true, then method will return set of CompositeDescription which will contain one description from one concept. "
						},
						{
							"key": "parentid",
							"value": "284009009"
						},
						{
							"key": "fullconcept",
							"value": "false"
						}
					]
				},
				"description": "Search for concepts under 284009009 |Route of administration value (qualifier value) hierarchy. To be used for recoding medication orders"
			},
			"response": []
		},
		{
			"name": "Search - temporal period - day",
			"request": {
				"method": "GET",
				"header": [
					{
						"key": "apikey",
						"type": "text",
						"value": "{{apikey}}"
					}
				],
				"url": {
					"raw": "{{serverUrl}}/api/search/search?term=day&state=active&semantictag=qualifier value&acceptability=synonyms&returnlimit=50&groupbyconcept=false&parentid=272106006++307157008&fullconcept=false",
					"host": [
						"{{serverUrl}}"
					],
					"path": [
						"api",
						"search",
						"search"
					],
					"query": [
						{
							"key": "term",
							"value": "day"
						},
						{
							"key": "state",
							"value": "active",
							"description": "State of a component. Possible values - active, inactive, both. "
						},
						{
							"key": "semantictag",
							"value": "qualifier value",
							"description": "The Semantic Tag in which SNOMED CT term/text or concept id will be searched. "
						},
						{
							"key": "acceptability",
							"value": "synonyms"
						},
						{
							"key": "returnlimit",
							"value": "50",
							"description": "Maximum number of matching terms to be fetched."
						},
						{
							"key": "groupbyconcept",
							"value": "false",
							"description": "If true, then method will return set of CompositeDescription which will contain one description from one concept. "
						},
						{
							"key": "parentid",
							"value": "272106006++307157008",
							"description": "Add multiple parentIds using ++"
						},
						{
							"key": "fullconcept",
							"value": "false"
						}
					]
				}
			},
			"response": []
		},
		{
			"name": "Search - temporal period - lunch",
			"request": {
				"method": "GET",
				"header": [
					{
						"key": "apikey",
						"type": "text",
						"value": "{{apikey}}"
					}
				],
				"url": {
					"raw": "{{serverUrl}}/api/search/search?term=lunch&state=active&semantictag=qualifier value&acceptability=synonyms&returnlimit=50&groupbyconcept=false&parentid=272106006++307157008&fullconcept=false",
					"host": [
						"{{serverUrl}}"
					],
					"path": [
						"api",
						"search",
						"search"
					],
					"query": [
						{
							"key": "term",
							"value": "lunch"
						},
						{
							"key": "state",
							"value": "active",
							"description": "State of a component. Possible values - active, inactive, both. "
						},
						{
							"key": "semantictag",
							"value": "qualifier value",
							"description": "The Semantic Tag in which SNOMED CT term/text or concept id will be searched. "
						},
						{
							"key": "acceptability",
							"value": "synonyms"
						},
						{
							"key": "returnlimit",
							"value": "50",
							"description": "Maximum number of matching terms to be fetched."
						},
						{
							"key": "groupbyconcept",
							"value": "false",
							"description": "If true, then method will return set of CompositeDescription which will contain one description from one concept. "
						},
						{
							"key": "parentid",
							"value": "272106006++307157008"
						},
						{
							"key": "fullconcept",
							"value": "false"
						}
					]
				},
				"description": "Search for concepts under 272106006 | Temporal periods of day (qualifier value) && 307157008 | Temporal periods relating to activities (qualifier value) hierarchies. To be used for recoding medication orders"
			},
			"response": []
		},
		{
			"name": "Search - unit of usage - pack",
			"request": {
				"method": "GET",
				"header": [
					{
						"key": "apikey",
						"type": "text",
						"value": "{{apikey}}"
					}
				],
				"url": {
					"raw": "{{serverUrl}}/api/search/search?term=pack&state=active&semantictag=qualifier value&acceptability=synonyms&returnlimit=50&groupbyconcept=false&parentid=408102007&fullconcept=false",
					"host": [
						"{{serverUrl}}"
					],
					"path": [
						"api",
						"search",
						"search"
					],
					"query": [
						{
							"key": "term",
							"value": "pack"
						},
						{
							"key": "state",
							"value": "active",
							"description": "State of a component. Possible values - active, inactive, both. "
						},
						{
							"key": "semantictag",
							"value": "qualifier value",
							"description": "The Semantic Tag in which SNOMED CT term/text or concept id will be searched. "
						},
						{
							"key": "acceptability",
							"value": "synonyms"
						},
						{
							"key": "returnlimit",
							"value": "50",
							"description": "Maximum number of matching terms to be fetched."
						},
						{
							"key": "groupbyconcept",
							"value": "false",
							"description": "If true, then method will return set of CompositeDescription which will contain one description from one concept. "
						},
						{
							"key": "parentid",
							"value": "408102007"
						},
						{
							"key": "fullconcept",
							"value": "false"
						}
					]
				},
				"description": "Search for concepts under 408102007 | Unit dose (qualifier value) hierarchy. To be used for recoding medication orders"
			},
			"response": []
		},
		{
			"name": "Lookup - Concept",
			"request": {
				"method": "GET",
				"header": [
					{
						"key": "apikey",
						"value": "{{apikey}}",
						"type": "text"
					}
				],
				"url": {
					"raw": "{{serverUrl}}/api/lookup/concept?id=22298006&langrefset=us",
					"host": [
						"{{serverUrl}}"
					],
					"path": [
						"api",
						"lookup",
						"concept"
					],
					"query": [
						{
							"key": "id",
							"value": "22298006",
							"description": "SNOMED CT Concept Identifier. Example- 22298006"
						},
						{
							"key": "langrefset",
							"value": "us"
						}
					]
				}
			},
			"response": []
		},
		{
			"name": "Lookup - Relationship",
			"request": {
				"method": "GET",
				"header": [
					{
						"key": "apikey",
						"value": "{{apikey}}",
						"type": "text"
					}
				],
				"url": {
					"raw": "{{serverUrl}}/api/lookup/relationship?id=22298006&relation=is a&direction=source",
					"host": [
						"{{serverUrl}}"
					],
					"path": [
						"api",
						"lookup",
						"relationship"
					],
					"query": [
						{
							"key": "id",
							"value": "22298006",
							"description": "SNOMED CT Concept Identifier. Example- 22298006"
						},
						{
							"key": "relation",
							"value": "is a",
							"description": "SNOMED CT relationship value"
						},
						{
							"key": "direction",
							"value": "source",
							"description": "Possible values - source, destination. "
						}
					]
				}
			},
			"response": []
		},
		{
			"name": "Lookup - drug >> generic",
			"request": {
				"method": "GET",
				"header": [
					{
						"key": "apikey",
						"value": "{{apikey}}",
						"type": "text"
					}
				],
				"url": {
					"raw": "{{serverUrl}}/api/lookup/relationship?id=370149001&relation=has basis of strength substance&direction=source",
					"host": [
						"{{serverUrl}}"
					],
					"path": [
						"api",
						"lookup",
						"relationship"
					],
					"query": [
						{
							"key": "id",
							"value": "370149001",
							"description": "SNOMED CT Concept Identifier. Example- 22298006"
						},
						{
							"key": "relation",
							"value": "has basis of strength substance",
							"description": "SNOMED CT relationship value"
						},
						{
							"key": "direction",
							"value": "source",
							"description": "Possible values - source, destination. "
						}
					]
				}
			},
			"response": []
		},
		{
			"name": "Lookup - generic >> drugs",
			"request": {
				"method": "GET",
				"header": [
					{
						"key": "apikey",
						"type": "text",
						"value": "{{apikey}}"
					}
				],
				"url": {
					"raw": "{{serverUrl}}/api/lookup/relationship?id=72770009&relation=has basis of strength substance&direction=destination",
					"host": [
						"{{serverUrl}}"
					],
					"path": [
						"api",
						"lookup",
						"relationship"
					],
					"query": [
						{
							"key": "id",
							"value": "72770009",
							"description": "SNOMED CT Concept Identifier. Example- 22298006"
						},
						{
							"key": "relation",
							"value": "has basis of strength substance",
							"description": "SNOMED CT relationship value"
						},
						{
							"key": "direction",
							"value": "destination",
							"description": "Possible values - source, destination. "
						}
					]
				}
			},
			"response": []
		},
		{
			"name": "Map - ICD10 - basic",
			"request": {
				"method": "GET",
				"header": [
					{
						"key": "apikey",
						"value": "{{apikey}}",
						"type": "text"
					}
				],
				"url": {
					"raw": "{{serverUrl}}/api/map/icdmap?id=58214004",
					"host": [
						"{{serverUrl}}"
					],
					"path": [
						"api",
						"map",
						"icdmap"
					],
					"query": [
						{
							"key": "id",
							"value": "58214004",
							"description": "SNOMED CT Concept Identifier. Example- 58214004"
						}
					]
				}
			},
			"response": []
		},
		{
			"name": "Explore - Districts - Karnataka",
			"request": {
				"method": "GET",
				"header": [
					{
						"key": "apikey",
						"value": "{{apikey}}",
						"type": "text"
					}
				],
				"url": {
					"raw": "{{serverUrl}}/api/explore/children?id=714961000189107",
					"host": [
						"{{serverUrl}}"
					],
					"path": [
						"api",
						"explore",
						"children"
					],
					"query": [
						{
							"key": "id",
							"value": "714961000189107",
							"description": "SNOMED CT Concept Identifier. Example- 22298006"
						}
					]
				}
			},
			"response": []
		},
		{
			"name": "Map - location - LGD code",
			"request": {
				"method": "GET",
				"header": [
					{
						"key": "apikey",
						"value": "{{apikey}}",
						"type": "text"
					}
				],
				"url": {
					"raw": "{{serverUrl}}/api/map/simplemap?id=723461000189109",
					"host": [
						"{{serverUrl}}"
					],
					"path": [
						"api",
						"map",
						"simplemap"
					],
					"query": [
						{
							"key": "id",
							"value": "723461000189109"
						}
					]
				}
			},
			"response": []
		},
		{
			"name": "Lookup - Hindi synonym",
			"request": {
				"method": "GET",
				"header": [
					{
						"key": "apikey",
						"value": "{{apikey}}",
						"type": "text"
					}
				],
				"url": {
					"raw": "{{serverUrl}}/api/lookup/concept?id=715291000189107&langrefset=hi",
					"host": [
						"{{serverUrl}}"
					],
					"path": [
						"api",
						"lookup",
						"concept"
					],
					"query": [
						{
							"key": "id",
							"value": "715291000189107",
							"description": "SNOMED CT Concept Identifier. Example- 22298006"
						},
						{
							"key": "langrefset",
							"value": "hi"
						}
					]
				}
			},
			"response": []
		},
		{
			"name": "List all sematic tags",
			"request": {
				"method": "GET",
				"header": [
					{
						"key": "apikey",
						"type": "text",
						"value": "{{apikey}}"
					}
				],
				"url": {
					"raw": "{{serverUrl}}/api/search/semantic",
					"host": [
						"{{serverUrl}}"
					],
					"path": [
						"api",
						"search",
						"semantic"
					]
				}
			},
			"response": []
		},
		{
			"name": "Search - severity",
			"request": {
				"method": "GET",
				"header": [
					{
						"key": "apikey",
						"value": "{{apikey}}",
						"type": "text"
					}
				],
				"url": {
					"raw": "{{serverUrl}}/api/search/search?term=mild&state=active&semantictag=qualifier value&acceptability=synonyms&returnlimit=50&fullconcept=false&parentid=",
					"host": [
						"{{serverUrl}}"
					],
					"path": [
						"api",
						"search",
						"search"
					],
					"query": [
						{
							"key": "term",
							"value": "mild",
							"description": "Term/text or Concept ID to be searched. Example- fever, 22298006 "
						},
						{
							"key": "state",
							"value": "active",
							"description": "State of a component. Possible values - active, inactive, both. "
						},
						{
							"key": "semantictag",
							"value": "qualifier value",
							"description": "The Semantic Tag in which SNOMED CT term/text or concept id will be searched. "
						},
						{
							"key": "acceptability",
							"value": "synonyms",
							"description": "Possible values - preferred, preferredexcludingfsn, synonyms, acceptable, all."
						},
						{
							"key": "returnlimit",
							"value": "50",
							"description": "Maximum number of matching terms to be fetched."
						},
						{
							"key": "fullconcept",
							"value": "false"
						},
						{
							"key": "parentid",
							"value": ""
						}
					]
				}
			},
			"response": []
		},
		{
			"name": "Search - sleep quality",
			"request": {
				"method": "GET",
				"header": [
					{
						"key": "apikey",
						"value": "{{apikey}}",
						"type": "text"
					}
				],
				"url": {
					"raw": "{{serverUrl}}/api/search/search?term=slee&state=active&semantictag=finding&acceptability=synonyms&returnlimit=50&fullconcept=false&parentid=118190003++401175000",
					"host": [
						"{{serverUrl}}"
					],
					"path": [
						"api",
						"search",
						"search"
					],
					"query": [
						{
							"key": "term",
							"value": "slee",
							"description": "Term/text or Concept ID to be searched. Example- fever, 22298006 "
						},
						{
							"key": "state",
							"value": "active",
							"description": "State of a component. Possible values - active, inactive, both. "
						},
						{
							"key": "semantictag",
							"value": "finding",
							"description": "The Semantic Tag in which SNOMED CT term/text or concept id will be searched. "
						},
						{
							"key": "acceptability",
							"value": "synonyms",
							"description": "Possible values - preferred, preferredexcludingfsn, synonyms, acceptable, all."
						},
						{
							"key": "returnlimit",
							"value": "50",
							"description": "Maximum number of matching terms to be fetched."
						},
						{
							"key": "fullconcept",
							"value": "false"
						},
						{
							"key": "parentid",
							"value": "118190003++401175000"
						}
					]
				}
			},
			"response": []
		},
		{
			"name": "Search - Stool nature",
			"request": {
				"method": "GET",
				"header": [
					{
						"key": "apikey",
						"value": "{{apikey}}",
						"type": "text"
					}
				],
				"url": {
					"raw": "{{serverUrl}}/api/search/search?term=dry st&state=active&semantictag=finding&acceptability=synonyms&returnlimit=50&fullconcept=false&parentid=365437008",
					"host": [
						"{{serverUrl}}"
					],
					"path": [
						"api",
						"search",
						"search"
					],
					"query": [
						{
							"key": "term",
							"value": "dry st",
							"description": "Term/text or Concept ID to be searched. Example- fever, 22298006 "
						},
						{
							"key": "state",
							"value": "active",
							"description": "State of a component. Possible values - active, inactive, both. "
						},
						{
							"key": "semantictag",
							"value": "finding",
							"description": "The Semantic Tag in which SNOMED CT term/text or concept id will be searched. "
						},
						{
							"key": "acceptability",
							"value": "synonyms",
							"description": "Possible values - preferred, preferredexcludingfsn, synonyms, acceptable, all."
						},
						{
							"key": "returnlimit",
							"value": "50",
							"description": "Maximum number of matching terms to be fetched."
						},
						{
							"key": "fullconcept",
							"value": "false"
						},
						{
							"key": "parentid",
							"value": "365437008"
						}
					]
				}
			},
			"response": []
		},
		{
			"name": "Search - diet preference",
			"request": {
				"method": "GET",
				"header": [
					{
						"key": "apikey",
						"value": "{{apikey}}",
						"type": "text"
					}
				],
				"url": {
					"raw": "{{serverUrl}}/api/search/search?term=carbo&state=active&semantictag=finding&acceptability=synonyms&returnlimit=50&fullconcept=false&parentid=41829006",
					"host": [
						"{{serverUrl}}"
					],
					"path": [
						"api",
						"search",
						"search"
					],
					"query": [
						{
							"key": "term",
							"value": "carbo",
							"description": "Term/text or Concept ID to be searched. Example- fever, 22298006 "
						},
						{
							"key": "state",
							"value": "active",
							"description": "State of a component. Possible values - active, inactive, both. "
						},
						{
							"key": "semantictag",
							"value": "finding",
							"description": "The Semantic Tag in which SNOMED CT term/text or concept id will be searched. "
						},
						{
							"key": "acceptability",
							"value": "synonyms",
							"description": "Possible values - preferred, preferredexcludingfsn, synonyms, acceptable, all."
						},
						{
							"key": "returnlimit",
							"value": "50",
							"description": "Maximum number of matching terms to be fetched."
						},
						{
							"key": "fullconcept",
							"value": "false"
						},
						{
							"key": "parentid",
							"value": "41829006"
						}
					]
				}
			},
			"response": []
		}
	],
	"protocolProfileBehavior": {}
}