{
    "fields": [
      {
        "name": "PSE_STJ_SNDS",
        "type": "integer",
        "format": "default",
        "role": "code"
      },
      {
        "name": "PSE_STJ_LIB",
        "type": "string",
        "format": "default",
        "role": "label"
      }
    ],
    "missingValues": [],
    "name": "PSE_STJ_SNDS",
    "title": "Statut juridique du professonnel de santé exécutant (OPEN DAMIR)",
    "primaryKey": "PSE_STJ_SNDS"
  }