{
    "name": "T_RIPaaR3AD",
    "fields": [
        {
            "name": "ETA_NUM_EPMSI",
            "description": "N\u00b0 FINESS e-PMSI",
            "type": "string",
            "length": "9",
            "format": "default",
            "nomenclature": "-",
            "dateCreated": "2007",
            "dateDeleted": "nan",
            "dateMissing": [],
            "observation": "",
            "regle_gestion": "",
            "type_oracle": "string"
        },
        {
            "name": "ETA_NUM_TWO",
            "description": "Second n\u00b0 FINESS",
            "type": "string",
            "length": "9",
            "format": "default",
            "nomenclature": "-",
            "dateCreated": "2007",
            "dateDeleted": "nan",
            "dateMissing": [],
            "observation": "",
            "regle_gestion": "",
            "type_oracle": "string"
        },
        {
            "name": "SEJ_IDT",
            "description": "Identifiant de s\u00e9jour",
            "type": "string",
            "length": "5",
            "format": "default",
            "nomenclature": "-",
            "dateCreated": "2011",
            "dateDeleted": "nan",
            "dateMissing": [],
            "observation": "",
            "regle_gestion": "",
            "type_oracle": "string"
        },
        {
            "name": "IPP_IRR_CRY",
            "description": "Cryptage irreversible de l'IPP",
            "type": "string",
            "length": "16",
            "format": "default",
            "nomenclature": "-",
            "dateCreated": "2007",
            "dateDeleted": "nan",
            "dateMissing": [],
            "observation": "",
            "regle_gestion": "",
            "type_oracle": "string"
        },
        {
            "name": "ORD_NUM",
            "description": "N\u00b0 d'ordre",
            "type": "string",
            "length": "8",
            "format": "default",
            "nomenclature": "-",
            "dateCreated": "2007",
            "dateDeleted": "nan",
            "dateMissing": [],
            "observation": "",
            "regle_gestion": "",
            "type_oracle": "string"
        },
        {
            "name": "ASS_DGN",
            "description": "Diagnostics et facteurs associ\u00e9s",
            "type": "string",
            "length": "6",
            "format": "default",
            "nomenclature": "MS_CIM_V",
            "dateCreated": "2007",
            "dateDeleted": "nan",
            "dateMissing": [],
            "observation": "",
            "regle_gestion": "",
            "type_oracle": "string"
        }
    ],
    "title": "Diagnostic associ\u00e9 \u00e0 l'acte",
    "produit": "PMSI RIP",
    "history": {
        "dateCreated": "2007",
        "dateDeleted": "",
        "dateMissing": []
    },
    "champ": "Public et Priv\u00e9",
    "observation": "",
    "foreignKeys": [
        {
            "fields": [
                "ETA_NUM_EPMSI",
                "ORD_NUM",
                "SEJ_IDT"
            ],
            "reference": {
                "resource": "T_RIPaaR3A",
                "fields": [
                    "ETA_NUM_EPMSI",
                    "ORD_NUM",
                    "SEJ_IDT"
                ]
            }
        }
    ]
}