{
    "fields": [
        {
            "name": "GHS_NUM",
            "type": "integer",
            "format": "default",
            "role": "code"
        },
        {
            "name": "GHM_NUM",
            "type": "string",
            "format": "default"
        },
        {
            "name": "GHS_SEU_BAS",
            "type": "integer",
            "format": "default"
        },
        {
            "name": "GHS_SEU_HAU",
            "type": "integer",
            "format": "default"
        },
        {
            "name": "GHS_PRI",
            "type": "number",
            "format": "default"
        },
        {
            "name": "EXH_PRI",
            "type": "number",
            "format": "default"
        },
        {
            "name": "EHB_FOR",
            "type": "number",
            "format": "default"
        },
        {
            "name": "EHB_PRI",
            "type": "number",
            "format": "default"
        },
        {
            "name": "GHS_COE_MED",
            "type": "string",
            "format": "default"
        },
        {
            "name": "GHS_COE_DMI",
            "type": "string",
            "format": "default"
        }
    ],
    "missingValues": [
        ""
    ],
    "name": "IR_GHS_TA3_V",
    "title": "Tarifs GHS 2013",
    "primaryKey": [
        "GHS_NUM"
    ]
}