{
    "name": "T_MCOaaUM",
    "fields": [
        {
            "name": "ACT_RUM_NBR",
            "description": "Nombre de zones d'actes du RUM (Nb_Act_R_1)",
            "type": "integer",
            "length": "3.0",
            "format": "default",
            "nomenclature": "-",
            "dateCreated": "2010",
            "dateDeleted": "nan",
            "dateMissing": [],
            "observation": "",
            "regle_gestion": "",
            "type_oracle": "number"
        },
        {
            "name": "AGE_GES",
            "description": "Age gestationnel du RUM",
            "type": "integer",
            "length": "2.0",
            "format": "default",
            "nomenclature": "-",
            "dateCreated": "2014",
            "dateDeleted": "nan",
            "dateMissing": [],
            "observation": "",
            "regle_gestion": "",
            "type_oracle": "number"
        },
        {
            "name": "AUT_TYP1_UM",
            "description": "Premier type d'autorisation d'UM",
            "type": "string",
            "length": "4.0",
            "format": "default",
            "nomenclature": "-",
            "dateCreated": "2010",
            "dateDeleted": "nan",
            "dateMissing": [],
            "observation": "Chgt de format en 2013",
            "regle_gestion": "",
            "type_oracle": "string"
        },
        {
            "name": "AUT_TYP2_UM",
            "description": "Deuxi\u00e8me type d'autorisation d'UM",
            "type": "string",
            "length": "4.0",
            "format": "default",
            "nomenclature": "-",
            "dateCreated": "2010",
            "dateDeleted": "nan",
            "dateMissing": [],
            "observation": "Chgt de format en 2013",
            "regle_gestion": "",
            "type_oracle": "string"
        },
        {
            "name": "DGN_ASS_NBR",
            "description": "Nombre de diagnostics associ\u00e9s du RUM (Nb_DA_R_1)",
            "type": "integer",
            "length": "2.0",
            "format": "default",
            "nomenclature": "-",
            "dateCreated": "2010",
            "dateDeleted": "nan",
            "dateMissing": [],
            "observation": "",
            "regle_gestion": "",
            "type_oracle": "number"
        },
        {
            "name": "DGN_PAL",
            "description": "DP",
            "type": "string",
            "length": "6.0",
            "format": "default",
            "nomenclature": "MS_CIM_V",
            "dateCreated": "2008",
            "dateDeleted": "nan",
            "dateMissing": [],
            "observation": "",
            "regle_gestion": "",
            "type_oracle": "string"
        },
        {
            "name": "DGN_REL",
            "description": "DR",
            "type": "string",
            "length": "6.0",
            "format": "default",
            "nomenclature": "MS_CIM_V",
            "dateCreated": "2008",
            "dateDeleted": "nan",
            "dateMissing": [],
            "observation": "",
            "regle_gestion": "",
            "type_oracle": "string"
        },
        {
            "name": "ETA_NUM",
            "description": "Num\u00e9ro FINESS e-PMSI",
            "type": "string",
            "length": "9.0",
            "format": "default",
            "nomenclature": "-",
            "dateCreated": "2006",
            "dateDeleted": "nan",
            "dateMissing": [],
            "observation": "",
            "regle_gestion": "",
            "type_oracle": "string"
        },
        {
            "name": "ETA_NUM_GEO",
            "description": "Premier num\u00e9ro FINESS g\u00e9ographique",
            "type": "string",
            "length": "9.0",
            "format": "default",
            "nomenclature": "-",
            "dateCreated": "2013",
            "dateDeleted": "nan",
            "dateMissing": [],
            "observation": "",
            "regle_gestion": "",
            "type_oracle": "string"
        },
        {
            "name": "IGS2_COD",
            "description": "IGS2",
            "type": "string",
            "length": "3.0",
            "format": "default",
            "nomenclature": "-",
            "dateCreated": "2010",
            "dateDeleted": "nan",
            "dateMissing": [],
            "observation": "",
            "regle_gestion": "",
            "type_oracle": "string"
        },
        {
            "name": "PAR_DUR_SEJ",
            "description": "Dur\u00e9e s\u00e9jour partielle",
            "type": "integer",
            "length": "4.0",
            "format": "default",
            "nomenclature": "-",
            "dateCreated": "2010",
            "dateDeleted": "nan",
            "dateMissing": [],
            "observation": "",
            "regle_gestion": "",
            "type_oracle": "number"
        },
        {
            "name": "RSA_NUM",
            "description": "N\u00b0 d'index du RSA ",
            "type": "string",
            "length": "10.0",
            "format": "default",
            "nomenclature": "-",
            "dateCreated": "2006",
            "dateDeleted": "nan",
            "dateMissing": [],
            "observation": "",
            "regle_gestion": "",
            "type_oracle": "string"
        },
        {
            "name": "RSS_NUM",
            "description": "Num\u00e9ro de version du format du RSA",
            "type": "string",
            "length": "3.0",
            "format": "default",
            "nomenclature": "-",
            "dateCreated": "2006",
            "dateDeleted": "nan",
            "dateMissing": [],
            "observation": "",
            "regle_gestion": "",
            "type_oracle": "string"
        },
        {
            "name": "SUP_TYP1_NAT",
            "description": "Nature du suppl\u00e9ment pour le premier type",
            "type": "string",
            "length": "2.0",
            "format": "default",
            "nomenclature": "-",
            "dateCreated": "2010",
            "dateDeleted": "nan",
            "dateMissing": [],
            "observation": "",
            "regle_gestion": "",
            "type_oracle": "string"
        },
        {
            "name": "SUP_TYP1_NBR",
            "description": "Nombre de suppl\u00e9ment pour le premier type",
            "type": "integer",
            "length": "4.0",
            "format": "default",
            "nomenclature": "-",
            "dateCreated": "2010",
            "dateDeleted": "nan",
            "dateMissing": [],
            "observation": "",
            "regle_gestion": "",
            "type_oracle": "number"
        },
        {
            "name": "SUP_TYP2_NAT",
            "description": "Nature du suppl\u00e9ment pour le deuxi\u00e8me type",
            "type": "string",
            "length": "2.0",
            "format": "default",
            "nomenclature": "-",
            "dateCreated": "2010",
            "dateDeleted": "nan",
            "dateMissing": [],
            "observation": "",
            "regle_gestion": "",
            "type_oracle": "string"
        },
        {
            "name": "SUP_TYP2_NBR",
            "description": "Nombre de suppl\u00e9ment pour le deuxi\u00e8me type",
            "type": "integer",
            "length": "4.0",
            "format": "default",
            "nomenclature": "-",
            "dateCreated": "2010",
            "dateDeleted": "nan",
            "dateMissing": [],
            "observation": "",
            "regle_gestion": "",
            "type_oracle": "number"
        },
        {
            "name": "UM_ORD_NUM",
            "description": "N\u00b0 s\u00e9quentiel de RUM",
            "type": "integer",
            "length": "2.0",
            "format": "default",
            "nomenclature": "-",
            "dateCreated": "2010",
            "dateDeleted": "nan",
            "dateMissing": [],
            "observation": "",
            "regle_gestion": "",
            "type_oracle": "number"
        },
        {
            "name": "NUM_ANO_UM",
            "description": "Num\u00e9ro s\u00e9quentiel de l'UM",
            "type": "integer",
            "length": "4.0",
            "format": "default",
            "nomenclature": "-",
            "dateCreated": "2020",
            "dateDeleted": "nan",
            "dateMissing": [],
            "observation": "",
            "regle_gestion": "",
            "type_oracle": "number"
        },
        {
            "name": "RUM_ORD_NUM",
            "description": "Numero sequentiel du RUM",
            "type": "integer",
            "length": "2.0",
            "format": "default",
            "nomenclature": "-",
            "dateCreated": "2020",
            "dateDeleted": "nan",
            "dateMissing": [],
            "observation": "Il ne s'agit pas d'ne nouvelle variable, cette donn\u00e9e correspond \u00e0 la variable UM_ORD_NUM.Cette anomalie sera corrig\u00e9e pour la version annuelle.\r\n",
            "regle_gestion": "",
            "type_oracle": "number"
        },
        {
            "name": "DP_POS",
            "description": "Position du DP",
            "type": "string",
            "length": "nan",
            "format": "default",
            "nomenclature": "-",
            "dateCreated": "2006",
            "dateDeleted": "2007.0",
            "dateMissing": [],
            "observation": "",
            "regle_gestion": "",
            "type_oracle": "string"
        },
        {
            "name": "ETA_NUM_GEO1",
            "description": "Premier num\u00e9ro FINESS g\u00e9ographique",
            "type": "string",
            "length": "nan",
            "format": "default",
            "nomenclature": "-",
            "dateCreated": "2012",
            "dateDeleted": "2012.0",
            "dateMissing": [],
            "observation": "",
            "regle_gestion": "",
            "type_oracle": "string"
        },
        {
            "name": "ETA_NUM_GEO2",
            "description": "Deuxi\u00e8me num\u00e9ro FINESS g\u00e9ographique",
            "type": "string",
            "length": "nan",
            "format": "default",
            "nomenclature": "-",
            "dateCreated": "2012",
            "dateDeleted": "2012.0",
            "dateMissing": [],
            "observation": "",
            "regle_gestion": "",
            "type_oracle": "string"
        },
        {
            "name": "IND_SRC",
            "description": "Indicateur de SRC",
            "type": "string",
            "length": "nan",
            "format": "default",
            "nomenclature": "-",
            "dateCreated": "2009",
            "dateDeleted": "2009.0",
            "dateMissing": [],
            "observation": "",
            "regle_gestion": "",
            "type_oracle": "string"
        },
        {
            "name": "PAR_NBR_SEJ",
            "description": "Dur\u00e9e s\u00e9jour partielle",
            "type": "string",
            "length": "nan",
            "format": "default",
            "nomenclature": "-",
            "dateCreated": "2006",
            "dateDeleted": "2009.0",
            "dateMissing": [],
            "observation": "",
            "regle_gestion": "",
            "type_oracle": "string"
        },
        {
            "name": "UM_TYP",
            "description": "Type d'UM",
            "type": "string",
            "length": "nan",
            "format": "default",
            "nomenclature": "-",
            "dateCreated": "2006",
            "dateDeleted": "2009.0",
            "dateMissing": [],
            "observation": "",
            "regle_gestion": "",
            "type_oracle": "string"
        },
        {
            "name": "VAL_PAR",
            "description": "Valorisation partielle",
            "type": "string",
            "length": "nan",
            "format": "default",
            "nomenclature": "-",
            "dateCreated": "2006",
            "dateDeleted": "2009.0",
            "dateMissing": [],
            "observation": "",
            "regle_gestion": "",
            "type_oracle": "string"
        },
        {
            "name": "VAL_REA",
            "description": "Valorisation r\u00e9a",
            "type": "string",
            "length": "nan",
            "format": "default",
            "nomenclature": "-",
            "dateCreated": "2006",
            "dateDeleted": "2009.0",
            "dateMissing": [],
            "observation": "",
            "regle_gestion": "",
            "type_oracle": "string"
        }
    ],
    "title": "Unit\u00e9 m\u00e9dicale",
    "produit": "PMSI MCO",
    "history": {
        "dateCreated": "2006",
        "dateDeleted": "",
        "dateMissing": []
    },
    "champ": "Public et Priv\u00e9",
    "observation": "",
    "foreignKeys": [
        {
            "fields": [
                "ETA_NUM",
                "RSA_NUM"
            ],
            "reference": {
                "resource": "T_MCOaaB",
                "fields": [
                    "ETA_NUM",
                    "RSA_NUM"
                ]
            }
        }
    ]
}