{
    "name": "ER_CAM_F",
    "fields": [
        {
            "name": "CAM_ACT_COD",
            "description": "Code activit\u00e9",
            "type": "string",
            "length": "1.0",
            "format": "default",
            "nomenclature": "XC_ATE_V",
            "dateCreated": "2006",
            "dateDeleted": "",
            "dateMissing": [],
            "observation": "",
            "regle_gestion": "",
            "type_oracle": "string"
        },
        {
            "name": "CAM_ACT_PRU",
            "description": "Prix unitaire de la prestation affin\u00e9e CCAM",
            "type": "integer",
            "length": "9.2",
            "format": "default",
            "nomenclature": "-",
            "dateCreated": "2006",
            "dateDeleted": "",
            "dateMissing": [],
            "observation": "",
            "regle_gestion": "",
            "type_oracle": "number"
        },
        {
            "name": "CAM_ASS_COD",
            "description": "Code association",
            "type": "string",
            "length": "1.0",
            "format": "default",
            "nomenclature": "-",
            "dateCreated": "2006",
            "dateDeleted": "",
            "dateMissing": [],
            "observation": "",
            "regle_gestion": "",
            "type_oracle": "string"
        },
        {
            "name": "CAM_CAB_IND",
            "description": "Top suppl\u00e9ment de charge en cabinet",
            "type": "string",
            "length": "1.0",
            "format": "default",
            "nomenclature": "-",
            "dateCreated": "2006",
            "dateDeleted": "",
            "dateMissing": [],
            "observation": "",
            "regle_gestion": "",
            "type_oracle": "string"
        },
        {
            "name": "CAM_DOC_EXT",
            "description": "Extension documentaire",
            "type": "string",
            "length": "1.0",
            "format": "default",
            "nomenclature": "-",
            "dateCreated": "2006",
            "dateDeleted": "",
            "dateMissing": [],
            "observation": "",
            "regle_gestion": "",
            "type_oracle": "string"
        },
        {
            "name": "CAM_GRI_TAR",
            "description": "Grille tarifaire",
            "type": "string",
            "length": "3.0",
            "format": "default",
            "nomenclature": "-",
            "dateCreated": "2009",
            "dateDeleted": "",
            "dateMissing": [
                "2006",
                "2007",
                "2008"
            ],
            "observation": "",
            "regle_gestion": "",
            "type_oracle": "string"
        },
        {
            "name": "CAM_MI1_MNT",
            "description": "Montant Minoration due \u00e0 association sur Modificateur1",
            "type": "integer",
            "length": "9.2",
            "format": "default",
            "nomenclature": "-",
            "dateCreated": "2006",
            "dateDeleted": "",
            "dateMissing": [],
            "observation": "",
            "regle_gestion": "",
            "type_oracle": "number"
        },
        {
            "name": "CAM_MI2_MNT",
            "description": "Montant Minoration due \u00e0 association sur Modificateur2",
            "type": "integer",
            "length": "9.2",
            "format": "default",
            "nomenclature": "-",
            "dateCreated": "2006",
            "dateDeleted": "",
            "dateMissing": [],
            "observation": "",
            "regle_gestion": "",
            "type_oracle": "number"
        },
        {
            "name": "CAM_MI3_MNT",
            "description": "Montant Minoration due \u00e0 association sur Modificateur3",
            "type": "integer",
            "length": "9.2",
            "format": "default",
            "nomenclature": "-",
            "dateCreated": "2006",
            "dateDeleted": "",
            "dateMissing": [],
            "observation": "",
            "regle_gestion": "",
            "type_oracle": "number"
        },
        {
            "name": "CAM_MI4_MNT",
            "description": "Montant Minoration due \u00e0 association sur Modificateur4",
            "type": "integer",
            "length": "9.2",
            "format": "default",
            "nomenclature": "-",
            "dateCreated": "2006",
            "dateDeleted": "",
            "dateMissing": [],
            "observation": "",
            "regle_gestion": "",
            "type_oracle": "number"
        },
        {
            "name": "CAM_MM1_MNT",
            "description": "Montant Majoration Modificateur1",
            "type": "integer",
            "length": "9.2",
            "format": "default",
            "nomenclature": "-",
            "dateCreated": "2006",
            "dateDeleted": "",
            "dateMissing": [],
            "observation": "",
            "regle_gestion": "",
            "type_oracle": "number"
        },
        {
            "name": "CAM_MM2_MNT",
            "description": "Montant Majoration Modificateur2",
            "type": "integer",
            "length": "9.2",
            "format": "default",
            "nomenclature": "-",
            "dateCreated": "2006",
            "dateDeleted": "",
            "dateMissing": [],
            "observation": "",
            "regle_gestion": "",
            "type_oracle": "number"
        },
        {
            "name": "CAM_MM3_MNT",
            "description": "Montant Majoration Modificateur3",
            "type": "integer",
            "length": "9.2",
            "format": "default",
            "nomenclature": "-",
            "dateCreated": "2006",
            "dateDeleted": "",
            "dateMissing": [],
            "observation": "",
            "regle_gestion": "",
            "type_oracle": "number"
        },
        {
            "name": "CAM_MM4_MNT",
            "description": "Montant Majoration Modificateur4",
            "type": "integer",
            "length": "9.2",
            "format": "default",
            "nomenclature": "-",
            "dateCreated": "2006",
            "dateDeleted": "",
            "dateMissing": [],
            "observation": "",
            "regle_gestion": "",
            "type_oracle": "number"
        },
        {
            "name": "CAM_MOD_COD",
            "description": "Codes modificateurs",
            "type": "string",
            "length": "4.0",
            "format": "default",
            "nomenclature": "IR_MPS_V",
            "dateCreated": "2006",
            "dateDeleted": "",
            "dateMissing": [],
            "observation": "",
            "regle_gestion": "",
            "type_oracle": "string"
        },
        {
            "name": "CAM_MOD_NEW",
            "description": "Codes modificateurs",
            "type": "string",
            "length": "8.0",
            "format": "default",
            "nomenclature": "IR_MP2_V",
            "dateCreated": "",
            "dateDeleted": "",
            "dateMissing": [
                "2006",
                "2007",
                "2008",
                "2009",
                "2010",
                "2011",
                "2012"
            ],
            "observation": "",
            "regle_gestion": "",
            "type_oracle": "string"
        },
        {
            "name": "CAM_MPU_MNT",
            "description": "Montant Minoration due \u00e0 association sur PU de l' Acte",
            "type": "integer",
            "length": "9.2",
            "format": "default",
            "nomenclature": "-",
            "dateCreated": "2006",
            "dateDeleted": "",
            "dateMissing": [],
            "observation": "",
            "regle_gestion": "",
            "type_oracle": "number"
        },
        {
            "name": "CAM_NRM_MNT",
            "description": "Montant Non Rmb du \u00e0 annulation du tarif pr acte non rmb",
            "type": "integer",
            "length": "9.2",
            "format": "default",
            "nomenclature": "-",
            "dateCreated": "2006",
            "dateDeleted": "",
            "dateMissing": [],
            "observation": "",
            "regle_gestion": "",
            "type_oracle": "number"
        },
        {
            "name": "CAM_ORD_NUM",
            "description": "Num\u00e9ro d'ordre de la prestation affin\u00e9e CCAM",
            "type": "integer",
            "length": "3.0",
            "format": "default",
            "nomenclature": "-",
            "dateCreated": "2006",
            "dateDeleted": "",
            "dateMissing": [],
            "observation": "",
            "regle_gestion": "",
            "type_oracle": "number"
        },
        {
            "name": "CAM_PRS_IDE",
            "description": "Code de la prestation affin\u00e9e CCAM",
            "type": "string",
            "length": "13.0",
            "format": "default",
            "nomenclature": "-",
            "dateCreated": "2006",
            "dateDeleted": "",
            "dateMissing": [],
            "observation": "",
            "regle_gestion": "",
            "type_oracle": "string"
        },
        {
            "name": "CAM_QUA_DEN",
            "description": "Localisation dentaire",
            "type": "string",
            "length": "32.0",
            "format": "default",
            "nomenclature": "-",
            "dateCreated": "2006",
            "dateDeleted": "",
            "dateMissing": [],
            "observation": "",
            "regle_gestion": "",
            "type_oracle": "string"
        },
        {
            "name": "CAM_RED_MNT",
            "description": "Montant Reduction Tarif due \u00e0 paraticien non conventionn\u00e9",
            "type": "integer",
            "length": "9.2",
            "format": "default",
            "nomenclature": "IR_FOR_V",
            "dateCreated": "2006",
            "dateDeleted": "",
            "dateMissing": [],
            "observation": "",
            "regle_gestion": "",
            "type_oracle": "number"
        },
        {
            "name": "CAM_REM_BSE",
            "description": "Base de remboursement CCAM",
            "type": "integer",
            "length": "9.2",
            "format": "default",
            "nomenclature": "-",
            "dateCreated": "2006",
            "dateDeleted": "",
            "dateMissing": [],
            "observation": "",
            "regle_gestion": "",
            "type_oracle": "number"
        },
        {
            "name": "CAM_REM_COD",
            "description": "Code remboursement exceptionnel",
            "type": "string",
            "length": "1.0",
            "format": "default",
            "nomenclature": "-",
            "dateCreated": "2006",
            "dateDeleted": "",
            "dateMissing": [],
            "observation": "",
            "regle_gestion": "",
            "type_oracle": "string"
        },
        {
            "name": "CAM_SUP_MNT",
            "description": "Montant Supplement de Charge en Cabinet",
            "type": "integer",
            "length": "9.2",
            "format": "default",
            "nomenclature": "-",
            "dateCreated": "2006",
            "dateDeleted": "",
            "dateMissing": [],
            "observation": "",
            "regle_gestion": "",
            "type_oracle": "number"
        },
        {
            "name": "CAM_TRT_PHA",
            "description": "Phase de traitement",
            "type": "integer",
            "length": "2.0",
            "format": "default",
            "nomenclature": "XC_PHA_V",
            "dateCreated": "2006",
            "dateDeleted": "",
            "dateMissing": [],
            "observation": "",
            "regle_gestion": "",
            "type_oracle": "number"
        },
        {
            "name": "DCT_ORD_NUM",
            "description": "Num\u00e9ro d'ordre du d\u00e9compte dans l'organisme",
            "type": "integer",
            "length": "9.0",
            "format": "default",
            "nomenclature": "-",
            "dateCreated": "2006",
            "dateDeleted": "",
            "dateMissing": [],
            "observation": "",
            "regle_gestion": "",
            "type_oracle": "number"
        },
        {
            "name": "FLX_DIS_DTD",
            "description": "Date de mise \u00e0 disposition des donn\u00e9es",
            "type": "date",
            "length": "20.0",
            "format": "default",
            "nomenclature": "IR_DTE_V",
            "dateCreated": "2006",
            "dateDeleted": "",
            "dateMissing": [],
            "observation": "",
            "regle_gestion": "",
            "type_oracle": "date"
        },
        {
            "name": "FLX_EMT_NUM",
            "description": "Num\u00e9ro d'\u00e9metteur du flux",
            "type": "integer",
            "length": "4.0",
            "format": "default",
            "nomenclature": "IR_NEM_T",
            "dateCreated": "2006",
            "dateDeleted": "",
            "dateMissing": [],
            "observation": "",
            "regle_gestion": "",
            "type_oracle": "number"
        },
        {
            "name": "FLX_EMT_ORD",
            "description": "Num\u00e9ro de s\u00e9quence du flux",
            "type": "integer",
            "length": "4.0",
            "format": "default",
            "nomenclature": "-",
            "dateCreated": "2006",
            "dateDeleted": "",
            "dateMissing": [],
            "observation": "",
            "regle_gestion": "",
            "type_oracle": "number"
        },
        {
            "name": "FLX_EMT_TYP",
            "description": "Type d'\u00e9metteur",
            "type": "integer",
            "length": "3.0",
            "format": "default",
            "nomenclature": "IR_TYT_V",
            "dateCreated": "2006",
            "dateDeleted": "",
            "dateMissing": [],
            "observation": "",
            "regle_gestion": "",
            "type_oracle": "number"
        },
        {
            "name": "FLX_TRT_DTD",
            "description": "Date d'entr\u00e9e des donn\u00e9es dans le syst\u00e8me d'information",
            "type": "date",
            "length": "20.0",
            "format": "default",
            "nomenclature": "IR_DTE_V",
            "dateCreated": "2006",
            "dateDeleted": "",
            "dateMissing": [],
            "observation": "",
            "regle_gestion": "",
            "type_oracle": "date"
        },
        {
            "name": "ORG_CLE_NEW",
            "description": "Organisme de liquidation des prestations (apr\u00e8s fusion)",
            "type": "string",
            "length": "9.0",
            "format": "default",
            "nomenclature": "IR_ORG_V",
            "dateCreated": "2008",
            "dateDeleted": "",
            "dateMissing": [
                "2006",
                "2007"
            ],
            "observation": "",
            "regle_gestion": "",
            "type_oracle": "string"
        },
        {
            "name": "ORG_CLE_NUM",
            "description": "Ancien organisme avant fusion (jusqu\u2019au jour J de la fusion)",
            "type": "string",
            "length": "9.0",
            "format": "default",
            "nomenclature": "IR_ORG_V",
            "dateCreated": "2006",
            "dateDeleted": "",
            "dateMissing": [],
            "observation": "",
            "regle_gestion": "",
            "type_oracle": "string"
        },
        {
            "name": "PRS_ORD_NUM",
            "description": "Num\u00e9ro d'ordre de la prestation dans le d\u00e9compte",
            "type": "integer",
            "length": "5.0",
            "format": "default",
            "nomenclature": "-",
            "dateCreated": "2006",
            "dateDeleted": "",
            "dateMissing": [],
            "observation": "",
            "regle_gestion": "",
            "type_oracle": "number"
        },
        {
            "name": "REM_TYP_AFF",
            "description": "Type de remboursement affin\u00e9",
            "type": "integer",
            "length": "1.0",
            "format": "default",
            "nomenclature": "IR_ASS_V",
            "dateCreated": "2006",
            "dateDeleted": "",
            "dateMissing": [],
            "observation": "",
            "regle_gestion": "",
            "type_oracle": "number"
        }
    ],
    "title": "Codage CCAM",
    "produit": "DCIR",
    "history": {
        "dateCreated": "",
        "dateDeleted": "",
        "dateMissing": []
    },
    "champ": "",
    "observation": "",
    "foreignKeys": [
        {
            "fields": [
                "DCT_ORD_NUM",
                "FLX_DIS_DTD",
                "FLX_EMT_NUM",
                "FLX_EMT_ORD",
                "FLX_EMT_TYP",
                "FLX_TRT_DTD",
                "ORG_CLE_NUM",
                "PRS_ORD_NUM",
                "REM_TYP_AFF"
            ],
            "reference": {
                "resource": "ER_PRS_F",
                "fields": [
                    "DCT_ORD_NUM",
                    "FLX_DIS_DTD",
                    "FLX_EMT_NUM",
                    "FLX_EMT_ORD",
                    "FLX_EMT_TYP",
                    "FLX_TRT_DTD",
                    "ORG_CLE_NUM",
                    "PRS_ORD_NUM",
                    "REM_TYP_AFF"
                ]
            }
        }
    ]
}