{
    "fields": [
        {
            "name": "ATC3",
            "type": "string",
            "format": "default",
            "role": "code"
        },
        {
            "name": "Libellé ATC3",
            "type": "string",
            "format": "default",
            "role": "label"
        }
    ],
    "missingValues": [
        ""
    ],
    "name": "openmedic_ATC3",
    "title": "Libellé ATC3",
    "primaryKey": "ATC3"
}