INV_SDV_COD;GRG_COD;URC_ARH_COD;ORG_CAI_NUM;ORG_BSE_NUM;COL_TRI;COL_COM;INV_SDV_LIB
316;1;0;711;01C711;139;;RG : CPAM Macon - hors SLM
315;1;0;491;01C491;140;;RG : CPAM Maine-et-Loire
316;1;0;491;01C491;141;;RG : CPAM Maine-et-Loire - hors SLM
315;1;0;131;01C131;142;;RG : CPAM Marseille
316;1;0;131;01C131;143;;RG : CPAM Marseille - hors SLM
315;1;0;771;01C771;144;;RG : CPAM Melun
316;1;0;771;01C771;145;;RG : CPAM Melun - hors SLM
315;1;0;770;01C770;146;;RG : CPAM Melun (expatries)
316;1;0;770;01C770;147;;RG : CPAM Melun (expatries) - hors SLM
315;1;0;481;01C481;148;;RG : CPAM Mende
316;1;0;481;01C481;149;;RG : CPAM Mende - hors SLM
315;1;0;821;01C821;150;;RG : CPAM Montauban
316;1;0;821;01C821;151;;RG : CPAM Montauban - hors SLM
315;1;0;401;01C401;152;;RG : CPAM Mont-de-Marsan
316;1;0;401;01C401;153;;RG : CPAM Mont-de-Marsan - hors SLM
315;1;0;031;01C031;154;;RG : CPAM Moulins
316;1;0;031;01C031;155;;RG : CPAM Moulins - hors SLM
315;1;0;921;01C921;156;;RG : CPAM Nanterre
316;1;0;921;01C921;157;;RG : CPAM Nanterre - hors SLM
315;1;0;581;01C581;158;;RG : CPAM Nevers
316;1;0;581;01C581;159;;RG : CPAM Nevers - hors SLM
315;1;0;061;01C061;160;;RG : CPAM Nice
316;1;0;061;01C061;161;;RG : CPAM Nice - hors SLM
315;1;0;301;01C301;162;;RG : CPAM Nimes
316;1;0;301;01C301;163;;RG : CPAM Nimes - hors SLM
315;1;0;791;01C791;164;;RG : CPAM Niort
316;1;0;791;01C791;165;;RG : CPAM Niort - hors SLM
315;1;0;451;01C451;166;;RG : CPAM Orleans
316;1;0;451;01C451;167;;RG : CPAM Orleans - hors SLM
315;1;0;751;01C751;168;;RG : CPAM Paris
316;1;0;751;01C751;169;;RG : CPAM Paris - hors SLM
315;1;0;642;01C642;170;;RG : CPAM Pau
316;1;0;642;01C642;171;;RG : CPAM Pau - hors SLM
315;1;0;241;01C241;172;;RG : CPAM Perigueux
316;1;0;241;01C241;173;;RG : CPAM Perigueux - hors SLM
315;1;0;661;01C661;174;;RG : CPAM Perpignan
316;1;0;661;01C661;175;;RG : CPAM Perpignan - hors SLM
315;1;0;861;01C861;176;;RG : CPAM Poitiers
316;1;0;861;01C861;177;;RG : CPAM Poitiers - hors SLM
315;1;0;951;01C951;178;;RG : CPAM Pontoise
316;1;0;951;01C951;179;;RG : CPAM Pontoise - hors SLM
315;1;0;511;01C511;180;;RG : CPAM Reims
316;1;0;511;01C511;181;;RG : CPAM Reims - hors SLM
315;1;0;351;01C351;182;;RG : CPAM Rennes
316;1;0;351;01C351;183;;RG : CPAM Rennes - hors SLM
315;1;0;121;01C121;184;;RG : CPAM Rodez
316;1;0;121;01C121;185;;RG : CPAM Rodez - hors SLM
316;1;0;764;01C764;186;;RG : CPAM Rouen-Elbeuf-Dieppe-Seine-Maritime - hors SLM
315;1;0;221;01C221;187;;RG : CPAM Saint-Brieuc
316;1;0;221;01C221;188;;RG : CPAM Saint-Brieuc - hors SLM
315;1;0;501;01C501;189;;RG : CPAM Saint-Lo
316;1;0;501;01C501;190;;RG : CPAM Saint-Lo - hors SLM
315;1;0;651;01C651;191;;RG : CPAM Tarbes
316;1;0;651;01C651;192;;RG : CPAM Tarbes - hors SLM
315;1;0;831;01C831;193;;RG : CPAM Toulon
316;1;0;831;01C831;194;;RG : CPAM Toulon - hors SLM
315;1;0;311;01C311;195;;RG : CPAM Toulouse
316;1;0;311;01C311;196;;RG : CPAM Toulouse - hors SLM
315;1;0;371;01C371;197;;RG : CPAM Tours
316;1;0;371;01C371;198;;RG : CPAM Tours - hors SLM
315;1;0;101;01C101;199;;RG : CPAM Troyes
316;1;0;101;01C101;200;;RG : CPAM Troyes - hors SLM
315;1;0;191;01C191;201;;RG : CPAM Tulle
316;1;0;191;01C191;202;;RG : CPAM Tulle - hors SLM
315;1;0;261;01C261;203;;RG : CPAM Valence
316;1;0;261;01C261;204;;RG : CPAM Valence - hors SLM
315;1;0;561;01C561;205;;RG : CPAM Vannes
316;1;0;561;01C561;206;;RG : CPAM Vannes - hors SLM
315;1;0;781;01C781;207;;RG : CPAM Versailles
316;1;0;781;01C781;208;;RG : CPAM Versailles - hors SLM
315;1;0;701;01C701;209;;RG : CPAM Vesoul
316;1;0;701;01C701;210;;RG : CPAM Vesoul - hors SLM
315;1;0;973;01C973;211;;RG : CGSS  Cayenne
316;1;0;973;01C973;212;;RG : CGSS  Cayenne - hors SLM
315;1;0;972;01C972;213;;RG : CGSS  Fort-de-France
316;1;0;972;01C972;214;;RG : CGSS  Fort-de-France - hors SLM
315;1;0;971;01C971;215;;RG : CGSS  Pointe-a-Pitre
316;1;0;971;01C971;216;;RG : CGSS  Pointe-a-Pitre - hors SLM
315;1;0;974;01C974;217;;RG : CGSS  Saint-Denis
316;1;0;974;01C974;218;;RG : CGSS  Saint-Denis - hors SLM
315;1;0;976;01C976;219;;RG : CSS  Mayotte
316;1;0;976;01C976;220;;RG : CSS  Mayotte - hors SLM
331;3;0;000;000000;221;;RSI : France entière
333;3;0;000;000000;222;;RSI : France hors DOM
332;3;0;003;03A003;223;;RSI Alsace
332;3;0;058;03A058;224;;RSI Antilles-Guyane
332;3;0;005;03A005;225;;RSI Aquitaine
332;3;0;007;03A007;226;;RSI Auvergne
332;3;0;029;03A029;227;;RSI Basse-Normandie
332;3;0;009;03A009;228;;RSI Bourgogne
332;3;0;011;03A011;229;;RSI Bretagne
332;3;0;013;03A013;230;;RSI Centre
332;3;0;015;03A015;231;;RSI Champagne-Ardenne
332;3;0;057;03A057;232;;RSI Corse
332;3;0;017;03A017;233;;RSI Côte d Azur
332;3;0;001;03A001;234;;RSI des Alpes
332;3;0;019;03A019;235;;RSI Franche-Comté
332;3;0;031;03A031;236;;RSI Haute-Normandie
332;3;0;052;03A052;237;;RSI Ile-de-France Centre
332;3;0;048;03A048;238;;RSI Ile-de-France Est
332;3;0;046;03A046;239;;RSI Ile-de-France Ouest
332;3;0;021;03A021;240;;RSI Languedoc-Roussillon
332;3;0;023;03A023;241;;RSI Limousin
332;3;0;025;03A025;242;;RSI Lorraine
332;3;0;027;03A027;243;;RSI Midi-Pyrénées
332;3;0;034;03A034;244;;RSI Nord Pas-de-Calais
332;3;0;037;03A037;245;;RSI Pays de la Loire
332;3;0;039;03A039;246;;RSI Picardie
332;3;0;041;03A041;247;;RSI Poitou-Charentes
332;3;0;053;03A053;248;;RSI Professions Libérales Ile-de-France
332;3;0;054;03A054;249;;RSI Professions Libérales Province
332;3;0;043;03A043;250;;RSI Provence Alpes
332;3;0;059;03A059;251;;RSI Réunion
332;3;0;045;03A045;252;;RSI Rhône
340;4;0;000;000000;253;;SNCF : France entière
340;5;0;000;000000;254;;RATP : France entière
340;6;0;000;000000;255;;ENIM : France entière
340;7;0;000;000000;256;;CANSSM : France entière
340;8;0;000;000000;257;;CNMSS : France entière
340;10;0;000;000000;258;;CRPCEN : France entière
340;12;0;000;000000;259;;CCIP : France entière
340;14;0;000;000000;260;;ASS. NAT. : France entière
340;15;0;000;000000;261;;SENAT : France entière
340;16;0;000;000000;262;;PORT. AUTO : France entière
340;90;0;000;000000;263;;CAVIMAC : France entière
316;1;0;321;01C321;20;;RG : CPAM Auch - hors SLM
315;1;0;151;01C151;21;;RG : CPAM Aurillac
316;1;0;151;01C151;22;;RG : CPAM Aurillac - hors SLM
315;1;0;891;01C891;23;;RG : CPAM Auxerre
316;1;0;891;01C891;24;;RG : CPAM Auxerre - hors SLM
315;1;0;841;01C841;25;;RG : CPAM Avignon
316;1;0;841;01C841;26;;RG : CPAM Avignon - hors SLM
315;1;0;551;01C551;27;;RG : CPAM Bar-le-Duc
316;1;0;551;01C551;28;;RG : CPAM Bar-le-Duc - hors SLM
315;1;0;202;01C202;29;;RG : CPAM Bastia
316;1;0;202;01C202;30;;RG : CPAM Bastia - hors SLM
315;1;0;641;01C641;31;;RG : CPAM Bayonne
316;1;0;641;01C641;32;;RG : CPAM Bayonne - hors SLM
315;1;0;901;01C901;33;;RG : CPAM Belfort
316;1;0;901;01C901;34;;RG : CPAM Belfort - hors SLM
315;1;0;411;01C411;35;;RG : CPAM Blois
316;1;0;411;01C411;36;;RG : CPAM Blois - hors SLM
315;1;0;931;01C931;37;;RG : CPAM Bobigny
316;1;0;931;01C931;38;;RG : CPAM Bobigny - hors SLM
315;1;0;331;01C331;39;;RG : CPAM Bordeaux
316;1;0;331;01C331;40;;RG : CPAM Bordeaux - hors SLM
315;1;0;011;01C011;41;;RG : CPAM Bourg-en-Bresse
316;1;0;011;01C011;42;;RG : CPAM Bourg-en-Bresse - hors SLM
315;1;0;181;01C181;43;;RG : CPAM Bourges
316;1;0;181;01C181;44;;RG : CPAM Bourges - hors SLM
315;1;0;141;01C141;45;;RG : CPAM Caen
316;1;0;141;01C141;46;;RG : CPAM Caen - hors SLM
315;1;0;461;01C461;47;;RG : CPAM Cahors
316;1;0;461;01C461;48;;RG : CPAM Cahors - hors SLM
315;1;0;111;01C111;49;;RG : CPAM Carcassonne
316;1;0;111;01C111;50;;RG : CPAM Carcassonne - hors SLM
315;1;0;731;01C731;51;;RG : CPAM Chambery
316;1;0;731;01C731;52;;RG : CPAM Chambery - hors SLM
315;1;0;081;01C081;53;;RG : CPAM Charleville-Mezieres
316;1;0;081;01C081;54;;RG : CPAM Charleville-Mezieres - hors SLM
315;1;0;281;01C281;55;;RG : CPAM Chartres
316;1;0;281;01C281;56;;RG : CPAM Chartres - hors SLM
315;1;0;361;01C361;57;;RG : CPAM Chateauroux
316;1;0;361;01C361;58;;RG : CPAM Chateauroux - hors SLM
315;1;0;521;01C521;59;;RG : CPAM Chaumont
316;1;0;521;01C521;60;;RG : CPAM Chaumont - hors SLM
315;1;0;631;01C631;61;;RG : CPAM Clermont-Ferrand
316;1;0;631;01C631;62;;RG : CPAM Clermont-Ferrand - hors SLM
315;1;0;941;01C941;63;;RG : CPAM Creteil
316;1;0;941;01C941;64;;RG : CPAM Creteil - hors SLM
315;1;0;623;01C623;65;;RG : CPAM de la Côte d'Opale
316;1;0;623;01C623;66;;RG : CPAM de la Côte d'Opale - hors SLM
315;1;0;422;01C422;67;;RG : CPAM de la Loire
316;1;0;422;01C422;68;;RG : CPAM de la Loire - hors SLM
315;1;0;021;01C021;69;;RG : CPAM de l'Aisne
316;1;0;021;01C021;70;;RG : CPAM de l'Aisne - hors SLM
315;1;0;072;01C072;71;;RG : CPAM de l'Ardèche
316;1;0;072;01C072;72;;RG : CPAM de l'Ardèche - hors SLM
315;1;0;624;01C624;73;;RG : CPAM de l'Artois
316;1;0;624;01C624;74;;RG : CPAM de l'Artois - hors SLM
315;1;0;342;01C342;75;;RG : CPAM de l'Hérault
316;1;0;342;01C342;76;;RG : CPAM de l'Hérault - hors SLM
315;1;0;595;01C595;77;;RG : CPAM de Lille-Douai
316;1;0;595;01C595;78;;RG : CPAM de Lille-Douai - hors SLM
315;1;0;381;01C381;79;;RG : CPAM de l'Isère
316;1;0;381;01C381;80;;RG : CPAM de l'Isère - hors SLM
315;1;0;441;01C441;81;;RG : CPAM de Loire-Atlantique
316;1;0;441;01C441;82;;RG : CPAM de Loire-Atlantique - hors SLM
315;1;0;601;01C601;83;;RG : CPAM de l'Oise
316;1;0;601;01C601;84;;RG : CPAM de l'Oise - hors SLM
315;1;0;542;01C542;85;;RG : CPAM de Meurthe-et-Moselle
316;1;0;542;01C542;86;;RG : CPAM de Meurthe-et-Moselle - hors SLM
315;1;0;571;01C571;87;;RG : CPAM de Moselle
316;1;0;571;01C571;88;;RG : CPAM de Moselle - hors SLM
315;1;0;597;01C597;89;;RG : CPAM de Roubaix-Tourcoing
316;1;0;597;01C597;90;;RG : CPAM de Roubaix-Tourcoing - hors SLM
315;1;0;764;01C764;91;;RG : CPAM de Rouen-Elbeuf-Dieppe-Seine-Maritime
315;1;0;594;01C594;92;;RG : CPAM des Flandres-Dunkerque-Armentières
316;1;0;594;01C594;93;;RG : CPAM des Flandres-Dunkerque-Armentières - hors SLM
315;1;0;041;01C041;94;;RG : CPAM Digne
316;1;0;041;01C041;95;;RG : CPAM Digne - hors SLM
315;1;0;211;01C211;96;;RG : CPAM Dijon
316;1;0;211;01C211;97;;RG : CPAM Dijon - hors SLM
315;1;0;673;01C673;98;;RG : CPAM du Bas-Rhin
316;1;0;673;01C673;99;;RG : CPAM du Bas-Rhin - hors SLM
315;1;0;251;01C251;100;;RG : CPAM du Doubs
316;1;0;251;01C251;101;;RG : CPAM du Doubs - hors SLM
315;1;0;291;01C291;102;;RG : CPAM du Finistère
316;1;0;291;01C291;103;;RG : CPAM du Finistère - hors SLM
315;1;0;599;01C599;104;;RG : CPAM du Hainaut
316;1;0;599;01C599;105;;RG : CPAM du Hainaut - hors SLM
315;1;0;682;01C682;106;;RG : CPAM du Haut-Rhin
316;1;0;682;01C682;107;;RG : CPAM du Haut-Rhin - hors SLM
315;1;0;691;01C691;108;;RG : CPAM du Rhône
316;1;0;691;01C691;109;;RG : CPAM du Rhône - hors SLM
315;1;0;881;01C881;110;;RG : CPAM Epinal
316;1;0;881;01C881;111;;RG : CPAM Epinal - hors SLM
315;1;0;271;01C271;112;;RG : CPAM Evreux
316;1;0;271;01C271;113;;RG : CPAM Evreux - hors SLM
315;1;0;911;01C911;114;;RG : CPAM Evry
316;1;0;911;01C911;115;;RG : CPAM Evry - hors SLM
315;1;0;091;01C091;116;;RG : CPAM Foix
316;1;0;091;01C091;117;;RG : CPAM Foix - hors SLM
315;1;0;051;01C051;118;;RG : CPAM Gap
316;1;0;051;01C051;119;;RG : CPAM Gap - hors SLM
315;1;0;231;01C231;120;;RG : CPAM Gueret
316;1;0;231;01C231;121;;RG : CPAM Gueret - hors SLM
315;1;0;171;01C171;122;;RG : CPAM La Rochelle
316;1;0;171;01C171;123;;RG : CPAM La Rochelle - hors SLM
315;1;0;851;01C851;124;;RG : CPAM La Roche-sur-Yon
316;1;0;851;01C851;125;;RG : CPAM La Roche-sur-Yon - hors SLM
315;1;0;531;01C531;126;;RG : CPAM Laval
316;1;0;531;01C531;127;;RG : CPAM Laval - hors SLM
315;1;0;763;01C763;128;;RG : CPAM Le Havre
316;1;0;763;01C763;129;;RG : CPAM Le Havre - hors SLM
315;1;0;721;01C721;130;;RG : CPAM Le Mans
316;1;0;721;01C721;131;;RG : CPAM Le Mans - hors SLM
315;1;0;431;01C431;132;;RG : CPAM Le Puy
316;1;0;431;01C431;133;;RG : CPAM Le Puy - hors SLM
315;1;0;871;01C871;134;;RG : CPAM Limoges
316;1;0;871;01C871;135;;RG : CPAM Limoges - hors SLM
315;1;0;391;01C391;136;;RG : CPAM Lons-le-Saunier
316;1;0;391;01C391;137;;RG : CPAM Lons-le-Saunier - hors SLM
315;1;0;711;01C711;138;;RG : CPAM Macon
311;1;0;000;000000;1;;RG :  France entière
312;1;0;000;000000;2;;RG :  France hors DOM
313;1;0;000;000000;3;;RG :  France entière hors SLM
314;1;0;000;000000;4;;RG :  France hors DOM hors SLM
315;1;0;471;01C471;5;;RG : CPAM Agen
316;1;0;471;01C471;6;;RG : CPAM Agen - hors SLM
315;1;0;201;01C201;7;;RG : CPAM Ajaccio
316;1;0;201;01C201;8;;RG : CPAM Ajaccio - hors SLM
315;1;0;811;01C811;9;;RG : CPAM Albi
316;1;0;811;01C811;10;;RG : CPAM Albi - hors SLM
315;1;0;611;01C611;11;;RG : CPAM Alencon
316;1;0;611;01C611;12;;RG : CPAM Alencon - hors SLM
315;1;0;801;01C801;13;;RG : CPAM Amiens
316;1;0;801;01C801;14;;RG : CPAM Amiens - hors SLM
315;1;0;161;01C161;15;;RG : CPAM Angouleme
316;1;0;161;01C161;16;;RG : CPAM Angouleme - hors SLM
315;1;0;741;01C741;17;;RG : CPAM Annecy
316;1;0;741;01C741;18;;RG : CPAM Annecy - hors SLM
315;1;0;321;01C321;19;;RG : CPAM Auch
