{
    "fields": [
        {
            "name": "PRS_NAT",
            "type": "integer",
            "format": "default",
            "role": "code"
        },
        {
            "name": "PFS_SPE_COD",
            "type": "integer",
            "format": "default"
        }
    ],
    "missingValues": [
        ""
    ],
    "name": "IR_NAT_SPE_C",
    "title": "Compatibilite Nature de Prestation _ Specialite PS Executant",
    "primaryKey": [
        "PRS_NAT", "PFS_SPE_COD"
    ]
}