{
    "name": "IR_BEN_R",
    "fields": [
        {
            "name": "ASS_NIR_ANO",
            "description": "NIR anonyme de l'assur\u00e9",
            "type": "string",
            "length": "17",
            "format": "default",
            "nomenclature": "-",
            "dateCreated": "",
            "dateDeleted": "",
            "dateMissing": [],
            "observation": "",
            "regle_gestion": "",
            "type_oracle": "string"
        },
        {
            "name": "BEN_CDI_NIR",
            "description": "Code d'identification du NIR",
            "type": "string",
            "length": "2",
            "format": "default",
            "nomenclature": "IR_NIR_V",
            "dateCreated": "",
            "dateDeleted": "",
            "dateMissing": [],
            "observation": "",
            "regle_gestion": "",
            "type_oracle": "string"
        },
        {
            "name": "BEN_DCD_AME",
            "description": "Ann\u00e9e et mois de d\u00e9c\u00e8s du b\u00e9n\u00e9ficiaire",
            "type": "date",
            "length": "6",
            "format": "default",
            "nomenclature": "IR_MOI_V",
            "dateCreated": "",
            "dateDeleted": "",
            "dateMissing": [],
            "observation": "",
            "regle_gestion": "",
            "type_oracle": "string"
        },
        {
            "name": "BEN_DCD_DTE",
            "description": "Date de d\u00e9c\u00e8s du b\u00e9n\u00e9ficiaire (jour + mois + ann\u00e9e)",
            "type": "date",
            "length": "20",
            "format": "default",
            "nomenclature": "IR_DTE_V",
            "dateCreated": "",
            "dateDeleted": "",
            "dateMissing": [],
            "observation": "",
            "regle_gestion": "",
            "type_oracle": "date"
        },
        {
            "name": "BEN_DTE_INS",
            "description": "Date d'insertion",
            "type": "date",
            "length": "20",
            "format": "default",
            "nomenclature": "IR_DTE_V",
            "dateCreated": "",
            "dateDeleted": "",
            "dateMissing": [],
            "observation": "",
            "regle_gestion": "",
            "type_oracle": "string"
        },
        {
            "name": "BEN_DTE_MAJ",
            "description": "Date de mise \u00e0 jour",
            "type": "date",
            "length": "20",
            "format": "default",
            "nomenclature": "IR_DTE_V",
            "dateCreated": "",
            "dateDeleted": "",
            "dateMissing": [],
            "observation": "",
            "regle_gestion": "",
            "type_oracle": "date"
        },
        {
            "name": "BEN_IDT_ANO",
            "description": "Identifiant b\u00e9n\u00e9ficiaire anonymis\u00e9",
            "type": "string",
            "length": "18",
            "format": "default",
            "nomenclature": "-",
            "dateCreated": "",
            "dateDeleted": "",
            "dateMissing": [],
            "observation": "",
            "regle_gestion": "",
            "type_oracle": "string"
        },
        {
            "name": "BEN_IDT_MAJ",
            "description": "Date d'alimentation du NIR BEN_NIR_ANO",
            "type": "date",
            "length": "20",
            "format": "default",
            "nomenclature": "IR_DTE_V",
            "dateCreated": "",
            "dateDeleted": "",
            "dateMissing": [],
            "observation": "",
            "regle_gestion": "",
            "type_oracle": "date"
        },
        {
            "name": "BEN_IDT_TOP",
            "description": "Top identifiant b\u00e9n\u00e9ficiaire Anonymis\u00e9",
            "type": "integer",
            "length": "2",
            "format": "default",
            "nomenclature": "-",
            "dateCreated": "",
            "dateDeleted": "",
            "dateMissing": [],
            "observation": "",
            "regle_gestion": "",
            "type_oracle": "number"
        },
        {
            "name": "BEN_NAI_ANN",
            "description": "Ann\u00e9e de naissance du b\u00e9n\u00e9ficiaire",
            "type": "string",
            "length": "4",
            "format": "default",
            "nomenclature": "IR_ANN_V",
            "dateCreated": "",
            "dateDeleted": "",
            "dateMissing": [],
            "observation": "",
            "regle_gestion": "",
            "type_oracle": "string"
        },
        {
            "name": "BEN_NAI_MOI",
            "description": "Mois de naissance du b\u00e9n\u00e9ficiaire",
            "type": "date",
            "length": "2",
            "format": "default",
            "nomenclature": "-",
            "dateCreated": "",
            "dateDeleted": "",
            "dateMissing": [],
            "observation": "",
            "regle_gestion": "",
            "type_oracle": "string"
        },
        {
            "name": "BEN_NIR_ANO",
            "description": "NIR anonyme du b\u00e9n\u00e9ficiaire",
            "type": "string",
            "length": "17",
            "format": "default",
            "nomenclature": "-",
            "dateCreated": "",
            "dateDeleted": "",
            "dateMissing": [],
            "observation": "",
            "regle_gestion": "",
            "type_oracle": "string"
        },
        {
            "name": "BEN_NIR_PSA",
            "description": "Identifiant anonyme du patient dans le SNIIRAM",
            "type": "string",
            "length": "17",
            "format": "default",
            "nomenclature": "-",
            "dateCreated": "",
            "dateDeleted": "",
            "dateMissing": [],
            "observation": "",
            "regle_gestion": "",
            "type_oracle": "string"
        },
        {
            "name": "BEN_RES_COM",
            "description": "Commune de r\u00e9sidence du b\u00e9n\u00e9ficiaire",
            "type": "string",
            "length": "3",
            "format": "default",
            "nomenclature": "IR_GEO_V",
            "dateCreated": "",
            "dateDeleted": "",
            "dateMissing": [],
            "observation": "",
            "regle_gestion": "",
            "type_oracle": "string"
        },
        {
            "name": "BEN_RES_DPT",
            "description": "D\u00e9partement de r\u00e9sidence du b\u00e9n\u00e9ficiaire",
            "type": "string",
            "length": "3",
            "format": "default",
            "nomenclature": "IR_DPT_V",
            "dateCreated": "",
            "dateDeleted": "",
            "dateMissing": [],
            "observation": "",
            "regle_gestion": "",
            "type_oracle": "string"
        },
        {
            "name": "BEN_RNG_GEM",
            "description": "Rang du b\u00e9n\u00e9ficiaire",
            "type": "integer",
            "length": "2",
            "format": "default",
            "nomenclature": "IR_BER_V",
            "dateCreated": "",
            "dateDeleted": "",
            "dateMissing": [],
            "observation": "",
            "regle_gestion": "",
            "type_oracle": "number"
        },
        {
            "name": "BEN_SEX_COD",
            "description": "Code sexe du b\u00e9n\u00e9ficiaire",
            "type": "integer",
            "length": "2",
            "format": "default",
            "nomenclature": "IR_SEX_V",
            "dateCreated": "",
            "dateDeleted": "",
            "dateMissing": [],
            "observation": "",
            "regle_gestion": "",
            "type_oracle": "number"
        },
        {
            "name": "BEN_TOP_CNS",
            "description": "top consommant - non consommant",
            "type": "integer",
            "length": "2",
            "format": "default",
            "nomenclature": "-",
            "dateCreated": "",
            "dateDeleted": "",
            "dateMissing": [],
            "observation": "",
            "regle_gestion": "",
            "type_oracle": "number"
        },
        {
            "name": "CTO_IDT_ANO",
            "description": "Identifiant Cartographie",
            "type": "string",
            "length": "18",
            "format": "default",
            "nomenclature": "-",
            "dateCreated": "",
            "dateDeleted": "",
            "dateMissing": [],
            "observation": "",
            "regle_gestion": "",
            "type_oracle": "string"
        },
        {
            "name": "IND_RNM_BEN",
            "description": "Top RNIAM",
            "type": "string",
            "length": "1",
            "format": "default",
            "nomenclature": "IR_RNM_V",
            "dateCreated": "",
            "dateDeleted": "",
            "dateMissing": [],
            "observation": "",
            "regle_gestion": "",
            "type_oracle": "string"
        },
        {
            "name": "MAX_TRT_DTD",
            "description": "Date maximale de traitement d'une Prestations",
            "type": "date",
            "length": "20",
            "format": "default",
            "nomenclature": "IR_DTE_V",
            "dateCreated": "",
            "dateDeleted": "",
            "dateMissing": [],
            "observation": "",
            "regle_gestion": "",
            "type_oracle": "date"
        },
        {
            "name": "ORG_AFF_BEN",
            "description": "Organisme d'affiliation du b\u00e9n\u00e9ficiaire",
            "type": "string",
            "length": "9",
            "format": "default",
            "nomenclature": "IR_ORG_V",
            "dateCreated": "",
            "dateDeleted": "",
            "dateMissing": [],
            "observation": "",
            "regle_gestion": "",
            "type_oracle": "string"
        },
        {
            "name": "ORG_CLE_NEW",
            "description": "Organisme de liquidation des prestations (apr\u00e8s fusion)",
            "type": "string",
            "length": "9",
            "format": "default",
            "nomenclature": "IR_ORG_V",
            "dateCreated": "",
            "dateDeleted": "",
            "dateMissing": [],
            "observation": "",
            "regle_gestion": "",
            "type_oracle": "string"
        },
        {
            "name": "REF_RGM_COD",
            "description": "Code petit r\u00e9gime",
            "type": "string",
            "length": "3",
            "format": "default",
            "nomenclature": "IR_RGM_V",
            "dateCreated": "",
            "dateDeleted": "",
            "dateMissing": [],
            "observation": "",
            "regle_gestion": "",
            "type_oracle": "string"
        },
        {
            "name": "REF_TIN_TOP",
            "description": "Top travailleur Ind\u00e9pendant",
            "type": "string",
            "length": "1",
            "format": "default",
            "nomenclature": "-",
            "dateCreated": "",
            "dateDeleted": "",
            "dateMissing": [],
            "observation": "",
            "regle_gestion": "",
            "type_oracle": "string"
        }
    ],
    "title": "Table du R\u00e9f\u00e9rentiel des b\u00e9n\u00e9ficiaires",
    "produit": "REFERENTIELS",
    "history": {
        "dateCreated": "",
        "dateDeleted": "",
        "dateMissing": []
    },
    "champ": "",
    "observation": ""
}