{
    "name": "T_SSRaaMEDAPAC",
    "fields": [
        {
            "name": "ETA_NUM",
            "description": "N\u00b0 FINESS",
            "type": "string",
            "length": "9.0",
            "format": "default",
            "nomenclature": "-",
            "dateCreated": "2012",
            "dateDeleted": "nan",
            "dateMissing": [],
            "observation": "Renomm\u00e9e (ancien nom : ETA_NUM_EPMSI)",
            "regle_gestion": "",
            "type_oracle": "string"
        },
        {
            "name": "PRS_TYP",
            "description": "Type de prestation",
            "type": "string",
            "length": "2.0",
            "format": "default",
            "nomenclature": "-",
            "dateCreated": "2012",
            "dateDeleted": "nan",
            "dateMissing": [],
            "observation": "",
            "regle_gestion": "",
            "type_oracle": "string"
        },
        {
            "name": "ANN",
            "description": "Ann\u00e9e p\u00e9riode",
            "type": "string",
            "length": "4.0",
            "format": "default",
            "nomenclature": "-",
            "dateCreated": "2012",
            "dateDeleted": "nan",
            "dateMissing": [],
            "observation": "",
            "regle_gestion": "",
            "type_oracle": "string"
        },
        {
            "name": "MOI",
            "description": "N\u00b0 p\u00e9riode (mois)",
            "type": "date",
            "length": "2.0",
            "format": "default",
            "nomenclature": "-",
            "dateCreated": "2012",
            "dateDeleted": "nan",
            "dateMissing": [],
            "observation": "",
            "regle_gestion": "",
            "type_oracle": "string"
        },
        {
            "name": "RHA_NUM",
            "description": "N\u00b0 S\u00e9quentiel du s\u00e9jour",
            "type": "string",
            "length": "7.0",
            "format": "default",
            "nomenclature": "-",
            "dateCreated": "2012",
            "dateDeleted": "nan",
            "dateMissing": [],
            "observation": "",
            "regle_gestion": "",
            "type_oracle": "string"
        },
        {
            "name": "RHS_NUM",
            "description": "Num\u00e9ro s\u00e9quentiel du RHS",
            "type": "string",
            "length": "3.0",
            "format": "default",
            "nomenclature": "-",
            "dateCreated": "2012",
            "dateDeleted": "nan",
            "dateMissing": [],
            "observation": "",
            "regle_gestion": "",
            "type_oracle": "string"
        },
        {
            "name": "UCD_UCD_COD",
            "description": "Code UCD",
            "type": "string",
            "length": "13.0",
            "format": "default",
            "nomenclature": "-",
            "dateCreated": "2012",
            "dateDeleted": "nan",
            "dateMissing": [],
            "observation": "Transmise par ATIH sur 13 caract\u00e8res \u00e0 partir de 2015 (cr\u00e9\u00e9e par CNAM avt)",
            "regle_gestion": "",
            "type_oracle": "string"
        },
        {
            "name": "ADM_NBR",
            "description": "Nombre administr\u00e9 \u00e9ventuellement fractionnaire",
            "type": "integer",
            "length": "nan",
            "format": "default",
            "nomenclature": "-",
            "dateCreated": "2012",
            "dateDeleted": "nan",
            "dateMissing": [],
            "observation": "",
            "regle_gestion": "",
            "type_oracle": "number"
        },
        {
            "name": "ACH_PRI_ADM",
            "description": "Prix d'achat multipli\u00e9 par le nombre administr\u00e9",
            "type": "integer",
            "length": "nan",
            "format": "default",
            "nomenclature": "-",
            "dateCreated": "2012",
            "dateDeleted": "nan",
            "dateMissing": [],
            "observation": "",
            "regle_gestion": "",
            "type_oracle": "number"
        },
        {
            "name": "ADM_MOIS",
            "description": "Mois de la date d'administration",
            "type": "date",
            "length": "2.0",
            "format": "default",
            "nomenclature": "-",
            "dateCreated": "2012",
            "dateDeleted": "nan",
            "dateMissing": [],
            "observation": "",
            "regle_gestion": "",
            "type_oracle": "string"
        },
        {
            "name": "ADM_ANN",
            "description": "Ann\u00e9e de la date d'administration",
            "type": "string",
            "length": "4.0",
            "format": "default",
            "nomenclature": "-",
            "dateCreated": "2012",
            "dateDeleted": "nan",
            "dateMissing": [],
            "observation": "",
            "regle_gestion": "",
            "type_oracle": "string"
        },
        {
            "name": "DAT_DELAI",
            "description": "D\u00e9lai entre la date d\u2019entr\u00e9e du s\u00e9jour et la date de dispensation",
            "type": "integer",
            "length": "nan",
            "format": "default",
            "nomenclature": "-",
            "dateCreated": "2012",
            "dateDeleted": "nan",
            "dateMissing": [],
            "observation": "",
            "regle_gestion": "",
            "type_oracle": "number"
        },
        {
            "name": "TOP_UCD_AUTO",
            "description": "Top transcodage UCD13 auto",
            "type": "string",
            "length": "1.0",
            "format": "default",
            "nomenclature": "-",
            "dateCreated": "2015",
            "dateDeleted": "nan",
            "dateMissing": [],
            "observation": "",
            "regle_gestion": "",
            "type_oracle": "string"
        },
        {
            "name": "UCD_COD",
            "description": "Code UCD",
            "type": "string",
            "length": "9.0",
            "format": "default",
            "nomenclature": "-",
            "dateCreated": "2012",
            "dateDeleted": "2014.0",
            "dateMissing": [],
            "observation": "",
            "regle_gestion": "",
            "type_oracle": "string"
        }
    ],
    "title": "m\u00e9dicaments sous AAP/AAC",
    "produit": "PMSI SSR",
    "history": {
        "dateCreated": "2012",
        "dateDeleted": "",
        "dateMissing": []
    },
    "champ": "Public et Priv\u00e9",
    "observation": "",
    "foreignKeys": [
        {
            "fields": [
                "ETA_NUM",
                "RHA_NUM"
            ],
            "reference": {
                "resource": "T_SSRaaB",
                "fields": [
                    "ETA_NUM",
                    "RHA_NUM"
                ]
            }
        }
    ]
}