{
    "name": "T_MCOaaSUP_LACT",
    "fields": [
        {
            "name": "ANN_MOI",
            "description": "Ann\u00e9e+Mois",
            "type": "date",
            "length": "6",
            "format": "default",
            "nomenclature": "-",
            "dateCreated": "2010",
            "dateDeleted": "nan",
            "dateMissing": [],
            "observation": "",
            "regle_gestion": "",
            "type_oracle": "string"
        },
        {
            "name": "ETA_NUM",
            "description": "Num\u00e9ro FINESS d\u2019inscription ePMSI",
            "type": "string",
            "length": "9",
            "format": "default",
            "nomenclature": "-",
            "dateCreated": "2010",
            "dateDeleted": "nan",
            "dateMissing": [],
            "observation": "",
            "regle_gestion": "",
            "type_oracle": "string"
        },
        {
            "name": "ETA_NUM_GEO",
            "description": "Num\u00e9ro FINESS g\u00e9ographique",
            "type": "string",
            "length": "9",
            "format": "default",
            "nomenclature": "-",
            "dateCreated": "2015",
            "dateDeleted": "nan",
            "dateMissing": [],
            "observation": "",
            "regle_gestion": "",
            "type_oracle": "string"
        },
        {
            "name": "FIC_TYP",
            "description": "Type de fichier",
            "type": "string",
            "length": "3",
            "format": "default",
            "nomenclature": "-",
            "dateCreated": "2010",
            "dateDeleted": "nan",
            "dateMissing": [],
            "observation": "",
            "regle_gestion": "",
            "type_oracle": "string"
        },
        {
            "name": "LAI_COL_ANO",
            "description": "Quantit\u00e9 de lait collect\u00e9 dans le cadre d'un don anonyme (en litres)",
            "type": "number",
            "length": "7,2",
            "format": "default",
            "nomenclature": "-",
            "dateCreated": "2015",
            "dateDeleted": "nan",
            "dateMissing": [],
            "observation": "",
            "regle_gestion": "",
            "type_oracle": "number"
        },
        {
            "name": "LAI_COL_PERS",
            "description": "Quantit\u00e9 de lait collect\u00e9 pour don personnalis\u00e9 (en litres)",
            "type": "number",
            "length": "7,2",
            "format": "default",
            "nomenclature": "-",
            "dateCreated": "2015",
            "dateDeleted": "nan",
            "dateMissing": [],
            "observation": "",
            "regle_gestion": "",
            "type_oracle": "number"
        },
        {
            "name": "LAI_CONG_CONS",
            "description": "Quantit\u00e9 de lait congel\u00e9 consomm\u00e9 (en litres)",
            "type": "number",
            "length": "7,2",
            "format": "default",
            "nomenclature": "-",
            "dateCreated": "2015",
            "dateDeleted": "nan",
            "dateMissing": [],
            "observation": "",
            "regle_gestion": "",
            "type_oracle": "number"
        },
        {
            "name": "LAI_LYOP_CONS",
            "description": "Quantit\u00e9 de lait lyophilis\u00e9 consomm\u00e9 (en litres)",
            "type": "number",
            "length": "7,2",
            "format": "default",
            "nomenclature": "-",
            "dateCreated": "2015",
            "dateDeleted": "nan",
            "dateMissing": [],
            "observation": "",
            "regle_gestion": "",
            "type_oracle": "number"
        },
        {
            "name": "LAI_PAST_DIS_ANO",
            "description": "Quantit\u00e9 de lait pasteuris\u00e9 congel\u00e9 distribu\u00e9 au total dans le cadre du don anonyme (en litres)",
            "type": "number",
            "length": "7,2",
            "format": "default",
            "nomenclature": "-",
            "dateCreated": "2015",
            "dateDeleted": "nan",
            "dateMissing": [],
            "observation": "",
            "regle_gestion": "",
            "type_oracle": "number"
        },
        {
            "name": "LAI_PAST_DIS_PERS",
            "description": "Quantit\u00e9 de lait pasteuris\u00e9 congel\u00e9 distribu\u00e9 pour don personnalis\u00e9 (en litres)",
            "type": "number",
            "length": "7,2",
            "format": "default",
            "nomenclature": "-",
            "dateCreated": "2015",
            "dateDeleted": "nan",
            "dateMissing": [],
            "observation": "",
            "regle_gestion": "",
            "type_oracle": "number"
        },
        {
            "name": "LAI_PAST_REQ_ANO",
            "description": "Quantit\u00e9 de lait pasteuris\u00e9 congel\u00e9 requalifi\u00e9 en don anonyme (en litres)",
            "type": "number",
            "length": "7,2",
            "format": "default",
            "nomenclature": "-",
            "dateCreated": "2015",
            "dateDeleted": "nan",
            "dateMissing": [],
            "observation": "",
            "regle_gestion": "",
            "type_oracle": "number"
        },
        {
            "name": "LAI_PAST_VEND",
            "description": "Quantit\u00e9 de lait pasteuris\u00e9 congel\u00e9 vendu (en litres)",
            "type": "number",
            "length": "7,2",
            "format": "default",
            "nomenclature": "-",
            "dateCreated": "2015",
            "dateDeleted": "nan",
            "dateMissing": [],
            "observation": "",
            "regle_gestion": "",
            "type_oracle": "number"
        }
    ],
    "title": "Fich sup lactarium",
    "produit": "PMSI MCO",
    "history": {
        "dateCreated": "2010",
        "dateDeleted": "",
        "dateMissing": []
    },
    "champ": "Public",
    "observation": "",
    "foreignKeys": [
        {
            "fields": [
                "ETA_NUM"
            ],
            "reference": {
                "resource": "T_MCOaaE",
                "fields": [
                    "ETA_NUM"
                ]
            }
        }
    ]
}