{
    "fields": [
        {
            "name": "BEN_C2S_COD",
            "type": "string",
            "format": "default",
            "role": "code"
        },
        {
            "name": "BEN_C2S_LIB",
            "type": "string",
            "format": "default",
            "role": "label"
        },
        {
            "name": "BEN_DRT_SPF",
            "type": "string",
            "format": "default"
        }
    ],
    "missingValues": [
        ""
    ],
    "name": "IR_CSS_V",
    "title": "Code C2S",
    "primaryKey": [
        "BEN_C2S_COD"
    ]
}