{
    "fields": [
        {
            "name": "DDP_COD",
            "type": "integer",
            "format": "default",
            "role": "code"
        },
        {
            "name": "MDT_COD",
            "type": "integer",
            "format": "default"
        }
    ],
    "missingValues": [
        ""
    ],
    "name": "IR_DDP_MDT_C",
    "title": "Compatibilité DDP / MDT",
    "primaryKey": [
        "DDP_COD", "MDT_COD"
    ]
}