{
    "fields": [
      {
        "name": "ETP_REG_COD",
        "type": "integer",
        "format": "default",
        "role": "code"
      },
      {
        "name": "ETP_LIB_LIB",
        "type": "string",
        "format": "default",
        "role": "label"
      }
    ],
    "missingValues": [],
    "name": "ETP_REG_COD",
    "title": "Région d'implantation de l'établissement prescripteur (OPEN DAMIR)",
    "primaryKey": "ETP_REG_COD"
  }