{
    "name": "IR_ETM_R",
    "fields": [
        {
            "name": "BEN_EXO_DTD",
            "description": "Date de d\u00e9but d'exon\u00e9ration",
            "type": "date",
            "length": "nan",
            "format": "default",
            "nomenclature": "IR_DTE_V",
            "dateCreated": "",
            "dateDeleted": "",
            "dateMissing": [],
            "observation": "",
            "regle_gestion": "",
            "type_oracle": "date"
        },
        {
            "name": "BEN_EXO_DTF",
            "description": "Date de fin d'exon\u00e9ration",
            "type": "date",
            "length": "nan",
            "format": "default",
            "nomenclature": "IR_DTE_V",
            "dateCreated": "",
            "dateDeleted": "",
            "dateMissing": [],
            "observation": "",
            "regle_gestion": "",
            "type_oracle": "date"
        },
        {
            "name": "BEN_EXO_MTF",
            "description": "Motif d'exon\u00e9ration du ticket mod\u00e9rateur",
            "type": "integer",
            "length": "8.0",
            "format": "default",
            "nomenclature": "IR_ETM_V",
            "dateCreated": "",
            "dateDeleted": "",
            "dateMissing": [],
            "observation": "",
            "regle_gestion": "",
            "type_oracle": "number"
        },
        {
            "name": "BEN_IDT_ANO",
            "description": "Identifiant b\u00e9n\u00e9ficiaire anonymis\u00e9",
            "type": "string",
            "length": "18.0",
            "format": "default",
            "nomenclature": "-",
            "dateCreated": "",
            "dateDeleted": "",
            "dateMissing": [],
            "observation": "",
            "regle_gestion": "",
            "type_oracle": "string"
        },
        {
            "name": "BEN_NIR_ANO",
            "description": "NIR pseudonymis\u00e9 du b\u00e9n\u00e9ficiaire",
            "type": "string",
            "length": "17.0",
            "format": "default",
            "nomenclature": "-",
            "dateCreated": "",
            "dateDeleted": "",
            "dateMissing": [],
            "observation": "",
            "regle_gestion": "",
            "type_oracle": "string"
        },
        {
            "name": "BEN_NIR_PSA",
            "description": "Identifiant anonyme du patient dans le SNIIRAM",
            "type": "string",
            "length": "17.0",
            "format": "default",
            "nomenclature": "-",
            "dateCreated": "",
            "dateDeleted": "",
            "dateMissing": [],
            "observation": "",
            "regle_gestion": "",
            "type_oracle": "string"
        },
        {
            "name": "BEN_RNG_GEM",
            "description": "Rang de naissance du b\u00e9n\u00e9ficiaire",
            "type": "integer",
            "length": "2.0",
            "format": "default",
            "nomenclature": "IR_BER_V",
            "dateCreated": "",
            "dateDeleted": "",
            "dateMissing": [],
            "observation": "",
            "regle_gestion": "",
            "type_oracle": "number"
        },
        {
            "name": "CTO_IDT_ANO",
            "description": "Identifiant Cartographie",
            "type": "string",
            "length": "18.0",
            "format": "default",
            "nomenclature": "-",
            "dateCreated": "",
            "dateDeleted": "",
            "dateMissing": [],
            "observation": "",
            "regle_gestion": "",
            "type_oracle": "string"
        },
        {
            "name": "IND_RNM_BEN",
            "description": "Top RNIAM",
            "type": "string",
            "length": "1.0",
            "format": "default",
            "nomenclature": "IR_RNM_V",
            "dateCreated": "",
            "dateDeleted": "",
            "dateMissing": [],
            "observation": "",
            "regle_gestion": "",
            "type_oracle": "string"
        }
    ],
    "title": "Table historique des exon\u00e9rations du ticket mod\u00e9rateur li\u00e9es \u00e0 la personne",
    "produit": "REFERENTIELS",
    "history": {
        "dateCreated": "",
        "dateDeleted": "",
        "dateMissing": []
    },
    "champ": "",
    "observation": "",
    "foreignKeys": [
        {
            "fields": [
                "BEN_NIR_PSA",
                "BEN_RNG_GEM"
            ],
            "reference": {
                "resource": "IR_BEN_R",
                "fields": [
                    "BEN_NIR_PSA",
                    "BEN_RNG_GEM"
                ]
            }
        }
    ]
}