MED_NCL_IDT;MED_MTF_COD;MED_MTF_LIB;TEC_COL
ISO3950;00;Pas de dent;0
ISO3950;01;maxillaire supérieur;0
ISO3950;02;mandibule (maxillaire inférieur);0
ISO3950;03;Sextant supérieur droit;0
ISO3950;04;Sextant antéro-supérieur;0
ISO3950;05;Sextant supérieur gauche;0
ISO3950;06;Sextant inférieur gauche;0
ISO3950;07;Sextant antéro-inférieur;0
ISO3950;08;Sextant inférieur droit;0
ISO3950;11;1er quadrant dent 1 définitive;0
ISO3950;12;1er quadrant dent 2 définitive;0
ISO3950;13;1er quadrant dent 3 définitive;0
ISO3950;14;1er quadrant dent 4 définitive;0
ISO3950;15;1er quadrant dent 5 définitive;0
ISO3950;16;1er quadrant dent 6 définitive;0
ISO3950;17;1er quadrant dent 7 définitive;0
ISO3950;18;1er quadrant dent 8 définitive;0
ISO3950;21;2e quadrant dent 1 définitive;0
ISO3950;22;2e quadrant dent 2 définitive;0
ISO3950;23;2e quadrant dent 3 définitive;0
ISO3950;24;2e quadrant dent 4 définitive;0
ISO3950;25;2e quadrant dent 5 définitive;0
ISO3950;26;2e quadrant dent 6 définitive;0
ISO3950;27;2e quadrant dent 7 définitive;0
ISO3950;28;2e quadrant dent 8 définitive;0
ISO3950;31;3e quadrant dent 1 définitive;0
ISO3950;32;3e quadrant dent 2 définitive;0
ISO3950;33;3e quadrant dent 3 définitive;0
ISO3950;34;3e quadrant dent 4 définitive;0
ISO3950;35;3e quadrant dent 5 définitive;0
ISO3950;36;3e quadrant dent 6 définitive;0
ISO3950;37;3e quadrant dent 7 définitive;0
ISO3950;38;3e quadrant dent 8 définitive;0
ISO3950;41;4e quadrant dent 1 définitive;0
ISO3950;42;4e quadrant dent 2 définitive;0
ISO3950;43;4e quadrant dent 3définitive;0
ISO3950;44;4e quadrant dent 4 définitive;0
ISO3950;45;4e quadrant dent 5 définitive;0
ISO3950;46;4e quadrant dent 6 définitive;0
ISO3950;47;4e quadrant dent 7 définitive;0
ISO3950;48;4e quadrant dent 8 définitive;0
ISO3950;51;1er quadrant dent 1 dent de lait;0
ISO3950;52;1er quadrant dent 2 dent de lait;0
ISO3950;53;1er quadrant dent 3 dent de lait;0
ISO3950;54;1er quadrant dent 4 dent de lait;0
ISO3950;55;1er quadrant dent 5 dent de lait;0
ISO3950;56;1er quadrant dent 6 dent de lait;0
ISO3950;57;1er quadrant dent 7 dent de lait;0
ISO3950;61;2er quadrant dent 1 dent de lait;0
ISO3950;62;2er quadrant dent 2 dent de lait;0
ISO3950;63;2er quadrant dent 3 dent de lait;0
ISO3950;64;2er quadrant dent 4 dent de lait;0
ISO3950;65;2er quadrant dent 5 dent de lait;0
ISO3950;66;2er quadrant dent 6 dent de lait;0
ISO3950;67;2er quadrant dent 7 dent de lait;0
ISO3950;71;3er quadrant dent 1 dent de lait;0
ISO3950;72;3er quadrant dent 2 dent de lait;0
ISO3950;73;3er quadrant dent 3 dent de lait;0
ISO3950;74;3er quadrant dent 4 dent de lait;0
ISO3950;75;3er quadrant dent 5 dent de lait;0
ISO3950;76;3er quadrant dent 6 dent de lait;0
ISO3950;77;3er quadrant dent 7 dent de lait;0
ISO3950;81;4er quadrant dent 1 dent de lait;0
ISO3950;82;4er quadrant dent 2 dent de lait;0
ISO3950;83;4er quadrant dent 3 dent de lait;0
ISO3950;84;4er quadrant dent 4 dent de lait;0
ISO3950;85;4er quadrant dent 5 dent de lait;0
ISO3950;86;4er quadrant dent 6 dent de lait;0
ISO3950;87;4er quadrant dent 7 dent de lait;0
9999999;99;VALEUR INCONNUE;1
CIM10;A00;A COMPLETER;0
CIM10;A01;A COMPLETER;0
CIM10;A02;A COMPLETER;0
CIM10;A03;A COMPLETER;0
CIM10;A04;A COMPLETER;0
CIM10;A05;A COMPLETER;0
CIM10;A06;A COMPLETER;0
CIM10;A07;A COMPLETER;0
CIM10;A08;A COMPLETER;0
CIM10;A09;A COMPLETER;0
CIM10;A15;TUBERC. APP. RESP.;0
CIM10;A16;A COMPLETER;0
CIM10;A17;TUBERC.SYST. NERV.;0
CIM10;A18;TUBERC. AUTRES ORG.;0
CIM10;A19;A COMPLETER;0
CIM10;A20;A COMPLETER;0
CIM10;A21;A COMPLETER;0
CIM10;A22;A COMPLETER;0
CIM10;A23;A COMPLETER;0
CIM10;A24;A COMPLETER;0
CIM10;A25;A COMPLETER;0
CIM10;A26;A COMPLETER;0
CIM10;A27;A COMPLETER;0
CIM10;A28;A COMPLETER;0
CIM10;A282;YERS. EXTRA-INTEST.;0
CIM10;A30;A COMPLETER;0
CIM10;A31;A COMPLETER;0
CIM10;A32;A COMPLETER;0
CIM10;A33;A COMPLETER;0
CIM10;A34;A COMPLETER;0
CIM10;A35;A COMPLETER;0
CIM10;A36;A COMPLETER;0
CIM10;A37;A COMPLETER;0
CIM10;A38;A COMPLETER;0
CIM10;A39;A COMPLETER;0
CIM10;A40;A COMPLETER;0
CIM10;A41;A COMPLETER;0
CIM10;A42;A COMPLETER;0
CIM10;A43;A COMPLETER;0
CIM10;A44;A COMPLETER;0
CIM10;A46;A COMPLETER;0
CIM10;A48;A COMPLETER;0
CIM10;A49;A COMPLETER;0
CIM10;A50;A COMPLETER;0
CIM10;A51;A COMPLETER;0
CIM10;A52;A COMPLETER;0
CIM10;A521;SYPHILIS NERV. SYMPT;0
CIM10;A53;A COMPLETER;0
CIM10;A54;A COMPLETER;0
CIM10;A55;A COMPLETER;0
CIM10;A56;A COMPLETER;0
CIM10;A57;A COMPLETER;0
CIM10;A58;A COMPLETER;0
CIM10;A59;A COMPLETER;0
CIM10;A60;A COMPLETER;0
CIM10;A63;A COMPLETER;0
CIM10;A64;A COMPLETER;0
CIM10;A65;A COMPLETER;0
CIM10;A66;A COMPLETER;0
CIM10;A67;A COMPLETER;0
CIM10;A68;A COMPLETER;0
CIM10;A69;A COMPLETER;0
CIM10;A70;A COMPLETER;0
CIM10;A71;A COMPLETER;0
CIM10;A74;A COMPLETER;0
CIM10;A75;A COMPLETER;0
CIM10;A77;A COMPLETER;0
CIM10;A78;A COMPLETER;0
CIM10;A79;A COMPLETER;0
CIM10;A80;A COMPLETER;0
CIM10;A81;A COMPLETER;0
CIM10;A82;A COMPLETER;0
CIM10;A83;A COMPLETER;0
CIM10;A84;A COMPLETER;0
CIM10;A85;A COMPLETER;0
CIM10;A86;A COMPLETER;0
CIM10;A87;A COMPLETER;0
CIM10;A88;A COMPLETER;0
CIM10;A89;A COMPLETER;0
CIM10;A90;A COMPLETER;0
CIM10;A91;A COMPLETER;0
CIM10;A92;A COMPLETER;0
CIM10;A93;A COMPLETER;0
CIM10;A94;A COMPLETER;0
CIM10;A95;A COMPLETER;0
CIM10;A96;A COMPLETER;0
CIM10;A98;A COMPLETER;0
CIM10;A99;A COMPLETER;0
CIM10;B00;A COMPLETER;0
CIM10;B01;A COMPLETER;0
CIM10;B02;A COMPLETER;0
CIM10;B03;A COMPLETER;0
CIM10;B04;A COMPLETER;0
CIM10;B05;A COMPLETER;0
CIM10;B06;A COMPLETER;0
CIM10;B07;A COMPLETER;0
CIM10;B08;A COMPLETER;0
CIM10;B09;A COMPLETER;0
CIM10;B15;A COMPLETER;0
CIM10;B16;A COMPLETER;0
CIM10;B17;A COMPLETER;0
CIM10;B18;A COMPLETER;0
CIM10;B180;HEPAT. CHRON.B +DELT;0
CIM10;B181;HEPAT.CHRON.B SANS D;0
CIM10;B182;A COMPLETER;0
CIM10;B188;AUT. HEPATITE CHRON.;0
CIM10;B19;A COMPLETER;0
CIM10;B20;A COMPLETER;0
CIM10;B21;SIDA AVEC TUM. MALIG;0
CIM10;B22;SIDA AVEC AUTRES AFF;0
CIM10;B23;SIDA AVEC AUTRES MAL;0
CIM10;B24;A COMPLETER;0
CIM10;B25;A COMPLETER;0
CIM10;B26;A COMPLETER;0
CIM10;B27;A COMPLETER;0
CIM10;B30;A COMPLETER;0
CIM10;B33;A COMPLETER;0
CIM10;B34;A COMPLETER;0
CIM10;B35;A COMPLETER;0
CIM10;B36;A COMPLETER;0
CIM10;B37;A COMPLETER;0
CIM10;B38;A COMPLETER;0
CIM10;B39;A COMPLETER;0
CIM10;B40;A COMPLETER;0
CIM10;B41;A COMPLETER;0
CIM10;B42;A COMPLETER;0
CIM10;B43;A COMPLETER;0
CIM10;B44;A COMPLETER;0
CIM10;B45;A COMPLETER;0
CIM10;B46;A COMPLETER;0
CIM10;B47;A COMPLETER;0
CIM10;B48;A COMPLETER;0
CIM10;B49;A COMPLETER;0
CIM10;B50;A COMPLETER;0
CIM10;B51;A COMPLETER;0
CIM10;B52;A COMPLETER;0
CIM10;B53;A COMPLETER;0
CIM10;B54;A COMPLETER;0
CIM10;B55;A COMPLETER;0
CIM10;B56;A COMPLETER;0
CIM10;B57;A COMPLETER;0
CIM10;B58;A COMPLETER;0
CIM10;B59;A COMPLETER;0
CIM10;B60;A COMPLETER;0
CIM10;B64;A COMPLETER;0
CIM10;B65;A COMPLETER;0
CIM10;B66;A COMPLETER;0
CIM10;B67;A COMPLETER;0
CIM10;B68;A COMPLETER;0
CIM10;B69;A COMPLETER;0
CIM10;B70;A COMPLETER;0
CIM10;B71;A COMPLETER;0
CIM10;B72;A COMPLETER;0
CIM10;B73;A COMPLETER;0
CIM10;B74;A COMPLETER;0
CIM10;B75;A COMPLETER;0
CIM10;B76;A COMPLETER;0
CIM10;B77;A COMPLETER;0
CIM10;B78;A COMPLETER;0
CIM10;B79;A COMPLETER;0
CIM10;B80;A COMPLETER;0
CIM10;B81;A COMPLETER;0
CIM10;B82;A COMPLETER;0
CIM10;B83;A COMPLETER;0
CIM10;B85;A COMPLETER;0
CIM10;B86;A COMPLETER;0
CIM10;B87;A COMPLETER;0
CIM10;B88;A COMPLETER;0
CIM10;B89;A COMPLETER;0
CIM10;B90;A COMPLETER;0
CIM10;B909;SEQ.TUBERC. V. RESP.;0
CIM10;B91;A COMPLETER;0
CIM10;B92;A COMPLETER;0
CIM10;B94;A COMPLETER;0
CIM10;B95;A COMPLETER;0
CIM10;B96;A COMPLETER;0
CIM10;B97;A COMPLETER;0
CIM10;B99;A COMPLETER;0
CIM10;C00;A COMPLETER;0
CIM10;C01;T.M. BASE DE LANGUE;0
CIM10;C02;AUTRES T.M. LANGUE;0
CIM10;C03;A COMPLETER;0
CIM10;C04;T.M. PLANCHER  BOUCH;0
CIM10;C05;A COMPLETER;0
CIM10;C06;T.M.  BOUCHE,  SAI;0
CIM10;C07;T.M. Glde PAROTIDE;0
CIM10;C08;T.M.Gld.SALIV. Ppal;0
CIM10;C09;A COMPLETER;0
CIM10;C10;A COMPLETER;0
CIM10;C11;A COMPLETER;0
CIM10;C12;T.M. SINUS PIRIFORME;0
CIM10;C13;T.M. HYPOPHARYNX;0
CIM10;C14;T.M LEVRE,PHAR.,ETC;0
CIM10;C15;A COMPLETER;0
CIM10;C16;A COMPLETER;0
CIM10;C17;T.M INTESTIN GRELE;0
CIM10;C18;A COMPLETER;0
CIM10;C19;T.M. JONCT.RECTO-SIG;0
CIM10;C20;A COMPLETER;0
CIM10;C21;T.M. ANUS,CANAL ANAL;0
CIM10;C22;T.M.FOIE,VOIES  INTR;0
CIM10;C23;T.M.  VESICULE BIL.;0
CIM10;C24;T.M. VOIES BIL. NCA;0
CIM10;C25;A COMPLETER;0
CIM10;C26;T.M.ORG DIG,MAL DEF.;0
CIM10;C30;T.M.FOSSE NAS.,OREIL;0
CIM10;C31;A COMPLETER;0
CIM10;C32;A COMPLETER;0
CIM10;C33;A COMPLETER;0
CIM10;C34;T.M. BRONCHE POUMON;0
CIM10;C37;A COMPLETER;0
CIM10;C38;T.M COEUR,MED.,PLEV.;0
CIM10;C39;T.M. APP RESP,INDEF.;0
CIM10;C40;T.M OS ,CART.ART.Mb.;0
CIM10;C41;T.M.OS CART. ART.SAI;0
CIM10;C43;A COMPLETER;0
CIM10;C44;A COMPLETER;0
CIM10;C45;A COMPLETER;0
CIM10;C46;A COMPLETER;0
CIM10;C47;T.M.NERF PER& AUTON;0
CIM10;C48;T.M. (RETRO)PERITOI;0
CIM10;C49;T.M.TISSU CONJ &MOU;0
CIM10;C50;A COMPLETER;0
CIM10;C51;A COMPLETER;0
CIM10;C52;A COMPLETER;0
CIM10;C53;T.M. COL DE L'UTERUS;0
CIM10;C54;A COMPLETER;0
CIM10;C55;T.M. 'UTERUS, SAI;0
CIM10;C56;A COMPLETER;0
CIM10;C57;T.M.ORG GEN.FEM.,SAI;0
CIM10;C58;A COMPLETER;0
CIM10;C60;A COMPLETER;0
CIM10;C61;A COMPLETER;0
CIM10;C62;A COMPLETER;0
CIM10;C63;T.M ORG.GEN.MASC,SAI;0
CIM10;C64;T.M REIN,Sf BASSINET;0
CIM10;C65;A COMPLETER;0
CIM10;C66;A COMPLETER;0
CIM10;C67;A COMPLETER;0
CIM10;C68;T.M.ORG.URIN.,SAI;0
CIM10;C69;T.M OEIL ET ANNEXES;0
CIM10;C70;A COMPLETER;0
CIM10;C71;A COMPLETER;0
CIM10;C72;T.M.MOELLE EP.NERFS;0
CIM10;C73;A COMPLETER;0
CIM10;C74;A COMPLETER;0
CIM10;C75;T.M AUT Gld. ENDO.ET;0
CIM10;C76;A COMPLETER;0
CIM10;C77;T.M.Ggl.LYMPH.2re.;0
CIM10;C78;T.M 2re RESP.ET DIG.;0
CIM10;C79;T.M. 2re.AUT. SIEGES;0
CIM10;C80;A COMPLETER;0
CIM10;C81;A COMPLETER;0
CIM10;C82;LYMPH.FOLL.NON HODG;0
CIM10;C83;LYMPH.DIFF NON HODG;0
CIM10;C84;LYMPH.PERIPH. ET CUT;0
CIM10;C85;AUT.LYMPH. NON HODG.;0
CIM10;C88;MAL.IMMUNOPROLI.MAL.;0
CIM10;C90;MYELOME MULT& A PLAS;0
CIM10;C91;A COMPLETER;0
CIM10;C92;A COMPLETER;0
CIM10;C93;A COMPLETER;0
CIM10;C94;LEUCEM. ç. PREC.,NCA;0
CIM10;C95;A COMPLETER;0
CIM10;C96;T.M. TISSU LYMPH,HEM;0
CIM10;C97;T.M.SIEGES MULT.IND.;0
CIM10;D00;K IN SITU BOUCHE,OE;0
CIM10;D01;K IN SITU ORG. DIG.,;0
CIM10;D02;K IN SITU APP. RESP.;0
CIM10;D03;A COMPLETER;0
CIM10;D04;K IN SITU DE LA PEAU;0
CIM10;D05;K IN SITU DU SEIN;0
CIM10;D06;K IN SITU COL UTERUS;0
CIM10;D07;K IN SITU ORG. GEN.;0
CIM10;D09;K IN SITU SIEGE NCA;0
CIM10;D10;A COMPLETER;0
CIM10;D11;A COMPLETER;0
CIM10;D12;A COMPLETER;0
CIM10;D13;A COMPLETER;0
CIM10;D14;A COMPLETER;0
CIM10;D15;A COMPLETER;0
CIM10;D16;A COMPLETER;0
CIM10;D17;A COMPLETER;0
CIM10;D18;A COMPLETER;0
CIM10;D19;A COMPLETER;0
CIM10;D20;A COMPLETER;0
CIM10;D21;A COMPLETER;0
CIM10;D22;A COMPLETER;0
CIM10;D23;A COMPLETER;0
CIM10;D24;A COMPLETER;0
CIM10;D25;A COMPLETER;0
CIM10;D26;A COMPLETER;0
CIM10;D27;A COMPLETER;0
CIM10;D28;A COMPLETER;0
CIM10;D29;A COMPLETER;0
CIM10;D30;A COMPLETER;0
CIM10;D31;A COMPLETER;0
CIM10;D32;A COMPLETER;0
CIM10;D33;A COMPLETER;0
CIM10;D34;A COMPLETER;0
CIM10;D35;A COMPLETER;0
CIM10;D36;A COMPLETER;0
CIM10;D37;A COMPLETER;0
CIM10;D38;A COMPLETER;0
CIM10;D39;A COMPLETER;0
CIM10;D40;A COMPLETER;0
CIM10;D41;A COMPLETER;0
CIM10;D42;A COMPLETER;0
CIM10;D43;A COMPLETER;0
CIM10;D44;A COMPLETER;0
CIM10;D45;A COMPLETER;0
CIM10;D46;A COMPLETER;0
CIM10;D47;A COMPLETER;0
CIM10;D48;A COMPLETER;0
CIM10;D50;A COMPLETER;0
CIM10;D51;A COMPLETER;0
CIM10;D52;A COMPLETER;0
CIM10;D53;A COMPLETER;0
CIM10;D55;A COMPLETER;0
CIM10;D56;A COMPLETER;0
CIM10;D560;A COMPLETER;0
CIM10;D561;A COMPLETER;0
CIM10;D562;DELTA-BETA-THALASSEM;0
CIM10;D568;A COMPLETER;0
CIM10;D569;A COMPLETER;0
CIM10;D57;A COMPLETER;0
CIM10;D570;ANEMIE A HEMAT.FALC.;0
CIM10;D571;ANEMIE A HEMAT.FALC.;0
CIM10;D572;ANEMIE A HEMAT.FALC.;0
CIM10;D578;AFF.A HEMAT.FALC.NCA;0
CIM10;D58;A COMPLETER;0
CIM10;D582;A COMPLETER;0
CIM10;D59;A COMPLETER;0
CIM10;D60;APLAS MEDULL.ACQUIS;0
CIM10;D61;APLASIES MEDULL.,NCA;0
CIM10;D610;APLASIE MEDUL.CONSTI;0
CIM10;D611;APLASIE MEDUL.MEDIC.;0
CIM10;D612;APLAS.MEDUL.PAR AGEN;0
CIM10;D613;APLASIE MEDUL.IDIOP.;0
CIM10;D618;APLASIE MEDUL.PREC.;0
CIM10;D619;APLASIE MEDULL., SAI;0
CIM10;D62;A COMPLETER;0
CIM10;D63;A COMPLETER;0
CIM10;D64;A COMPLETER;0
CIM10;D65;A COMPLETER;0
CIM10;D66;A COMPLETER;0
CIM10;D67;A COMPLETER;0
CIM10;D68;A COMPLETER;0
CIM10;D680;MAL.  VON WILLEBRAND;0
CIM10;D681;CARENCE HER.FACT. XI;0
CIM10;D682;CAR. AUT.FACT. COAG.;0
CIM10;D683;Tb. EMOR./ANTIC.CIRC;0
CIM10;D688;ANOM.PREC. COAG.NCA;0
CIM10;D69;A COMPLETER;0
CIM10;D691;MODIF. QUAL. PLAQUET;0
CIM10;D693;PURPURA THROMB.IDIOP;0
CIM10;D694;THROMBOPEN. Ire.,NCA;0
CIM10;D696;A COMPLETER;0
CIM10;D70;A COMPLETER;0
CIM10;D71;A COMPLETER;0
CIM10;D72;A COMPLETER;0
CIM10;D73;A COMPLETER;0
CIM10;D74;A COMPLETER;0
CIM10;D75;A COMPLETER;0
CIM10;D76;A COMPLETER;0
CIM10;D77;A COMPLETER;0
CIM10;D80;DEFIC.IMM.DEFICIT AC;0
CIM10;D81;DEFIC. IMMUN. COMBIN;0
CIM10;D82;A COMPLETER;0
CIM10;D821;A COMPLETER;0
CIM10;D83;DEFIC. IMM. COMM. V.;0
CIM10;D84;A COMPLETER;0
CIM10;D841;A COMPLETER;0
CIM10;D848;DEFIC. IMMUN. PREC.,;0
CIM10;D849;A COMPLETER;0
CIM10;D86;A COMPLETER;0
CIM10;D860;A COMPLETER;0
CIM10;D862;A COMPLETER;0
CIM10;D868;A COMPLETER;0
CIM10;D89;A COMPLETER;0
CIM10;E00;A COMPLETER;0
CIM10;E01;A COMPLETER;0
CIM10;E02;A COMPLETER;0
CIM10;E03;A COMPLETER;0
CIM10;E04;A COMPLETER;0
CIM10;E05;A COMPLETER;0
CIM10;E06;A COMPLETER;0
CIM10;E07;A COMPLETER;0
CIM10;E071;Tbl. HORMONOSYNTH.;0
CIM10;E10;A COMPLETER;0
CIM10;E11;A COMPLETER;0
CIM10;E12;A COMPLETER;0
CIM10;E13;AUTRE DIABETE SUCRE;0
CIM10;E14;A COMPLETER;0
CIM10;E15;A COMPLETER;0
CIM10;E16;A COMPLETER;0
CIM10;E20;A COMPLETER;0
CIM10;E21;A COMPLETER;0
CIM10;E22;A COMPLETER;0
CIM10;E23;A COMPLETER;0
CIM10;E24;A COMPLETER;0
CIM10;E25;A COMPLETER;0
CIM10;E250;ANOM.GEN-SURR.CONG.;0
CIM10;E26;A COMPLETER;0
CIM10;E27;A COMPLETER;0
CIM10;E28;A COMPLETER;0
CIM10;E29;A COMPLETER;0
CIM10;E30;A COMPLETER;0
CIM10;E31;A COMPLETER;0
CIM10;E32;A COMPLETER;0
CIM10;E34;A COMPLETER;0
CIM10;E35;A COMPLETER;0
CIM10;E40;A COMPLETER;0
CIM10;E41;A COMPLETER;0
CIM10;E42;A COMPLETER;0
CIM10;E43;A COMPLETER;0
CIM10;E44;A COMPLETER;0
CIM10;E45;A COMPLETER;0
CIM10;E46;A COMPLETER;0
CIM10;E50;A COMPLETER;0
CIM10;E51;A COMPLETER;0
CIM10;E52;A COMPLETER;0
CIM10;E53;A COMPLETER;0
CIM10;E531;CARENCE PYRIDOXINE;0
CIM10;E54;A COMPLETER;0
CIM10;E55;A COMPLETER;0
CIM10;E56;A COMPLETER;0
CIM10;E58;A COMPLETER;0
CIM10;E59;A COMPLETER;0
CIM10;E60;A COMPLETER;0
CIM10;E61;A COMPLETER;0
CIM10;E63;A COMPLETER;0
CIM10;E64;A COMPLETER;0
CIM10;E65;A COMPLETER;0
CIM10;E66;A COMPLETER;0
CIM10;E67;A COMPLETER;0
CIM10;E68;A COMPLETER;0
CIM10;E70;A COMPLETER;0
CIM10;E700;PHENYLCETON. CLASS.;0
CIM10;E701;A COMPLETER;0
CIM10;E702;ANOM. METAB.TYROSINE;0
CIM10;E703;A COMPLETER;0
CIM10;E708;ANOM.METAB. A.A.AROM;0
CIM10;E709;ANOM.METAB. A.A.AROM;0
CIM10;E71;A COMPLETER;0
CIM10;E710;MAL. URINES A ODEUR;0
CIM10;E711;ANOM.METAB.A.A.CHAIN;0
CIM10;E712;ANOM.METAB.A.A.CHAIN;0
CIM10;E72;A COMPLETER;0
CIM10;E720;ANOM.TRANSPORT AC.AM;0
CIM10;E721;ANOM.METAB.A A.SOUF.;0
CIM10;E722;A COMPLETER;0
CIM10;E723;ANOM.METAB.LYSINE ET;0
CIM10;E724;ANOM.METAB.ORNITHINE;0
CIM10;E725;A COMPLETER;0
CIM10;E728;ANOM.P.METAB.A A,NCA;0
CIM10;E729;A COMPLETER;0
CIM10;E73;A COMPLETER;0
CIM10;E730;DEFIC. CONG. LACTASE;0
CIM10;E731;DEFIC. 2re.  LACTASE;0
CIM10;E738;INTOLER. LACTOSE,NCA;0
CIM10;E739;INTOLER.LACTOSE,SAI;0
CIM10;E74;A COMPLETER;0
CIM10;E75;A COMPLETER;0
CIM10;E750;A COMPLETER;0
CIM10;E751;A COMPLETER;0
CIM10;E752;SPHINGOLIPIDOSES,NCA;0
CIM10;E753;A COMPLETER;0
CIM10;E754;A COMPLETER;0
CIM10;E755;ANOM.STOCKAGE LIPIDE;0
CIM10;E756;ANOM.STOCKAGE LIPIDE;0
CIM10;E76;A COMPLETER;0
CIM10;E760;MUCOPOLYSACC.,TYPE I;0
CIM10;E761;MUCOPOLYSACC.TYPE II;0
CIM10;E762;A COMPLETER;0
CIM10;E763;A COMPLETER;0
CIM10;E768;ANOM.METAB. GLUCOSAM;0
CIM10;E769;ANOM. METAB GLUCOSAM;0
CIM10;E77;A COMPLETER;0
CIM10;E770;DEF.TRANS ENZYM.LYSO;0
CIM10;E771;DEF.  DEGR. GLYCOPR.;0
CIM10;E78;ANOM.METAB. LIPOPROT;0
CIM10;E79;PURINE ET PYRIMIDINE;0
CIM10;E798;ANOM.META.PURINE,& P;0
CIM10;E80;A COMPLETER;0
CIM10;E802;A COMPLETER;0
CIM10;E807;ANOM. METAB.BILIRU.;0
CIM10;E83;A COMPLETER;0
CIM10;E830;ANOM. METAB. CUIVRE;0
CIM10;E831;ANOM. METAB. DU FER;0
CIM10;E832;A COMPLETER;0
CIM10;E833;ANOM. METAB.  PHOSP.;0
CIM10;E834;ANOM. METAB.MAGNES.;0
CIM10;E835;A COMPLETER;0
CIM10;E838;ANOM.METAB.MINER.NCA;0
CIM10;E839;ANOM.METAB.MINER.NCA;0
CIM10;E84;A COMPLETER;0
CIM10;E85;A COMPLETER;0
CIM10;E850;A COMPLETER;0
CIM10;E86;A COMPLETER;0
CIM10;E87;A COMPLETER;0
CIM10;E88;A COMPLETER;0
CIM10;E888;ANOM.METAB.PREC.,NCA;0
CIM10;E89;A COMPLETER;0
CIM10;E90;A COMPLETER;0
CIM10;F00;A COMPLETER;0
CIM10;F01;A COMPLETER;0
CIM10;F02;A COMPLETER;0
CIM10;F021;A COMPLETER;0
CIM10;F03;A COMPLETER;0
CIM10;F04;SD. AMNESIQ. ORG.;0
CIM10;F05;DELIRIUM NON ALC.OU;0
CIM10;F06;A COMPLETER;0
CIM10;F07;Tbl. PERSON. DUS A;0
CIM10;F09;A COMPLETER;0
CIM10;F10;A COMPLETER;0
CIM10;F102;A COMPLETER;0
CIM10;F104;ALCOOL:SD.DE SEVR.+;0
CIM10;F105;ALCOOL:Tbl. PSYCHOT.;0
CIM10;F106;ALCOOL:SYND. AMNES.;0
CIM10;F107;ALCOOL:Tb. RESIDUEL;0
CIM10;F108;Tb MENT.ALCOOL NCA,;0
CIM10;F109;Tb MENT.ALCOOL NCA,;0
CIM10;F11;A COMPLETER;0
CIM10;F114;OPIACES:SD. DE SEVR.;0
CIM10;F115;OPIACES:Tb PSYCHOT.;0
CIM10;F116;OPIACES:SD. AMNESIQ.;0
CIM10;F117;OPIACES:Tbl RESIDUEL;0
CIM10;F118;Tbl.MENT.OPIACES NCA;0
CIM10;F119;Tbl.MENT.OPIACES SAI;0
CIM10;F12;A COMPLETER;0
CIM10;F13;A COMPLETER;0
CIM10;F134;SEDATIFS:SYND. SEVRA;0
CIM10;F135;SEDATIFS:Tbl.PSYCHOT;0
CIM10;F136;SEDATIFS:SYND.AMNES.;0
CIM10;F137;SEDATIFS:Tb.RESIDUEL;0
CIM10;F138;Tb MENT.SEDATIFS NCA;0
CIM10;F139;Tb.MENT.SEDATIFS SAI;0
CIM10;F14;A COMPLETER;0
CIM10;F144;COCAINE :SYND. SEVR.;0
CIM10;F145;COCAINE:Tbl.PSYCHOT.;0
CIM10;F146;COCAINE:SYND. AMNES.;0
CIM10;F147;COCAINE:Tbl.RESIDUEL;0
CIM10;F148;Tb.MENT.COCAINE NCA;0
CIM10;F149;Tb.MENT.COCAINE SAI;0
CIM10;F15;A COMPLETER;0
CIM10;F16;A COMPLETER;0
CIM10;F164;HALLUC.:SD. SEVR.+;0
CIM10;F165;HALLUC.:Tbl.PSYCHOT.;0
CIM10;F166;HALLUC.:SD. AMNESIQ.;0
CIM10;F167;HALLUC.:Tb.RESIDUEL;0
CIM10;F168;Tb.MENT./HALLUC.NCA;0
CIM10;F169;Tb.MENT./HALLUC.SAI;0
CIM10;F17;A COMPLETER;0
CIM10;F18;A COMPLETER;0
CIM10;F19;A COMPLETER;0
CIM10;F192;DROGUES  NCA:DEPEND.;0
CIM10;F20;A COMPLETER;0
CIM10;F21;A COMPLETER;0
CIM10;F22;Tb. DELIRANT PERSIST;0
CIM10;F23;Tb.PSYCHOT.AIG.& TR.;0
CIM10;F24;A COMPLETER;0
CIM10;F25;Tbl. SCHIZO-AFFECTIF;0
CIM10;F28;Tb.PSYCHOT. NON ORG;0
CIM10;F29;PSYCHOSE NON ORG.SAI;0
CIM10;F30;A COMPLETER;0
CIM10;F31;A COMPLETER;0
CIM10;F32;A COMPLETER;0
CIM10;F323;DEPRES.++& S. PSYCH;0
CIM10;F33;Tbl. DEPRES. RECURR.;0
CIM10;F34;A COMPLETER;0
CIM10;F38;A COMPLETER;0
CIM10;F39;A COMPLETER;0
CIM10;F40;Tb. ANXIEUX PHOBIQUE;0
CIM10;F41;A COMPLETER;0
CIM10;F411;A COMPLETER;0
CIM10;F412;Tb. ANXIODEPR. MIXTE;0
CIM10;F42;Tbl. OBSESS.-COMPUL.;0
CIM10;F43;A COMPLETER;0
CIM10;F44;A COMPLETER;0
CIM10;F45;A COMPLETER;0
CIM10;F48;Tbl. NEVROTIQUES,NCA;0
CIM10;F50;A COMPLETER;0
CIM10;F500;A COMPLETER;0
CIM10;F51;A COMPLETER;0
CIM10;F52;A COMPLETER;0
CIM10;F53;A COMPLETER;0
CIM10;F531;Tb. MENT.AVEC PUERP.;0
CIM10;F54;A COMPLETER;0
CIM10;F55;A COMPLETER;0
CIM10;F59;A COMPLETER;0
CIM10;F60;Tbl. SPECIF. PERSON.;0
CIM10;F61;A COMPLETER;0
CIM10;F62;A COMPLETER;0
CIM10;F63;A COMPLETER;0
CIM10;F64;A COMPLETER;0
CIM10;F65;A COMPLETER;0
CIM10;F66;A COMPLETER;0
CIM10;F68;A COMPLETER;0
CIM10;F69;A COMPLETER;0
CIM10;F70;A COMPLETER;0
CIM10;F701;A COMPLETER;0
CIM10;F71;A COMPLETER;0
CIM10;F711;A COMPLETER;0
CIM10;F72;A COMPLETER;0
CIM10;F721;A COMPLETER;0
CIM10;F73;A COMPLETER;0
CIM10;F731;A COMPLETER;0
CIM10;F78;A COMPLETER;0
CIM10;F79;A COMPLETER;0
CIM10;F791;A COMPLETER;0
CIM10;F80;A COMPLETER;0
CIM10;F81;A COMPLETER;0
CIM10;F82;A COMPLETER;0
CIM10;F83;A COMPLETER;0
CIM10;F84;Tbl. ENVAH. DEVELOP.;0
CIM10;F88;A COMPLETER;0
CIM10;F89;A COMPLETER;0
CIM10;F90;A COMPLETER;0
CIM10;F91;A COMPLETER;0
CIM10;F92;Tb.MIXTE COND.& EMOT;0
CIM10;F93;Tbl.EMOT.SPEC.ENFANT;0
CIM10;F94;A COMPLETER;0
CIM10;F95;A COMPLETER;0
CIM10;F98;A COMPLETER;0
CIM10;F99;A COMPLETER;0
CIM10;G00;A COMPLETER;0
CIM10;G01;A COMPLETER;0
CIM10;G02;A COMPLETER;0
CIM10;G03;A COMPLETER;0
CIM10;G04;A COMPLETER;0
CIM10;G05;A COMPLETER;0
CIM10;G06;A COMPLETER;0
CIM10;G07;A COMPLETER;0
CIM10;G08;THROMBOPH.INTRACRAN;0
CIM10;G09;A COMPLETER;0
CIM10;G10;A COMPLETER;0
CIM10;G11;A COMPLETER;0
CIM10;G12;A COMPLETER;0
CIM10;G120;AMYOT.SPINALE INFAN.;0
CIM10;G121;AMYOT.SPINALES HER.;0
CIM10;G122;MAL. NEURONE MOTEUR;0
CIM10;G128;AMYOT.SPINALES NCA;0
CIM10;G129;AMYOT. SPINALE, SAI;0
CIM10;G13;A COMPLETER;0
CIM10;G20;A COMPLETER;0
CIM10;G21;SD. PARKINSONIEN 2re;0
CIM10;G22;A COMPLETER;0
CIM10;G23;A COMPLETER;0
CIM10;G24;A COMPLETER;0
CIM10;G25;A COMPLETER;0
CIM10;G26;A COMPLETER;0
CIM10;G30;A COMPLETER;0
CIM10;G31;A COMPLETER;0
CIM10;G312;DEGEN.SYST.NERV.ALC.;0
CIM10;G32;A COMPLETER;0
CIM10;G35;A COMPLETER;0
CIM10;G36;A COMPLETER;0
CIM10;G37;AFF.DEMYELIN. S.N.C.;0
CIM10;G40;A COMPLETER;0
CIM10;G41;A COMPLETER;0
CIM10;G43;A COMPLETER;0
CIM10;G44;A COMPLETER;0
CIM10;G45;A COMPLETER;0
CIM10;G46;A COMPLETER;0
CIM10;G47;A COMPLETER;0
CIM10;G473;A COMPLETER;0
CIM10;G50;A COMPLETER;0
CIM10;G51;A COMPLETER;0
CIM10;G52;A COMPLETER;0
CIM10;G53;A COMPLETER;0
CIM10;G54;A COMPLETER;0
CIM10;G55;A COMPLETER;0
CIM10;G56;A COMPLETER;0
CIM10;G57;A COMPLETER;0
CIM10;G58;A COMPLETER;0
CIM10;G588;MONONEVRITES PR.,NCA;0
CIM10;G59;A COMPLETER;0
CIM10;G60;NEUROP.HERED.& IDIOP;0
CIM10;G61;A COMPLETER;0
CIM10;G62;A COMPLETER;0
CIM10;G63;A COMPLETER;0
CIM10;G64;A COMPLETER;0
CIM10;G70;A COMPLETER;0
CIM10;G701;AFF. NEURO-MUSC.TOX.;0
CIM10;G708;AFF.NEURO-MUSC.PREC;0
CIM10;G71;AFF. MUSC. PRIMITIVE;0
CIM10;G72;A COMPLETER;0
CIM10;G73;A COMPLETER;0
CIM10;G80;PARAL.CEREB. INFANT.;0
CIM10;G81;A COMPLETER;0
CIM10;G82;A COMPLETER;0
CIM10;G822;A COMPLETER;0
CIM10;G825;A COMPLETER;0
CIM10;G83;A COMPLETER;0
CIM10;G90;A COMPLETER;0
CIM10;G91;A COMPLETER;0
CIM10;G92;A COMPLETER;0
CIM10;G93;A COMPLETER;0
CIM10;G94;A COMPLETER;0
CIM10;G95;A COMPLETER;0
CIM10;G950;SYRINGOMYEL.& BULBIE;0
CIM10;G951;A COMPLETER;0
CIM10;G952;COMPRES. MEDULL.,SAI;0
CIM10;G958;AFF.PR.MOELLE EP.NCA;0
CIM10;G959;A COMPLETER;0
CIM10;G96;A COMPLETER;0
CIM10;G97;A COMPLETER;0
CIM10;G98;A COMPLETER;0
CIM10;G99;A COMPLETER;0
CIM10;H00;A COMPLETER;0
CIM10;H01;A COMPLETER;0
CIM10;H02;A COMPLETER;0
CIM10;H03;A COMPLETER;0
CIM10;H04;A COMPLETER;0
CIM10;H05;A COMPLETER;0
CIM10;H06;A COMPLETER;0
CIM10;H10;A COMPLETER;0
CIM10;H11;A COMPLETER;0
CIM10;H13;A COMPLETER;0
CIM10;H15;A COMPLETER;0
CIM10;H16;A COMPLETER;0
CIM10;H17;A COMPLETER;0
CIM10;H18;A COMPLETER;0
CIM10;H19;A COMPLETER;0
CIM10;H20;A COMPLETER;0
CIM10;H21;A COMPLETER;0
CIM10;H22;A COMPLETER;0
CIM10;H25;A COMPLETER;0
CIM10;H26;A COMPLETER;0
CIM10;H27;A COMPLETER;0
CIM10;H28;A COMPLETER;0
CIM10;H30;A COMPLETER;0
CIM10;H31;A COMPLETER;0
CIM10;H32;A COMPLETER;0
CIM10;H33;A COMPLETER;0
CIM10;H34;A COMPLETER;0
CIM10;H35;A COMPLETER;0
CIM10;H36;A COMPLETER;0
CIM10;H40;A COMPLETER;0
CIM10;H42;A COMPLETER;0
CIM10;H43;A COMPLETER;0
CIM10;H44;A COMPLETER;0
CIM10;H45;A COMPLETER;0
CIM10;H46;A COMPLETER;0
CIM10;H47;A COMPLETER;0
CIM10;H48;A COMPLETER;0
CIM10;H49;A COMPLETER;0
CIM10;H50;A COMPLETER;0
CIM10;H51;A COMPLETER;0
CIM10;H52;A COMPLETER;0
CIM10;H53;A COMPLETER;0
CIM10;H54;A COMPLETER;0
CIM10;H55;A COMPLETER;0
CIM10;H57;A COMPLETER;0
CIM10;H58;A COMPLETER;0
CIM10;H59;A COMPLETER;0
CIM10;H60;A COMPLETER;0
CIM10;H61;A COMPLETER;0
CIM10;H62;A COMPLETER;0
CIM10;H65;A COMPLETER;0
CIM10;H66;A COMPLETER;0
CIM10;H67;A COMPLETER;0
CIM10;H68;A COMPLETER;0
CIM10;H69;A COMPLETER;0
CIM10;H70;A COMPLETER;0
CIM10;H71;A COMPLETER;0
CIM10;H72;A COMPLETER;0
CIM10;H73;A COMPLETER;0
CIM10;H74;A COMPLETER;0
CIM10;H75;A COMPLETER;0
CIM10;H80;A COMPLETER;0
CIM10;H81;A COMPLETER;0
CIM10;H82;A COMPLETER;0
CIM10;H83;A COMPLETER;0
CIM10;H90;A COMPLETER;0
CIM10;H91;A COMPLETER;0
CIM10;H92;A COMPLETER;0
CIM10;H93;A COMPLETER;0
CIM10;H94;A COMPLETER;0
CIM10;H95;A COMPLETER;0
CIM10;I00;A COMPLETER;0
CIM10;I01;A COMPLETER;0
CIM10;I02;A COMPLETER;0
CIM10;I05;MAL.RHUM.VALV.MITRAL;0
CIM10;I06;MAL.RHUM.VALV. AORT.;0
CIM10;I07;MAL.RHUM. TRICUSPIDE;0
CIM10;I08;POLYVALVULOP. RHUM.;0
CIM10;I09;A COMPLETER;0
CIM10;I098;CARDIOP.RHUM. NCA;0
CIM10;I10;A COMPLETER;0
CIM10;I11;A COMPLETER;0
CIM10;I12;A COMPLETER;0
CIM10;I13;CARDIONEPHR. HYPERT.;0
CIM10;I15;A COMPLETER;0
CIM10;I20;A COMPLETER;0
CIM10;I21;INFARCT. AIG. MYOC.;0
CIM10;I22;A COMPLETER;0
CIM10;I23;A COMPLETER;0
CIM10;I24;A COMPLETER;0
CIM10;I25;A COMPLETER;0
CIM10;I250;ATHEROS.CARDIO-VASC;0
CIM10;I251;CARDIOPAT. ARTERIOS.;0
CIM10;I255;MYOCARDIOPAT. ISCHEM;0
CIM10;I258;CARDIOP.ISCH.CHRON.;0
CIM10;I259;CARDIOP. ISCHEM.,SAI;0
CIM10;I26;A COMPLETER;0
CIM10;I27;A COMPLETER;0
CIM10;I270;A COMPLETER;0
CIM10;I279;AFF. CARDIOPULM. SAI;0
CIM10;I28;A COMPLETER;0
CIM10;I30;A COMPLETER;0
CIM10;I31;A COMPLETER;0
CIM10;I32;A COMPLETER;0
CIM10;I33;A COMPLETER;0
CIM10;I34;VALVU. NON RHUM.MITR;0
CIM10;I35;VALVU. NON RHUM.AORT;0
CIM10;I36;ATT.NON RHUM.TRICUSP;0
CIM10;I37;ATT VALV. PULM.NON R;0
CIM10;I38;A COMPLETER;0
CIM10;I39;A COMPLETER;0
CIM10;I40;A COMPLETER;0
CIM10;I41;A COMPLETER;0
CIM10;I42;A COMPLETER;0
CIM10;I43;A COMPLETER;0
CIM10;I44;A COMPLETER;0
CIM10;I45;A COMPLETER;0
CIM10;I46;A COMPLETER;0
CIM10;I47;A COMPLETER;0
CIM10;I48;A COMPLETER;0
CIM10;I49;A COMPLETER;0
CIM10;I498;ARYTHM.CARD. PR.,NCA;0
CIM10;I50;A COMPLETER;0
CIM10;I51;COMPL.CARDIO. INDEF.;0
CIM10;I52;A COMPLETER;0
CIM10;I60;A COMPLETER;0
CIM10;I61;A COMPLETER;0
CIM10;I62;HEMOR.INTRACR NON TR;0
CIM10;I63;A COMPLETER;0
CIM10;I64;A.V.CER.,SANS HEM..;0
CIM10;I65;STEN. ART. PRECEREB.;0
CIM10;I66;STENOSE ART.CEREB.;0
CIM10;I67;A COMPLETER;0
CIM10;I670;DISSECT. ART. CEREB.;0
CIM10;I671;A COMPLETER;0
CIM10;I672;ATHEROSCLER. CEREB.;0
CIM10;I678;MAL.CEREBROVAS. PREC;0
CIM10;I68;A COMPLETER;0
CIM10;I69;SEQ. MAL.CEREBROVASC;0
CIM10;I70;A COMPLETER;0
CIM10;I701;ATHER. ART. RENALE;0
CIM10;I702;A COMPLETER;0
CIM10;I708;ATHERO. AUT. ARTERES;0
CIM10;I709;ATHER. GENERAL., SAI;0
CIM10;I71;ANEVR. AORT.,DISSECT;0
CIM10;I72;A COMPLETER;0
CIM10;I73;MAL.VASC.PERIPH.,NCA;0
CIM10;I74;EMBOLIE,THROMB. ART.;0
CIM10;I77;A COMPLETER;0
CIM10;I78;A COMPLETER;0
CIM10;I79;A COMPLETER;0
CIM10;I80;A COMPLETER;0
CIM10;I81;A COMPLETER;0
CIM10;I82;A COMPLETER;0
CIM10;I83;A COMPLETER;0
CIM10;I84;A COMPLETER;0
CIM10;I85;A COMPLETER;0
CIM10;I86;A COMPLETER;0
CIM10;I87;A COMPLETER;0
CIM10;I88;A COMPLETER;0
CIM10;I89;A COMPLETER;0
CIM10;I95;A COMPLETER;0
CIM10;I97;A COMPLETER;0
CIM10;I98;A COMPLETER;0
CIM10;I99;A COMPLETER;0
CIM10;J00;A COMPLETER;0
CIM10;J01;A COMPLETER;0
CIM10;J02;A COMPLETER;0
CIM10;J03;A COMPLETER;0
CIM10;J04;A COMPLETER;0
CIM10;J05;A COMPLETER;0
CIM10;J06;A COMPLETER;0
CIM10;J10;A COMPLETER;0
CIM10;J11;A COMPLETER;0
CIM10;J12;A COMPLETER;0
CIM10;J13;A COMPLETER;0
CIM10;J14;A COMPLETER;0
CIM10;J15;A COMPLETER;0
CIM10;J16;A COMPLETER;0
CIM10;J17;A COMPLETER;0
CIM10;J18;A COMPLETER;0
CIM10;J20;A COMPLETER;0
CIM10;J21;A COMPLETER;0
CIM10;J22;A COMPLETER;0
CIM10;J30;A COMPLETER;0
CIM10;J31;A COMPLETER;0
CIM10;J32;A COMPLETER;0
CIM10;J33;A COMPLETER;0
CIM10;J34;A COMPLETER;0
CIM10;J35;A COMPLETER;0
CIM10;J36;A COMPLETER;0
CIM10;J37;A COMPLETER;0
CIM10;J38;A COMPLETER;0
CIM10;J39;A COMPLETER;0
CIM10;J40;A COMPLETER;0
CIM10;J41;A COMPLETER;0
CIM10;J42;BRONCHITE CHRON.,SAI;0
CIM10;J43;A COMPLETER;0
CIM10;J44;A COMPLETER;0
CIM10;J448;A COMPLETER;0
CIM10;J45;A COMPLETER;0
CIM10;J46;A COMPLETER;0
CIM10;J47;A COMPLETER;0
CIM10;J60;A COMPLETER;0
CIM10;J61;PNEUMOCON./AMIANTE &;0
CIM10;J62;A COMPLETER;0
CIM10;J63;PNEUMOC. POUSS.INOR.;0
CIM10;J64;A COMPLETER;0
CIM10;J65;PNEUMOCON.+ TUBERCU.;0
CIM10;J66;AFF.VOIES AER./POUS.;0
CIM10;J67;A COMPLETER;0
CIM10;J68;AFF. RESP./INHAL.GAZ;0
CIM10;J69;PNEUMOPAT. P.SUBST.;0
CIM10;J70;AFF.RESP./AGENT EXT;0
CIM10;J80;A COMPLETER;0
CIM10;J81;A COMPLETER;0
CIM10;J82;A COMPLETER;0
CIM10;J84;A COMPLETER;0
CIM10;J85;A COMPLETER;0
CIM10;J86;A COMPLETER;0
CIM10;J90;A COMPLETER;0
CIM10;J91;A COMPLETER;0
CIM10;J92;A COMPLETER;0
CIM10;J93;A COMPLETER;0
CIM10;J94;A COMPLETER;0
CIM10;J95;A COMPLETER;0
CIM10;J96;A COMPLETER;0
CIM10;J961;A COMPLETER;0
CIM10;J98;A COMPLETER;0
CIM10;J99;Tbl. RESP. AUT. MAL.;0
CIM10;K00;A COMPLETER;0
CIM10;K01;A COMPLETER;0
CIM10;K02;A COMPLETER;0
CIM10;K03;A COMPLETER;0
CIM10;K04;A COMPLETER;0
CIM10;K05;A COMPLETER;0
CIM10;K06;A COMPLETER;0
CIM10;K07;A COMPLETER;0
CIM10;K08;A COMPLETER;0
CIM10;K09;A COMPLETER;0
CIM10;K10;A COMPLETER;0
CIM10;K11;A COMPLETER;0
CIM10;K12;A COMPLETER;0
CIM10;K13;A COMPLETER;0
CIM10;K14;A COMPLETER;0
CIM10;K20;A COMPLETER;0
CIM10;K21;A COMPLETER;0
CIM10;K22;A COMPLETER;0
CIM10;K23;A COMPLETER;0
CIM10;K25;A COMPLETER;0
CIM10;K26;A COMPLETER;0
CIM10;K27;A COMPLETER;0
CIM10;K28;A COMPLETER;0
CIM10;K29;A COMPLETER;0
CIM10;K30;A COMPLETER;0
CIM10;K31;A COMPLETER;0
CIM10;K35;A COMPLETER;0
CIM10;K36;A COMPLETER;0
CIM10;K37;A COMPLETER;0
CIM10;K38;A COMPLETER;0
CIM10;K40;A COMPLETER;0
CIM10;K41;A COMPLETER;0
CIM10;K42;A COMPLETER;0
CIM10;K43;A COMPLETER;0
CIM10;K44;A COMPLETER;0
CIM10;K45;A COMPLETER;0
CIM10;K46;A COMPLETER;0
CIM10;K50;A COMPLETER;0
CIM10;K51;A COMPLETER;0
CIM10;K52;A COMPLETER;0
CIM10;K55;A COMPLETER;0
CIM10;K551;Tb.VASC.CHR.INTESTIN;0
CIM10;K56;A COMPLETER;0
CIM10;K57;A COMPLETER;0
CIM10;K58;A COMPLETER;0
CIM10;K59;A COMPLETER;0
CIM10;K60;A COMPLETER;0
CIM10;K61;A COMPLETER;0
CIM10;K62;A COMPLETER;0
CIM10;K63;A COMPLETER;0
CIM10;K65;A COMPLETER;0
CIM10;K66;A COMPLETER;0
CIM10;K67;A COMPLETER;0
CIM10;K70;MAL. ALCOOLIQUE FOIE;0
CIM10;K71;A COMPLETER;0
CIM10;K710;HEP.TOXIQUE &CHOLEST;0
CIM10;K713;HEPATITE CHRON. PERS;0
CIM10;K714;HEPATITE CHRON. LOB.;0
CIM10;K715;HEPATITE CHR. ACTIVE;0
CIM10;K717;A COMPLETER;0
CIM10;K72;A COMPLETER;0
CIM10;K73;A COMPLETER;0
CIM10;K74;A COMPLETER;0
CIM10;K743;CIRRHOSE BIL.PRIMIT.;0
CIM10;K746;CIRRHOSES,NCA OU SAI;0
CIM10;K75;A COMPLETER;0
CIM10;K76;A COMPLETER;0
CIM10;K77;A COMPLETER;0
CIM10;K80;A COMPLETER;0
CIM10;K81;A COMPLETER;0
CIM10;K82;A COMPLETER;0
CIM10;K83;A COMPLETER;0
CIM10;K831;OBSTRUC. VOIES BIL.;0
CIM10;K85;A COMPLETER;0
CIM10;K86;A COMPLETER;0
CIM10;K87;A COMPLETER;0
CIM10;K90;A COMPLETER;0
CIM10;K91;A COMPLETER;0
CIM10;K92;A COMPLETER;0
CIM10;K93;A COMPLETER;0
CIM10;L00;A COMPLETER;0
CIM10;L01;A COMPLETER;0
CIM10;L02;A COMPLETER;0
CIM10;L03;A COMPLETER;0
CIM10;L04;A COMPLETER;0
CIM10;L05;A COMPLETER;0
CIM10;L08;A COMPLETER;0
CIM10;L10;A COMPLETER;0
CIM10;L11;A COMPLETER;0
CIM10;L12;A COMPLETER;0
CIM10;L13;A COMPLETER;0
CIM10;L14;A COMPLETER;0
CIM10;L20;A COMPLETER;0
CIM10;L21;A COMPLETER;0
CIM10;L22;A COMPLETER;0
CIM10;L23;A COMPLETER;0
CIM10;L24;A COMPLETER;0
CIM10;L25;A COMPLETER;0
CIM10;L26;A COMPLETER;0
CIM10;L27;A COMPLETER;0
CIM10;L28;A COMPLETER;0
CIM10;L29;A COMPLETER;0
CIM10;L30;A COMPLETER;0
CIM10;L40;A COMPLETER;0
CIM10;L405;A COMPLETER;0
CIM10;L41;A COMPLETER;0
CIM10;L42;A COMPLETER;0
CIM10;L43;A COMPLETER;0
CIM10;L44;A COMPLETER;0
CIM10;L45;A COMPLETER;0
CIM10;L50;A COMPLETER;0
CIM10;L51;A COMPLETER;0
CIM10;L52;A COMPLETER;0
CIM10;L53;A COMPLETER;0
CIM10;L54;A COMPLETER;0
CIM10;L55;A COMPLETER;0
CIM10;L56;A COMPLETER;0
CIM10;L57;A COMPLETER;0
CIM10;L58;A COMPLETER;0
CIM10;L59;A COMPLETER;0
CIM10;L60;A COMPLETER;0
CIM10;L62;A COMPLETER;0
CIM10;L63;A COMPLETER;0
CIM10;L64;A COMPLETER;0
CIM10;L65;A COMPLETER;0
CIM10;L66;A COMPLETER;0
CIM10;L67;A COMPLETER;0
CIM10;L68;A COMPLETER;0
CIM10;L70;A COMPLETER;0
CIM10;L709;A COMPLETER;0
CIM10;L71;A COMPLETER;0
CIM10;L72;A COMPLETER;0
CIM10;L73;A COMPLETER;0
CIM10;L74;A COMPLETER;0
CIM10;L75;A COMPLETER;0
CIM10;L80;A COMPLETER;0
CIM10;L81;A COMPLETER;0
CIM10;L82;A COMPLETER;0
CIM10;L83;A COMPLETER;0
CIM10;L84;A COMPLETER;0
CIM10;L85;A COMPLETER;0
CIM10;L86;A COMPLETER;0
CIM10;L87;A COMPLETER;0
CIM10;L88;A COMPLETER;0
CIM10;L89;A COMPLETER;0
CIM10;L90;A COMPLETER;0
CIM10;L91;A COMPLETER;0
CIM10;L92;A COMPLETER;0
CIM10;L93;A COMPLETER;0
CIM10;L94;A COMPLETER;0
CIM10;L95;A COMPLETER;0
CIM10;L97;A COMPLETER;0
CIM10;L98;A COMPLETER;0
CIM10;L99;A COMPLETER;0
CIM10;M00;A COMPLETER;0
CIM10;M01;A COMPLETER;0
CIM10;M02;A COMPLETER;0
CIM10;M023;SD.OCULO-URETRO-SYN.;0
CIM10;M03;A COMPLETER;0
CIM10;M05;P.RHUMATOIDE SEROPOS;0
CIM10;M06;A COMPLETER;0
CIM10;M060;P.RHUMATOIDE SERONEG;0
CIM10;M061;MAL DE STILL / ADULT;0
CIM10;M068;AUT.P.RHUMATOIDE PR.;0
CIM10;M069;POLYARTHR. RHUM.,SAI;0
CIM10;M07;A COMPLETER;0
CIM10;M072;SPONDYLITE PSORIASI.;0
CIM10;M08;A COMPLETER;0
CIM10;M080;POLYART.RHUMAT. JUV.;0
CIM10;M081;SPONDYL. ANKYL. JUV.;0
CIM10;M09;A COMPLETER;0
CIM10;M10;A COMPLETER;0
CIM10;M11;A COMPLETER;0
CIM10;M12;A COMPLETER;0
CIM10;M13;A COMPLETER;0
CIM10;M14;A COMPLETER;0
CIM10;M15;A COMPLETER;0
CIM10;M16;A COMPLETER;0
CIM10;M17;A COMPLETER;0
CIM10;M18;A COMPLETER;0
CIM10;M19;A COMPLETER;0
CIM10;M20;A COMPLETER;0
CIM10;M21;A COMPLETER;0
CIM10;M22;A COMPLETER;0
CIM10;M23;A COMPLETER;0
CIM10;M24;A COMPLETER;0
CIM10;M25;A COMPLETER;0
CIM10;M30;P.A.N. & APPARENTEES;0
CIM10;M31;A COMPLETER;0
CIM10;M314;A COMPLETER;0
CIM10;M316;A COMPLETER;0
CIM10;M318;VASCUL. NECROS.PREC.;0
CIM10;M32L;UPUS ERYTH. DISSEM.;0
CIM10;M33;A COMPLETER;0
CIM10;M34;A COMPLETER;0
CIM10;M35;ATT.SYST.TISSU CONJ.;0
CIM10;M36;A COMPLETER;0
CIM10;M40;A COMPLETER;0
CIM10;M41;A COMPLETER;0
CIM10;M42;A COMPLETER;0
CIM10;M43;A COMPLETER;0
CIM10;M45;SPONDYLARTHR. ANKYL.;0
CIM10;M46;A COMPLETER;0
CIM10;M47;A COMPLETER;0
CIM10;M48;A COMPLETER;0
CIM10;M49;A COMPLETER;0
CIM10;M50;A COMPLETER;0
CIM10;M51;A COMPLETER;0
CIM10;M53;A COMPLETER;0
CIM10;M54;A COMPLETER;0
CIM10;M60;A COMPLETER;0
CIM10;M61;A COMPLETER;0
CIM10;M62;A COMPLETER;0
CIM10;M63;A COMPLETER;0
CIM10;M65;A COMPLETER;0
CIM10;M66;A COMPLETER;0
CIM10;M67;A COMPLETER;0
CIM10;M68;A COMPLETER;0
CIM10;M70;A COMPLETER;0
CIM10;M71;A COMPLETER;0
CIM10;M72;A COMPLETER;0
CIM10;M73;A COMPLETER;0
CIM10;M75;A COMPLETER;0
CIM10;M76;A COMPLETER;0
CIM10;M77;A COMPLETER;0
CIM10;M79;A COMPLETER;0
CIM10;M80;A COMPLETER;0
CIM10;M81;A COMPLETER;0
CIM10;M82;A COMPLETER;0
CIM10;M83;A COMPLETER;0
CIM10;M84;A COMPLETER;0
CIM10;M85;A COMPLETER;0
CIM10;M86;A COMPLETER;0
CIM10;M87;A COMPLETER;0
CIM10;M88;A COMPLETER;0
CIM10;M89;A COMPLETER;0
CIM10;M90;A COMPLETER;0
CIM10;M91;A COMPLETER;0
CIM10;M92;A COMPLETER;0
CIM10;M93;A COMPLETER;0
CIM10;M94;A COMPLETER;0
CIM10;M95;A COMPLETER;0
CIM10;M96;A COMPLETER;0
CIM10;M99;A COMPLETER;0
CIM10;N00;A COMPLETER;0
CIM10;N01;A COMPLETER;0
CIM10;N02;A COMPLETER;0
CIM10;N03;SYND. NEPHRIT.CHRON.;0
CIM10;N04;A COMPLETER;0
CIM10;N05;A COMPLETER;0
CIM10;N06;A COMPLETER;0
CIM10;N07;NEPHROPAT.HERED.NCA;0
CIM10;N08;A COMPLETER;0
CIM10;N10;A COMPLETER;0
CIM10;N11;NEPHR.TUBULO-INT.CHR;0
CIM10;N12;A COMPLETER;0
CIM10;N13;A COMPLETER;0
CIM10;N130;HYDRONEPHR./OBSTACL;0
CIM10;N14;ATT.TUBULO-INTER.MED;0
CIM10;N15;A COMPLETER;0
CIM10;N158;MAL.TUBULO-INTER. PR;0
CIM10;N16;A COMPLETER;0
CIM10;N17;A COMPLETER;0
CIM10;N18;A COMPLETER;0
CIM10;N19;A COMPLETER;0
CIM10;N20;A COMPLETER;0
CIM10;N21;A COMPLETER;0
CIM10;N22;A COMPLETER;0
CIM10;N23;A COMPLETER;0
CIM10;N25;A COMPLETER;0
CIM10;N26;A COMPLETER;0
CIM10;N27;A COMPLETER;0
CIM10;N28;A COMPLETER;0
CIM10;N29;A COMPLETER;0
CIM10;N30;A COMPLETER;0
CIM10;N31;A COMPLETER;0
CIM10;N32;A COMPLETER;0
CIM10;N33;A COMPLETER;0
CIM10;N34;A COMPLETER;0
CIM10;N35;A COMPLETER;0
CIM10;N36;A COMPLETER;0
CIM10;N37;A COMPLETER;0
CIM10;N39;A COMPLETER;0
CIM10;N40;A COMPLETER;0
CIM10;N41;A COMPLETER;0
CIM10;N42;A COMPLETER;0
CIM10;N43;A COMPLETER;0
CIM10;N44;A COMPLETER;0
CIM10;N45;A COMPLETER;0
CIM10;N46;A COMPLETER;0
CIM10;N47;A COMPLETER;0
CIM10;N48;A COMPLETER;0
CIM10;N49;A COMPLETER;0
CIM10;N50;A COMPLETER;0
CIM10;N51;A COMPLETER;0
CIM10;N60;A COMPLETER;0
CIM10;N61;A COMPLETER;0
CIM10;N62;A COMPLETER;0
CIM10;N63;A COMPLETER;0
CIM10;N64;A COMPLETER;0
CIM10;N70;A COMPLETER;0
CIM10;N71;A COMPLETER;0
CIM10;N72;A COMPLETER;0
CIM10;N73;A COMPLETER;0
CIM10;N74;A COMPLETER;0
CIM10;N75;A COMPLETER;0
CIM10;N76;A COMPLETER;0
CIM10;N77;A COMPLETER;0
CIM10;N80;A COMPLETER;0
CIM10;N81;A COMPLETER;0
CIM10;N82;A COMPLETER;0
CIM10;N83;A COMPLETER;0
CIM10;N84;A COMPLETER;0
CIM10;N85;A COMPLETER;0
CIM10;N86;A COMPLETER;0
CIM10;N87;A COMPLETER;0
CIM10;N88;A COMPLETER;0
CIM10;N89;A COMPLETER;0
CIM10;N90;A COMPLETER;0
CIM10;N91;A COMPLETER;0
CIM10;N92;A COMPLETER;0
CIM10;N93;A COMPLETER;0
CIM10;N94;A COMPLETER;0
CIM10;N95;A COMPLETER;0
CIM10;N96;A COMPLETER;0
CIM10;N97;A COMPLETER;0
CIM10;N98;A COMPLETER;0
CIM10;N99;A COMPLETER;0
CIM10;O00;A COMPLETER;0
CIM10;O01;A COMPLETER;0
CIM10;O02;A COMPLETER;0
CIM10;O03;A COMPLETER;0
CIM10;O04;A COMPLETER;0
CIM10;O05;A COMPLETER;0
CIM10;O06;A COMPLETER;0
CIM10;O07;A COMPLETER;0
CIM10;O08;A COMPLETER;0
CIM10;O10;A COMPLETER;0
CIM10;O11;A COMPLETER;0
CIM10;O12;A COMPLETER;0
CIM10;O13;A COMPLETER;0
CIM10;O14;A COMPLETER;0
CIM10;O15;A COMPLETER;0
CIM10;O16;A COMPLETER;0
CIM10;O20;A COMPLETER;0
CIM10;O21;A COMPLETER;0
CIM10;O22;A COMPLETER;0
CIM10;O23;A COMPLETER;0
CIM10;O24;A COMPLETER;0
CIM10;O25;A COMPLETER;0
CIM10;O26;A COMPLETER;0
CIM10;O28;A COMPLETER;0
CIM10;O29;A COMPLETER;0
CIM10;O30;A COMPLETER;0
CIM10;O31;A COMPLETER;0
CIM10;O32;A COMPLETER;0
CIM10;O33;A COMPLETER;0
CIM10;O34;A COMPLETER;0
CIM10;O35;A COMPLETER;0
CIM10;O36;A COMPLETER;0
CIM10;O40;A COMPLETER;0
CIM10;O41;A COMPLETER;0
CIM10;O42;A COMPLETER;0
CIM10;O43;A COMPLETER;0
CIM10;O44;A COMPLETER;0
CIM10;O45;A COMPLETER;0
CIM10;O46;A COMPLETER;0
CIM10;O47;A COMPLETER;0
CIM10;O48;A COMPLETER;0
CIM10;O60;A COMPLETER;0
CIM10;O61;A COMPLETER;0
CIM10;O62;A COMPLETER;0
CIM10;O63;A COMPLETER;0
CIM10;O64;A COMPLETER;0
CIM10;O65;A COMPLETER;0
CIM10;O66;A COMPLETER;0
CIM10;O67;A COMPLETER;0
CIM10;O68;A COMPLETER;0
CIM10;O69;A COMPLETER;0
CIM10;O70;A COMPLETER;0
CIM10;O71;A COMPLETER;0
CIM10;O72;A COMPLETER;0
CIM10;O73;A COMPLETER;0
CIM10;O74;A COMPLETER;0
CIM10;O75;A COMPLETER;0
CIM10;O80;A COMPLETER;0
CIM10;O81;A COMPLETER;0
CIM10;O82;A COMPLETER;0
CIM10;O83;A COMPLETER;0
CIM10;O84;A COMPLETER;0
CIM10;O85;A COMPLETER;0
CIM10;O86;A COMPLETER;0
CIM10;O87;A COMPLETER;0
CIM10;O88;A COMPLETER;0
CIM10;O89;A COMPLETER;0
CIM10;O90;A COMPLETER;0
CIM10;O91;A COMPLETER;0
CIM10;O92;A COMPLETER;0
CIM10;O95;A COMPLETER;0
CIM10;O96;A COMPLETER;0
CIM10;O97;A COMPLETER;0
CIM10;O98;A COMPLETER;0
CIM10;O99;A COMPLETER;0
CIM10;P00;A COMPLETER;0
CIM10;P01;A COMPLETER;0
CIM10;P02;A COMPLETER;0
CIM10;P03;A COMPLETER;0
CIM10;P04;A COMPLETER;0
CIM10;P05;A COMPLETER;0
CIM10;P07;A COMPLETER;0
CIM10;P08;A COMPLETER;0
CIM10;P10;A COMPLETER;0
CIM10;P11;A COMPLETER;0
CIM10;P12;A COMPLETER;0
CIM10;P13;A COMPLETER;0
CIM10;P14;A COMPLETER;0
CIM10;P15;A COMPLETER;0
CIM10;P20;A COMPLETER;0
CIM10;P21;A COMPLETER;0
CIM10;P22;A COMPLETER;0
CIM10;P23;A COMPLETER;0
CIM10;P24;A COMPLETER;0
CIM10;P25;A COMPLETER;0
CIM10;P26;A COMPLETER;0
CIM10;P27;A COMPLETER;0
CIM10;P28;A COMPLETER;0
CIM10;P29;A COMPLETER;0
CIM10;P35;A COMPLETER;0
CIM10;P36;A COMPLETER;0
CIM10;P37;A COMPLETER;0
CIM10;P38;A COMPLETER;0
CIM10;P39;A COMPLETER;0
CIM10;P50;A COMPLETER;0
CIM10;P51;A COMPLETER;0
CIM10;P52;A COMPLETER;0
CIM10;P53;A COMPLETER;0
CIM10;P54;A COMPLETER;0
CIM10;P55;A COMPLETER;0
CIM10;P56;A COMPLETER;0
CIM10;P57;A COMPLETER;0
CIM10;P58;A COMPLETER;0
CIM10;P59;A COMPLETER;0
CIM10;P60;A COMPLETER;0
CIM10;P61;A COMPLETER;0
CIM10;P70;A COMPLETER;0
CIM10;P71;A COMPLETER;0
CIM10;P72;A COMPLETER;0
CIM10;P74;A COMPLETER;0
CIM10;P75;A COMPLETER;0
CIM10;P76;A COMPLETER;0
CIM10;P77;A COMPLETER;0
CIM10;P78;A COMPLETER;0
CIM10;P80;A COMPLETER;0
CIM10;P81;A COMPLETER;0
CIM10;P83;A COMPLETER;0
CIM10;P90;A COMPLETER;0
CIM10;P91;A COMPLETER;0
CIM10;P92;A COMPLETER;0
CIM10;P93;A COMPLETER;0
CIM10;P94;A COMPLETER;0
CIM10;P95;A COMPLETER;0
CIM10;P96;A COMPLETER;0
CIM10;Q00;A COMPLETER;0
CIM10;Q01;A COMPLETER;0
CIM10;Q02;A COMPLETER;0
CIM10;Q03;A COMPLETER;0
CIM10;Q04;A COMPLETER;0
CIM10;Q05;A COMPLETER;0
CIM10;Q06;A COMPLETER;0
CIM10;Q07;A COMPLETER;0
CIM10;Q10;A COMPLETER;0
CIM10;Q11;A COMPLETER;0
CIM10;Q12;A COMPLETER;0
CIM10;Q13;A COMPLETER;0
CIM10;Q14;A COMPLETER;0
CIM10;Q15;A COMPLETER;0
CIM10;Q16;A COMPLETER;0
CIM10;Q17;A COMPLETER;0
CIM10;Q18;A COMPLETER;0
CIM10;Q20;MALF.CONG CARDIO.SF.;0
CIM10;Q21;A COMPLETER;0
CIM10;Q210;A COMPLETER;0
CIM10;Q211;A COMPLETER;0
CIM10;Q212;COMMUN.AURICULO-VENT;0
CIM10;Q213;A COMPLETER;0
CIM10;Q219;MALF. CLOISON CARDI.;0
CIM10;Q22;A COMPLETER;0
CIM10;Q221;A COMPLETER;0
CIM10;Q228;MALF. VALV. TRICUSP;0
CIM10;Q23;A COMPLETER;0
CIM10;Q230;A COMPLETER;0
CIM10;Q231;INSUF.CONG.VALV.AORT;0
CIM10;Q232;STENOSE MITRALE CONG;0
CIM10;Q233;A COMPLETER;0
CIM10;Q234;HYPOPLASIE COEUR G.;0
CIM10;Q238;MALF.VALV. MITROAORT;0
CIM10;Q24;A COMPLETER;0
CIM10;Q243;STEN. INFUNDIB.PULM.;0
CIM10;Q244;STEN.SOUS-AORT. CON.;0
CIM10;Q249;A COMPLETER;0
CIM10;Q25;A COMPLETER;0
CIM10;Q250;PERMEAB.CANAL ARTER;0
CIM10;Q26;A COMPLETER;0
CIM10;Q264;RET.VEIN. PULM. Anl;0
CIM10;Q27;A COMPLETER;0
CIM10;Q28;A COMPLETER;0
CIM10;Q289;A COMPLETER;0
CIM10;Q30;A COMPLETER;0
CIM10;Q31;A COMPLETER;0
CIM10;Q32;A COMPLETER;0
CIM10;Q33;A COMPLETER;0
CIM10;Q34;A COMPLETER;0
CIM10;Q35;A COMPLETER;0
CIM10;Q36;A COMPLETER;0
CIM10;Q37;A COMPLETER;0
CIM10;Q38;A COMPLETER;0
CIM10;Q39;A COMPLETER;0
CIM10;Q40;A COMPLETER;0
CIM10;Q41;A COMPLETER;0
CIM10;Q42;A COMPLETER;0
CIM10;Q43;A COMPLETER;0
CIM10;Q44;A COMPLETER;0
CIM10;Q442;ATRESIE  VOIES BIL.;0
CIM10;Q443;STENOSE C.VOIES BIL.;0
CIM10;Q447;MALF.CONG. FOIE,NCA;0
CIM10;Q45;A COMPLETER;0
CIM10;Q50;A COMPLETER;0
CIM10;Q51;A COMPLETER;0
CIM10;Q52;A COMPLETER;0
CIM10;Q53;A COMPLETER;0
CIM10;Q54;A COMPLETER;0
CIM10;Q55;A COMPLETER;0
CIM10;Q56;A COMPLETER;0
CIM10;Q60;AGENESIE RENALE ETC;0
CIM10;Q61;MAL. KYSTIQUES REIN;0
CIM10;Q62;A COMPLETER;0
CIM10;Q63;MALF.CONG. REIN, NCA;0
CIM10;Q64;A COMPLETER;0
CIM10;Q648;A COMPLETER;0
CIM10;Q65;A COMPLETER;0
CIM10;Q66;A COMPLETER;0
CIM10;Q67;A COMPLETER;0
CIM10;Q68;A COMPLETER;0
CIM10;Q69;A COMPLETER;0
CIM10;Q70;A COMPLETER;0
CIM10;Q71;A COMPLETER;0
CIM10;Q72;A COMPLETER;0
CIM10;Q73;A COMPLETER;0
CIM10;Q74;A COMPLETER;0
CIM10;Q75;A COMPLETER;0
CIM10;Q76;A COMPLETER;0
CIM10;Q77;A COMPLETER;0
CIM10;Q78;A COMPLETER;0
CIM10;Q79;A COMPLETER;0
CIM10;Q80;A COMPLETER;0
CIM10;Q81;A COMPLETER;0
CIM10;Q82;A COMPLETER;0
CIM10;Q83;A COMPLETER;0
CIM10;Q84;A COMPLETER;0
CIM10;Q85;A COMPLETER;0
CIM10;Q86;A COMPLETER;0
CIM10;Q87;A COMPLETER;0
CIM10;Q89;A COMPLETER;0
CIM10;Q90;A COMPLETER;0
CIM10;Q91;A COMPLETER;0
CIM10;Q92;A COMPLETER;0
CIM10;Q93;A COMPLETER;0
CIM10;Q95;A COMPLETER;0
CIM10;Q96;A COMPLETER;0
CIM10;Q97;A COMPLETER;0
CIM10;Q98;A COMPLETER;0
CIM10;Q99;A COMPLETER;0
CIM10;R00;A COMPLETER;0
CIM10;R01;A COMPLETER;0
CIM10;R02;A COMPLETER;0
CIM10;R03;A COMPLETER;0
CIM10;R04;A COMPLETER;0
CIM10;R05;A COMPLETER;0
CIM10;R06;A COMPLETER;0
CIM10;R07;A COMPLETER;0
CIM10;R09;A COMPLETER;0
CIM10;R10;A COMPLETER;0
CIM10;R11;A COMPLETER;0
CIM10;R12;A COMPLETER;0
CIM10;R13;A COMPLETER;0
CIM10;R14;A COMPLETER;0
CIM10;R15;A COMPLETER;0
CIM10;R16;A COMPLETER;0
CIM10;R17;A COMPLETER;0
CIM10;R18;A COMPLETER;0
CIM10;R19;A COMPLETER;0
CIM10;R20;A COMPLETER;0
CIM10;R21;A COMPLETER;0
CIM10;R22;A COMPLETER;0
CIM10;R23;A COMPLETER;0
CIM10;R25;A COMPLETER;0
CIM10;R26;A COMPLETER;0
CIM10;R27;A COMPLETER;0
CIM10;R270;A COMPLETER;0
CIM10;R29;A COMPLETER;0
CIM10;R30;A COMPLETER;0
CIM10;R31;A COMPLETER;0
CIM10;R32;A COMPLETER;0
CIM10;R33;A COMPLETER;0
CIM10;R34;A COMPLETER;0
CIM10;R35;A COMPLETER;0
CIM10;R36;A COMPLETER;0
CIM10;R39;A COMPLETER;0
CIM10;R40;A COMPLETER;0
CIM10;R41;A COMPLETER;0
CIM10;R42;A COMPLETER;0
CIM10;R43;A COMPLETER;0
CIM10;R44;A COMPLETER;0
CIM10;R45;A COMPLETER;0
CIM10;R46;A COMPLETER;0
CIM10;R47;A COMPLETER;0
CIM10;R48;A COMPLETER;0
CIM10;R49;A COMPLETER;0
CIM10;R50;A COMPLETER;0
CIM10;R51;A COMPLETER;0
CIM10;R52;A COMPLETER;0
CIM10;R53;A COMPLETER;0
CIM10;R54;A COMPLETER;0
CIM10;R55;A COMPLETER;0
CIM10;R56;A COMPLETER;0
CIM10;R57;A COMPLETER;0
CIM10;R58;A COMPLETER;0
CIM10;R59;A COMPLETER;0
CIM10;R60;A COMPLETER;0
CIM10;R61;A COMPLETER;0
CIM10;R62;A COMPLETER;0
CIM10;R63;A COMPLETER;0
CIM10;R64;A COMPLETER;0
CIM10;R68;A COMPLETER;0
CIM10;R69;A COMPLETER;0
CIM10;R70;A COMPLETER;0
CIM10;R71;A COMPLETER;0
CIM10;R72;A COMPLETER;0
CIM10;R73;A COMPLETER;0
CIM10;R74;A COMPLETER;0
CIM10;R75;A COMPLETER;0
CIM10;R76;A COMPLETER;0
CIM10;R77;A COMPLETER;0
CIM10;R78;A COMPLETER;0
CIM10;R79;A COMPLETER;0
CIM10;R80;A COMPLETER;0
CIM10;R81;A COMPLETER;0
CIM10;R82;A COMPLETER;0
CIM10;R83;A COMPLETER;0
CIM10;R84;A COMPLETER;0
CIM10;R85;A COMPLETER;0
CIM10;R86;A COMPLETER;0
CIM10;R87;A COMPLETER;0
CIM10;R89;A COMPLETER;0
CIM10;R90;A COMPLETER;0
CIM10;R91;A COMPLETER;0
CIM10;R92;A COMPLETER;0
CIM10;R93;A COMPLETER;0
CIM10;R94;A COMPLETER;0
CIM10;R95;A COMPLETER;0
CIM10;R96;A COMPLETER;0
CIM10;R98;A COMPLETER;0
CIM10;R99;A COMPLETER;0
CIM10;S00;A COMPLETER;0
CIM10;S01;A COMPLETER;0
CIM10;S02;A COMPLETER;0
CIM10;S03;A COMPLETER;0
CIM10;S04;A COMPLETER;0
CIM10;S05;A COMPLETER;0
CIM10;S06;A COMPLETER;0
CIM10;S07;A COMPLETER;0
CIM10;S08;A COMPLETER;0
CIM10;S09;A COMPLETER;0
CIM10;S10;A COMPLETER;0
CIM10;S11;A COMPLETER;0
CIM10;S12;A COMPLETER;0
CIM10;S13;A COMPLETER;0
CIM10;S14;A COMPLETER;0
CIM10;S15;A COMPLETER;0
CIM10;S16;A COMPLETER;0
CIM10;S17;A COMPLETER;0
CIM10;S18;A COMPLETER;0
CIM10;S19;A COMPLETER;0
CIM10;S20;A COMPLETER;0
CIM10;S21;A COMPLETER;0
CIM10;S22;A COMPLETER;0
CIM10;S23;A COMPLETER;0
CIM10;S24;A COMPLETER;0
CIM10;S25;A COMPLETER;0
CIM10;S26;A COMPLETER;0
CIM10;S27;A COMPLETER;0
CIM10;S28;A COMPLETER;0
CIM10;S29;A COMPLETER;0
CIM10;S30;A COMPLETER;0
CIM10;S31;A COMPLETER;0
CIM10;S32;A COMPLETER;0
CIM10;S33;A COMPLETER;0
CIM10;S34;A COMPLETER;0
CIM10;S35;A COMPLETER;0
CIM10;S36;A COMPLETER;0
CIM10;S37;A COMPLETER;0
CIM10;S38;A COMPLETER;0
CIM10;S39;A COMPLETER;0
CIM10;S40;A COMPLETER;0
CIM10;S41;A COMPLETER;0
CIM10;S42;A COMPLETER;0
CIM10;S43;A COMPLETER;0
CIM10;S44;A COMPLETER;0
CIM10;S45;A COMPLETER;0
CIM10;S46;A COMPLETER;0
CIM10;S47;A COMPLETER;0
CIM10;S48;A COMPLETER;0
CIM10;S49;A COMPLETER;0
CIM10;S50;A COMPLETER;0
CIM10;S51;A COMPLETER;0
CIM10;S52;A COMPLETER;0
CIM10;S53;A COMPLETER;0
CIM10;S54;A COMPLETER;0
CIM10;S55;A COMPLETER;0
CIM10;S56;A COMPLETER;0
CIM10;S57;A COMPLETER;0
CIM10;S58;A COMPLETER;0
CIM10;S59;A COMPLETER;0
CIM10;S60;A COMPLETER;0
CIM10;S61;A COMPLETER;0
CIM10;S62;A COMPLETER;0
CIM10;S63;A COMPLETER;0
CIM10;S64;A COMPLETER;0
CIM10;S65;A COMPLETER;0
CIM10;S66;A COMPLETER;0
CIM10;S67;A COMPLETER;0
CIM10;S68;A COMPLETER;0
CIM10;S69;A COMPLETER;0
CIM10;S70;A COMPLETER;0
CIM10;S71;A COMPLETER;0
CIM10;S72;A COMPLETER;0
CIM10;S73;A COMPLETER;0
CIM10;S74;A COMPLETER;0
CIM10;S75;A COMPLETER;0
CIM10;S76;A COMPLETER;0
CIM10;S77;A COMPLETER;0
CIM10;S78;A COMPLETER;0
CIM10;S79;A COMPLETER;0
CIM10;S80;A COMPLETER;0
CIM10;S81;A COMPLETER;0
CIM10;S82;A COMPLETER;0
CIM10;S83;A COMPLETER;0
CIM10;S84;A COMPLETER;0
CIM10;S85;A COMPLETER;0
CIM10;S86;A COMPLETER;0
CIM10;S87;A COMPLETER;0
CIM10;S88;A COMPLETER;0
CIM10;S89;A COMPLETER;0
CIM10;S90;A COMPLETER;0
CIM10;S91;A COMPLETER;0
CIM10;S92;A COMPLETER;0
CIM10;S93;A COMPLETER;0
CIM10;S94;A COMPLETER;0
CIM10;S95;A COMPLETER;0
CIM10;S96;A COMPLETER;0
CIM10;S97;A COMPLETER;0
CIM10;S98;A COMPLETER;0
CIM10;S99;A COMPLETER;0
CIM10;T00;A COMPLETER;0
CIM10;T01;A COMPLETER;0
CIM10;T02;A COMPLETER;0
CIM10;T03;A COMPLETER;0
CIM10;T04;A COMPLETER;0
CIM10;T05;A COMPLETER;0
CIM10;T06;A COMPLETER;0
CIM10;T07;A COMPLETER;0
CIM10;T08;A COMPLETER;0
CIM10;T09;A COMPLETER;0
CIM10;T10;A COMPLETER;0
CIM10;T11;A COMPLETER;0
CIM10;T12;A COMPLETER;0
CIM10;T13;A COMPLETER;0
CIM10;T14;A COMPLETER;0
CIM10;T15;A COMPLETER;0
CIM10;T16;A COMPLETER;0
CIM10;T17;A COMPLETER;0
CIM10;T18;A COMPLETER;0
CIM10;T19;A COMPLETER;0
CIM10;T20;A COMPLETER;0
CIM10;T21;A COMPLETER;0
CIM10;T22;A COMPLETER;0
CIM10;T23;A COMPLETER;0
CIM10;T24;A COMPLETER;0
CIM10;T25;A COMPLETER;0
CIM10;T26;A COMPLETER;0
CIM10;T27;A COMPLETER;0
CIM10;T28;A COMPLETER;0
CIM10;T29;A COMPLETER;0
CIM10;T30;A COMPLETER;0
CIM10;T31;A COMPLETER;0
CIM10;T32;A COMPLETER;0
CIM10;T33;A COMPLETER;0
CIM10;T34;A COMPLETER;0
CIM10;T35;A COMPLETER;0
CIM10;T36;A COMPLETER;0
CIM10;T37;A COMPLETER;0
CIM10;T38;A COMPLETER;0
CIM10;T39;A COMPLETER;0
CIM10;T40;A COMPLETER;0
CIM10;T41;A COMPLETER;0
CIM10;T42;A COMPLETER;0
CIM10;T43;A COMPLETER;0
CIM10;T44;A COMPLETER;0
CIM10;T45;A COMPLETER;0
CIM10;T46;A COMPLETER;0
CIM10;T47;A COMPLETER;0
CIM10;T48;A COMPLETER;0
CIM10;T49;A COMPLETER;0
CIM10;T50;A COMPLETER;0
CIM10;T51;A COMPLETER;0
CIM10;T52;A COMPLETER;0
CIM10;T53;A COMPLETER;0
CIM10;T54;A COMPLETER;0
CIM10;T55;A COMPLETER;0
CIM10;T56;A COMPLETER;0
CIM10;T57;A COMPLETER;0
CIM10;T58;A COMPLETER;0
CIM10;T59;A COMPLETER;0
CIM10;T60;A COMPLETER;0
CIM10;T61;A COMPLETER;0
CIM10;T62;A COMPLETER;0
CIM10;T63;A COMPLETER;0
CIM10;T64;A COMPLETER;0
CIM10;T65;A COMPLETER;0
CIM10;T66;A COMPLETER;0
CIM10;T67;A COMPLETER;0
CIM10;T68;A COMPLETER;0
CIM10;T69;A COMPLETER;0
CIM10;T70;A COMPLETER;0
CIM10;T71;A COMPLETER;0
CIM10;T73;A COMPLETER;0
CIM10;T74;A COMPLETER;0
CIM10;T75;A COMPLETER;0
CIM10;T78;A COMPLETER;0
CIM10;T79;A COMPLETER;0
CIM10;T80;A COMPLETER;0
CIM10;T81;A COMPLETER;0
CIM10;T82;A COMPLETER;0
CIM10;T83;A COMPLETER;0
CIM10;T84;A COMPLETER;0
CIM10;T85;A COMPLETER;0
CIM10;T86;A COMPLETER;0
CIM10;T87;A COMPLETER;0
CIM10;T88;A COMPLETER;0
CIM10;T90;A COMPLETER;0
CIM10;T91;A COMPLETER;0
CIM10;T92;A COMPLETER;0
CIM10;T93;A COMPLETER;0
CIM10;T94;A COMPLETER;0
CIM10;T95;A COMPLETER;0
CIM10;T96;A COMPLETER;0
CIM10;T97;A COMPLETER;0
CIM10;T98;A COMPLETER;0
CIM10;U000;A COMPLETER;0
CIM10;U001;A COMPLETER;0
CIM10;U002;A COMPLETER;0
CIM10;U003;A COMPLETER;0
CIM10;U004;A COMPLETER;0
CIM10;U005;A COMPLETER;0
CIM10;U006;A COMPLETER;0
CIM10;U007;A COMPLETER;0
CIM10;U008;A COMPLETER;0
CIM10;U009;A COMPLETER;0
CIM10;U010;A COMPLETER;0
CIM10;U011;A COMPLETER;0
CIM10;U012;A COMPLETER;0
CIM10;U013;A COMPLETER;0
CIM10;U014;A COMPLETER;0
CIM10;U015;A COMPLETER;0
CIM10;U016;A COMPLETER;0
CIM10;U017;A COMPLETER;0
CIM10;U018;A COMPLETER;0
CIM10;U019;A COMPLETER;0
CIM10;U020;A COMPLETER;0
CIM10;U022;A COMPLETER;0
CIM10;U023;A COMPLETER;0
CIM10;U024;A COMPLETER;0
CIM10;U025;A COMPLETER;0
CIM10;U026;A COMPLETER;0
CIM10;U027;A COMPLETER;0
CIM10;U028;A COMPLETER;0
CIM10;U029;A COMPLETER;0
CIM10;U030;A COMPLETER;0
CIM10;U032;A COMPLETER;0
CIM10;U050;A COMPLETER;0
CIM10;U051;A COMPLETER;0
CIM10;U052;A COMPLETER;0
CIM10;U053;A COMPLETER;0
CIM10;U054;A COMPLETER;0
CIM10;U055;A COMPLETER;0
CIM10;U056;A COMPLETER;0
CIM10;U057;A COMPLETER;0
CIM10;U058;A COMPLETER;0
CIM10;U059;A COMPLETER;0
CIM10;U060;A COMPLETER;0
CIM10;U061;A COMPLETER;0
CIM10;U062;A COMPLETER;0
CIM10;U063;A COMPLETER;0
CIM10;U801;A COMPLETER;0
CIM10;U802;A COMPLETER;0
CIM10;U803;A COMPLETER;0
CIM10;U804;A COMPLETER;0
CIM10;U805;A COMPLETER;0
CIM10;U806;A COMPLETER;0
CIM10;U807;A COMPLETER;0
CIM10;U808;A COMPLETER;0
CIM10;U809;A COMPLETER;0
CIM10;U810;A COMPLETER;0
CIM10;U811;A COMPLETER;0
CIM10;U812;A COMPLETER;0
CIM10;U813;A COMPLETER;0
CIM10;U814;A COMPLETER;0
CIM10;U815;A COMPLETER;0
CIM10;U816;A COMPLETER;0
CIM10;U817;A COMPLETER;0
CIM10;U818;A COMPLETER;0
CIM10;U819;A COMPLETER;0
CIM10;U820;A COMPLETER;0
CIM10;U821;A COMPLETER;0
CIM10;U822;A COMPLETER;0
CIM10;U823;A COMPLETER;0
CIM10;U824;A COMPLETER;0
CIM10;U825;A COMPLETER;0
CIM10;U826;A COMPLETER;0
CIM10;U827;A COMPLETER;0
CIM10;U828;A COMPLETER;0
CIM10;U829;A COMPLETER;0
CIM10;U830;A COMPLETER;0
CIM10;U831;A COMPLETER;0
CIM10;U832;A COMPLETER;0
CIM10;U833;A COMPLETER;0
CIM10;U834;A COMPLETER;0
CIM10;U835;A COMPLETER;0
CIM10;U836;A COMPLETER;0
CIM10;U837;A COMPLETER;0
CIM10;U838;A COMPLETER;0
CIM10;U839;A COMPLETER;0
CIM10;U840;A COMPLETER;0
CIM10;U841;A COMPLETER;0
CIM10;U842;A COMPLETER;0
CIM10;U843;A COMPLETER;0
CIM10;U844;A COMPLETER;0
CIM10;U845;A COMPLETER;0
CIM10;U846;A COMPLETER;0
CIM10;U847;A COMPLETER;0
CIM10;U848;A COMPLETER;0
CIM10;U849;A COMPLETER;0
CIM10;U850;A COMPLETER;0
CIM10;U901;A COMPLETER;0
CIM10;U902;A COMPLETER;0
CIM10;U903;A COMPLETER;0
CIM10;U904;A COMPLETER;0
CIM10;U905;A COMPLETER;0
CIM10;U906;A COMPLETER;0
CIM10;U907;A COMPLETER;0
CIM10;U908;A COMPLETER;0
CIM10;U909;A COMPLETER;0
CIM10;U910;A COMPLETER;0
CIM10;U911;A COMPLETER;0
CIM10;U912;A COMPLETER;0
CIM10;U913;A COMPLETER;0
CIM10;U914;A COMPLETER;0
CIM10;U915;A COMPLETER;0
CIM10;U916;A COMPLETER;0
CIM10;U917;A COMPLETER;0
CIM10;U918;A COMPLETER;0
CIM10;U919;A COMPLETER;0
CIM10;U920;A COMPLETER;0
CIM10;U921;A COMPLETER;0
CIM10;U922;A COMPLETER;0
CIM10;U923;A COMPLETER;0
CIM10;U924;A COMPLETER;0
CIM10;U925;A COMPLETER;0
CIM10;U926;A COMPLETER;0
CIM10;U927;A COMPLETER;0
CIM10;U928;A COMPLETER;0
CIM10;U929;A COMPLETER;0
CIM10;U930;A COMPLETER;0
CIM10;U931;A COMPLETER;0
CIM10;U932;A COMPLETER;0
CIM10;U933;A COMPLETER;0
CIM10;U934;A COMPLETER;0
CIM10;U935;A COMPLETER;0
CIM10;U936;A COMPLETER;0
CIM10;U937;A COMPLETER;0
CIM10;U938;A COMPLETER;0
CIM10;U939;A COMPLETER;0
CIM10;U940;A COMPLETER;0
CIM10;U941;A COMPLETER;0
CIM10;U942;A COMPLETER;0
CIM10;U943;A COMPLETER;0
CIM10;U944;A COMPLETER;0
CIM10;U945;A COMPLETER;0
CIM10;U946;A COMPLETER;0
CIM10;U947;A COMPLETER;0
CIM10;U948;A COMPLETER;0
CIM10;U949;A COMPLETER;0
CIM10;U950;A COMPLETER;0
CIM10;U999;A COMPLETER;0
CIM10;Z00;A COMPLETER;0
CIM10;Z01;A COMPLETER;0
CIM10;Z02;A COMPLETER;0
CIM10;Z03;A COMPLETER;0
CIM10;Z04;A COMPLETER;0
CIM10;Z08;A COMPLETER;0
CIM10;Z09;A COMPLETER;0
CIM10;Z10;A COMPLETER;0
CIM10;Z11;A COMPLETER;0
CIM10;Z12;A COMPLETER;0
CIM10;Z13;A COMPLETER;0
CIM10;Z20;A COMPLETER;0
CIM10;Z206;ENFANT  MERE SERO+.;0
CIM10;Z21;INF. ASYMPT. V.I.H.;0
CIM10;Z22;A COMPLETER;0
CIM10;Z23;A COMPLETER;0
CIM10;Z24;A COMPLETER;0
CIM10;Z25;A COMPLETER;0
CIM10;Z26;A COMPLETER;0
CIM10;Z27;A COMPLETER;0
CIM10;Z28;A COMPLETER;0
CIM10;Z29;A COMPLETER;0
CIM10;Z30;A COMPLETER;0
CIM10;Z31;A COMPLETER;0
CIM10;Z32;A COMPLETER;0
CIM10;Z33;A COMPLETER;0
CIM10;Z34;A COMPLETER;0
CIM10;Z35;A COMPLETER;0
CIM10;Z36;A COMPLETER;0
CIM10;Z37;A COMPLETER;0
CIM10;Z38;A COMPLETER;0
CIM10;Z39;A COMPLETER;0
CIM10;Z40;A COMPLETER;0
CIM10;Z41;A COMPLETER;0
CIM10;Z42;A COMPLETER;0
CIM10;Z43;A COMPLETER;0
CIM10;Z44;A COMPLETER;0
CIM10;Z45;A COMPLETER;0
CIM10;Z46;A COMPLETER;0
CIM10;Z47;A COMPLETER;0
CIM10;Z48;A COMPLETER;0
CIM10;Z49;A COMPLETER;0
CIM10;Z50;A COMPLETER;0
CIM10;Z51;A COMPLETER;0
CIM10;Z52;A COMPLETER;0
CIM10;Z53;A COMPLETER;0
CIM10;Z54;A COMPLETER;0
CIM10;Z55;A COMPLETER;0
CIM10;Z56;A COMPLETER;0
CIM10;Z57;A COMPLETER;0
CIM10;Z58;A COMPLETER;0
CIM10;Z59;A COMPLETER;0
CIM10;Z60;A COMPLETER;0
CIM10;Z61;A COMPLETER;0
CIM10;Z62;A COMPLETER;0
CIM10;Z63;A COMPLETER;0
CIM10;Z64;A COMPLETER;0
CIM10;Z65;A COMPLETER;0
CIM10;Z70;A COMPLETER;0
CIM10;Z71;A COMPLETER;0
CIM10;Z72;A COMPLETER;0
CIM10;Z73;A COMPLETER;0
CIM10;Z74;A COMPLETER;0
CIM10;Z75;A COMPLETER;0
CIM10;Z76;A COMPLETER;0
CIM10;Z80;A COMPLETER;0
CIM10;Z81;A COMPLETER;0
CIM10;Z82;A COMPLETER;0
CIM10;Z83;A COMPLETER;0
CIM10;Z84;A COMPLETER;0
CIM10;Z85;A COMPLETER;0
CIM10;Z86;A COMPLETER;0
CIM10;Z87;A COMPLETER;0
CIM10;Z88;A COMPLETER;0
CIM10;Z89;A COMPLETER;0
CIM10;Z90;A COMPLETER;0
CIM10;Z91;A COMPLETER;0
CIM10;Z92;A COMPLETER;0
CIM10;Z93;A COMPLETER;0
CIM10;Z94;A COMPLETER;0
CIM10;Z940;A COMPLETER;0
CIM10;Z941;A COMPLETER;0
CIM10;Z942;A COMPLETER;0
CIM10;Z943;GREFFE COEUR  POUMON;0
CIM10;Z944;A COMPLETER;0
CIM10;Z946;A COMPLETER;0
CIM10;Z947;A COMPLETER;0
CIM10;Z948;A COMPLETER;0
CIM10;Z95;A COMPLETER;0
CIM10;Z955;STENT VASC.CORONAIRE;0
CIM10;Z958;AUT.IMPLANT CARD,VAS;0
CIM10;Z96;A COMPLETER;0
CIM10;Z97;A COMPLETER;0
CIM10;Z98;A COMPLETER;0
CIM10;Z99;A COMPLETER;0
