{
    "fields": [
        {
            "name": "ATC5",
            "type": "string",
            "format": "default",
            "role": "code"
        },
        {
            "name": "Libelle ATC5",
            "type": "string",
            "format": "default",
            "role": "label"
        }
    ],
    "missingValues": [
        ""
    ],
    "name": "openmedic_ATC5",
    "title": "Libellé ATC5",
    "primaryKey": "ATC5"
}