{
    "fields": [
        {
            "name": "BEN_QLT_COD",
            "type": "integer",
            "format": "default",
            "role": "code"
        },
        {
            "name": "RGM_GRG_COD",
            "type": "integer",
            "format": "default"
        },
        {
            "name": "RGM_COD",
            "type": "integer",
            "format": "default"
        }
    ],
    "missingValues": [
        ""
    ],
    "name": "IR_RGM_BEQ_C",
    "title": "Compatibilité Régime d'Affiliation _ Qualité de Bénéficiaire",
    "primaryKey": [
        "BEN_QLT_COD", "RGM_GRG_COD", "RGM_COD"
    ]
}