{
    "name": "KI_CCI_R",
    "fields": [
        {
            "name": "ACC_DEB_COD",
            "description": "D\u00e9but de travail",
            "type": "integer",
            "length": "2",
            "format": "default",
            "nomenclature": "-",
            "dateCreated": "2006",
            "dateDeleted": "",
            "dateMissing": [],
            "observation": "",
            "regle_gestion": "",
            "type_oracle": "number"
        },
        {
            "name": "ACC_LIA_COD",
            "description": "Lieu d'accouchement",
            "type": "integer",
            "length": "2",
            "format": "default",
            "nomenclature": "-",
            "dateCreated": "2006",
            "dateDeleted": "",
            "dateMissing": [],
            "observation": "",
            "regle_gestion": "",
            "type_oracle": "number"
        },
        {
            "name": "ACC_PST_COD",
            "description": "Pr\u00e9sentation de l'enfant",
            "type": "integer",
            "length": "2",
            "format": "default",
            "nomenclature": "-",
            "dateCreated": "2006",
            "dateDeleted": "",
            "dateMissing": [],
            "observation": "",
            "regle_gestion": "",
            "type_oracle": "number"
        },
        {
            "name": "BEN_DCD_AME",
            "description": "Ann\u00e9e et mois du d\u00e9c\u00e8s",
            "type": "string",
            "length": "6",
            "format": "default",
            "nomenclature": "-",
            "dateCreated": "2006",
            "dateDeleted": "",
            "dateMissing": [],
            "observation": "",
            "regle_gestion": "",
            "type_oracle": "string"
        },
        {
            "name": "BEN_DCD_DTE",
            "description": "Date du d\u00e9c\u00e8s",
            "type": "date",
            "length": "20",
            "format": "default",
            "nomenclature": "-",
            "dateCreated": "2006",
            "dateDeleted": "",
            "dateMissing": [],
            "observation": "",
            "regle_gestion": "",
            "type_oracle": "date"
        },
        {
            "name": "BEN_IDT_ANO",
            "description": "Identifiant synth\u00e9tique SNDS",
            "type": "string",
            "length": "18",
            "format": "default",
            "nomenclature": "-",
            "dateCreated": "2006",
            "dateDeleted": "",
            "dateMissing": [],
            "observation": "",
            "regle_gestion": "",
            "type_oracle": "string"
        },
        {
            "name": "BEN_IDT_TOP",
            "description": "Top identifiant synth\u00e9tique SNDS",
            "type": "integer",
            "length": "2",
            "format": "default",
            "nomenclature": "-",
            "dateCreated": "2006",
            "dateDeleted": "",
            "dateMissing": [],
            "observation": "",
            "regle_gestion": "",
            "type_oracle": "number"
        },
        {
            "name": "BEN_NAI_ANN",
            "description": "Ann\u00e9e de naissance",
            "type": "string",
            "length": "4",
            "format": "default",
            "nomenclature": "-",
            "dateCreated": "2006",
            "dateDeleted": "",
            "dateMissing": [],
            "observation": "",
            "regle_gestion": "",
            "type_oracle": "string"
        },
        {
            "name": "BEN_NAI_MOI",
            "description": "Mois de naissance",
            "type": "date",
            "length": "2",
            "format": "default",
            "nomenclature": "-",
            "dateCreated": "2006",
            "dateDeleted": "",
            "dateMissing": [],
            "observation": "",
            "regle_gestion": "",
            "type_oracle": "string"
        },
        {
            "name": "BEN_NIR_ANO",
            "description": "NIR pseudonymis\u00e9 du b\u00e9n\u00e9ficiaire",
            "type": "string",
            "length": "17",
            "format": "default",
            "nomenclature": "-",
            "dateCreated": "2006",
            "dateDeleted": "",
            "dateMissing": [],
            "observation": "",
            "regle_gestion": "",
            "type_oracle": "string"
        },
        {
            "name": "BEN_RES_COM",
            "description": "Commune de domicile",
            "type": "string",
            "length": "3",
            "format": "default",
            "nomenclature": "-",
            "dateCreated": "2006",
            "dateDeleted": "",
            "dateMissing": [],
            "observation": "",
            "regle_gestion": "",
            "type_oracle": "string"
        },
        {
            "name": "BEN_RES_DPT",
            "description": "D\u00e9partement de domicile",
            "type": "string",
            "length": "3",
            "format": "default",
            "nomenclature": "-",
            "dateCreated": "2006",
            "dateDeleted": "",
            "dateMissing": [],
            "observation": "",
            "regle_gestion": "",
            "type_oracle": "string"
        },
        {
            "name": "BEN_SEX_COD",
            "description": "Sexe",
            "type": "integer",
            "length": "2",
            "format": "default",
            "nomenclature": "-",
            "dateCreated": "2006",
            "dateDeleted": "",
            "dateMissing": [],
            "observation": "",
            "regle_gestion": "",
            "type_oracle": "number"
        },
        {
            "name": "CAT_PCS_COD",
            "description": "Profession et cat\u00e9gorie socioprofessionnelle",
            "type": "string",
            "length": "4",
            "format": "default",
            "nomenclature": "-",
            "dateCreated": "2006",
            "dateDeleted": "",
            "dateMissing": [],
            "observation": "",
            "regle_gestion": "",
            "type_oracle": "string"
        },
        {
            "name": "CER_PRD_TYP",
            "description": "Type de codage utilis\u00e9",
            "type": "integer",
            "length": "8",
            "format": "default",
            "nomenclature": "-",
            "dateCreated": "2006",
            "dateDeleted": "",
            "dateMissing": [],
            "observation": "",
            "regle_gestion": "",
            "type_oracle": "number"
        },
        {
            "name": "CER_SUP_TYP",
            "description": "Type de support",
            "type": "integer",
            "length": "2",
            "format": "default",
            "nomenclature": "-",
            "dateCreated": "2006",
            "dateDeleted": "",
            "dateMissing": [],
            "observation": "",
            "regle_gestion": "",
            "type_oracle": "number"
        },
        {
            "name": "CER_VER_NUM",
            "description": "Version du certificat",
            "type": "integer",
            "length": "2",
            "format": "default",
            "nomenclature": "-",
            "dateCreated": "2006",
            "dateDeleted": "",
            "dateMissing": [],
            "observation": "",
            "regle_gestion": "",
            "type_oracle": "number"
        },
        {
            "name": "DCD_ATT_COD",
            "description": "Accident du travail",
            "type": "integer",
            "length": "2",
            "format": "default",
            "nomenclature": "-",
            "dateCreated": "2006",
            "dateDeleted": "",
            "dateMissing": [],
            "observation": "",
            "regle_gestion": "",
            "type_oracle": "number"
        },
        {
            "name": "DCD_CAU_COD",
            "description": "Recherche de la cause de d\u00e9c\u00e8s",
            "type": "integer",
            "length": "2",
            "format": "default",
            "nomenclature": "-",
            "dateCreated": "2006",
            "dateDeleted": "",
            "dateMissing": [],
            "observation": "",
            "regle_gestion": "",
            "type_oracle": "number"
        },
        {
            "name": "DCD_CIM_COD",
            "description": "Cause initiale de d\u00e9c\u00e8s",
            "type": "string",
            "length": "4",
            "format": "default",
            "nomenclature": "-",
            "dateCreated": "2006",
            "dateDeleted": "",
            "dateMissing": [],
            "observation": "",
            "regle_gestion": "",
            "type_oracle": "string"
        },
        {
            "name": "DCD_CIM_VER",
            "description": "Version CIM utilis\u00e9e pour coder les causes m\u00e9dicales de d\u00e9c\u00e8s",
            "type": "integer",
            "length": "2",
            "format": "default",
            "nomenclature": "-",
            "dateCreated": "2006",
            "dateDeleted": "",
            "dateMissing": [],
            "observation": "",
            "regle_gestion": "",
            "type_oracle": "number"
        },
        {
            "name": "DCD_CIR_COD",
            "description": "Circonstance apparente du d\u00e9c\u00e8s",
            "type": "integer",
            "length": "2",
            "format": "default",
            "nomenclature": "-",
            "dateCreated": "2006",
            "dateDeleted": "",
            "dateMissing": [],
            "observation": "",
            "regle_gestion": "",
            "type_oracle": "number"
        },
        {
            "name": "DCD_COM_COD",
            "description": "Commune de d\u00e9c\u00e8s",
            "type": "string",
            "length": "3",
            "format": "default",
            "nomenclature": "-",
            "dateCreated": "2006",
            "dateDeleted": "",
            "dateMissing": [],
            "observation": "",
            "regle_gestion": "",
            "type_oracle": "string"
        },
        {
            "name": "DCD_DPT_COD",
            "description": "D\u00e9partement de d\u00e9c\u00e8s",
            "type": "string",
            "length": "3",
            "format": "default",
            "nomenclature": "-",
            "dateCreated": "2006",
            "dateDeleted": "",
            "dateMissing": [],
            "observation": "",
            "regle_gestion": "",
            "type_oracle": "string"
        },
        {
            "name": "DCD_ENC_COD",
            "description": "Statut de grossesse si femme d\u00e9c\u00e9d\u00e9e",
            "type": "integer",
            "length": "2",
            "format": "default",
            "nomenclature": "-",
            "dateCreated": "2006",
            "dateDeleted": "",
            "dateMissing": [],
            "observation": "",
            "regle_gestion": "",
            "type_oracle": "number"
        },
        {
            "name": "DCD_FIA_COD",
            "description": "Fiabilit\u00e9 de la date de d\u00e9c\u00e8s",
            "type": "integer",
            "length": "2",
            "format": "default",
            "nomenclature": "-",
            "dateCreated": "2006",
            "dateDeleted": "",
            "dateMissing": [],
            "observation": "",
            "regle_gestion": "",
            "type_oracle": "number"
        },
        {
            "name": "DCD_GRS_COD",
            "description": "Contribution de la grossesse au d\u00e9c\u00e8s",
            "type": "integer",
            "length": "2",
            "format": "default",
            "nomenclature": "-",
            "dateCreated": "2006",
            "dateDeleted": "",
            "dateMissing": [],
            "observation": "",
            "regle_gestion": "",
            "type_oracle": "number"
        },
        {
            "name": "DCD_GRS_DEL",
            "description": "D\u00e9lai entre fin de grossesse et d\u00e9c\u00e8s",
            "type": "string",
            "length": "4",
            "format": "default",
            "nomenclature": "-",
            "dateCreated": "2006",
            "dateDeleted": "",
            "dateMissing": [],
            "observation": "",
            "regle_gestion": "",
            "type_oracle": "string"
        },
        {
            "name": "DCD_IDT_ENC",
            "description": "Identifiant d\u00e9c\u00e8s encod\u00e9",
            "type": "string",
            "length": "64",
            "format": "default",
            "nomenclature": "-",
            "dateCreated": "2006",
            "dateDeleted": "",
            "dateMissing": [],
            "observation": "",
            "regle_gestion": "",
            "type_oracle": "string"
        },
        {
            "name": "DCD_IDT_TOP",
            "description": "Top appari\u00e9 avec IR_BEN_R",
            "type": "integer",
            "length": "2",
            "format": "default",
            "nomenclature": "-",
            "dateCreated": "2006",
            "dateDeleted": "",
            "dateMissing": [],
            "observation": "",
            "regle_gestion": "",
            "type_oracle": "number"
        },
        {
            "name": "DCD_LIE_COD",
            "description": "Lieu du d\u00e9c\u00e8s",
            "type": "integer",
            "length": "2",
            "format": "default",
            "nomenclature": "-",
            "dateCreated": "2006",
            "dateDeleted": "",
            "dateMissing": [],
            "observation": "",
            "regle_gestion": "",
            "type_oracle": "number"
        },
        {
            "name": "DCD_MSU_COD",
            "description": "Mort Subite",
            "type": "integer",
            "length": "2",
            "format": "default",
            "nomenclature": "-",
            "dateCreated": "2006",
            "dateDeleted": "",
            "dateMissing": [],
            "observation": "",
            "regle_gestion": "",
            "type_oracle": "number"
        },
        {
            "name": "DCD_NEO_AGE",
            "description": "Mortalit\u00e9 n\u00e9onatale groupe d'\u00e2ge",
            "type": "integer",
            "length": "2",
            "format": "default",
            "nomenclature": "-",
            "dateCreated": "2006",
            "dateDeleted": "",
            "dateMissing": [],
            "observation": "",
            "regle_gestion": "",
            "type_oracle": "number"
        },
        {
            "name": "DCD_NRS_COD",
            "description": "Mort inattendue du nourrisson",
            "type": "integer",
            "length": "2",
            "format": "default",
            "nomenclature": "-",
            "dateCreated": "2006",
            "dateDeleted": "",
            "dateMissing": [],
            "observation": "",
            "regle_gestion": "",
            "type_oracle": "number"
        },
        {
            "name": "ETA_MAR_COD",
            "description": "Etat matrimonial",
            "type": "integer",
            "length": "2",
            "format": "default",
            "nomenclature": "-",
            "dateCreated": "2006",
            "dateDeleted": "",
            "dateMissing": [],
            "observation": "",
            "regle_gestion": "",
            "type_oracle": "number"
        },
        {
            "name": "FLX_PER_ANN",
            "description": "Ann\u00e9e de d\u00e9c\u00e8s",
            "type": "string",
            "length": "4",
            "format": "default",
            "nomenclature": "-",
            "dateCreated": "2006",
            "dateDeleted": "",
            "dateMissing": [],
            "observation": "",
            "regle_gestion": "",
            "type_oracle": "string"
        },
        {
            "name": "GRS_ORD_NUM",
            "description": "Num\u00e9ro d'ordre de l'enfant si grossesse multiple",
            "type": "integer",
            "length": "2",
            "format": "default",
            "nomenclature": "-",
            "dateCreated": "2006",
            "dateDeleted": "",
            "dateMissing": [],
            "observation": "",
            "regle_gestion": "",
            "type_oracle": "number"
        },
        {
            "name": "HOS_TRF_TOP",
            "description": "Transfert ou hospitalisation particuli\u00e8re de l'enfant",
            "type": "integer",
            "length": "2",
            "format": "default",
            "nomenclature": "-",
            "dateCreated": "2006",
            "dateDeleted": "",
            "dateMissing": [],
            "observation": "",
            "regle_gestion": "",
            "type_oracle": "number"
        },
        {
            "name": "LIE_LMV_COD",
            "description": "Codification du lieu de d\u00e9c\u00e8s si mort violente",
            "type": "integer",
            "length": "2",
            "format": "default",
            "nomenclature": "-",
            "dateCreated": "2006",
            "dateDeleted": "",
            "dateMissing": [],
            "observation": "",
            "regle_gestion": "",
            "type_oracle": "number"
        },
        {
            "name": "MER_MAR_COD",
            "description": "Etat matrimonial de la m\u00e8re",
            "type": "integer",
            "length": "2",
            "format": "default",
            "nomenclature": "-",
            "dateCreated": "2006",
            "dateDeleted": "",
            "dateMissing": [],
            "observation": "",
            "regle_gestion": "",
            "type_oracle": "number"
        },
        {
            "name": "MER_NAI_ANN",
            "description": "Ann\u00e9e de naissance de la m\u00e8re",
            "type": "string",
            "length": "4",
            "format": "default",
            "nomenclature": "-",
            "dateCreated": "2006",
            "dateDeleted": "",
            "dateMissing": [],
            "observation": "",
            "regle_gestion": "",
            "type_oracle": "string"
        },
        {
            "name": "MER_PFG_LIB",
            "description": "Profession de la m\u00e8re exerc\u00e9e pendant la grossesse",
            "type": "string",
            "length": "50",
            "format": "default",
            "nomenclature": "-",
            "dateCreated": "2006",
            "dateDeleted": "",
            "dateMissing": [],
            "observation": "",
            "regle_gestion": "",
            "type_oracle": "string"
        },
        {
            "name": "MER_PFS_COD",
            "description": "Activit\u00e9 professionnelle de la m\u00e8re",
            "type": "integer",
            "length": "2",
            "format": "default",
            "nomenclature": "-",
            "dateCreated": "2006",
            "dateDeleted": "",
            "dateMissing": [],
            "observation": "",
            "regle_gestion": "",
            "type_oracle": "number"
        },
        {
            "name": "MER_SIT_TOP",
            "description": "Top m\u00e8re en couple",
            "type": "integer",
            "length": "2",
            "format": "default",
            "nomenclature": "-",
            "dateCreated": "2006",
            "dateDeleted": "",
            "dateMissing": [],
            "observation": "",
            "regle_gestion": "",
            "type_oracle": "number"
        },
        {
            "name": "MOD_ACC_COD",
            "description": "Mode d'accouchement",
            "type": "integer",
            "length": "2",
            "format": "default",
            "nomenclature": "-",
            "dateCreated": "2006",
            "dateDeleted": "",
            "dateMissing": [],
            "observation": "",
            "regle_gestion": "",
            "type_oracle": "number"
        },
        {
            "name": "NEO_APG_SCO",
            "description": "Apgar \u00e0 une minute",
            "type": "integer",
            "length": "3",
            "format": "default",
            "nomenclature": "-",
            "dateCreated": "2006",
            "dateDeleted": "",
            "dateMissing": [],
            "observation": "",
            "regle_gestion": "",
            "type_oracle": "number"
        },
        {
            "name": "NEO_GES_AGE",
            "description": "Age gestationnel en semaines r\u00e9volues d'am\u00e9norrh\u00e9e",
            "type": "integer",
            "length": "3",
            "format": "default",
            "nomenclature": "-",
            "dateCreated": "2006",
            "dateDeleted": "",
            "dateMissing": [],
            "observation": "",
            "regle_gestion": "",
            "type_oracle": "number"
        },
        {
            "name": "NEO_NAI_POI",
            "description": "Poids de naissance en grammes",
            "type": "integer",
            "length": "5",
            "format": "default",
            "nomenclature": "-",
            "dateCreated": "2006",
            "dateDeleted": "",
            "dateMissing": [],
            "observation": "",
            "regle_gestion": "",
            "type_oracle": "number"
        },
        {
            "name": "PER_PFG_LIB",
            "description": "Profession du p\u00e8re exerc\u00e9e pendant la grossesse",
            "type": "string",
            "length": "50",
            "format": "default",
            "nomenclature": "-",
            "dateCreated": "2006",
            "dateDeleted": "",
            "dateMissing": [],
            "observation": "",
            "regle_gestion": "",
            "type_oracle": "string"
        },
        {
            "name": "PER_PFS_COD",
            "description": "Activit\u00e9 professionnelle du p\u00e8re",
            "type": "integer",
            "length": "2",
            "format": "default",
            "nomenclature": "-",
            "dateCreated": "2006",
            "dateDeleted": "",
            "dateMissing": [],
            "observation": "",
            "regle_gestion": "",
            "type_oracle": "number"
        },
        {
            "name": "PFV_ACP_COD",
            "description": "Activit\u00e9 professionnelle",
            "type": "integer",
            "length": "2",
            "format": "default",
            "nomenclature": "-",
            "dateCreated": "2006",
            "dateDeleted": "",
            "dateMissing": [],
            "observation": "",
            "regle_gestion": "",
            "type_oracle": "number"
        },
        {
            "name": "PRD_SCR_COF",
            "description": "Score de confiance obtenu",
            "type": "integer",
            "length": "8",
            "format": "default",
            "nomenclature": "-",
            "dateCreated": "2006",
            "dateDeleted": "",
            "dateMissing": [],
            "observation": "",
            "regle_gestion": "",
            "type_oracle": "number"
        },
        {
            "name": "RNG_NAI_TYP",
            "description": "Type de naissance",
            "type": "integer",
            "length": "2",
            "format": "default",
            "nomenclature": "-",
            "dateCreated": "2006",
            "dateDeleted": "",
            "dateMissing": [],
            "observation": "",
            "regle_gestion": "",
            "type_oracle": "number"
        },
        {
            "name": "TOT_ACC_NBR",
            "description": "Nombre total d'accouchements",
            "type": "integer",
            "length": "3",
            "format": "default",
            "nomenclature": "-",
            "dateCreated": "2006",
            "dateDeleted": "",
            "dateMissing": [],
            "observation": "",
            "regle_gestion": "",
            "type_oracle": "number"
        },
        {
            "name": "TOT_GRS_NBR",
            "description": "Nombre total de grossesses",
            "type": "integer",
            "length": "3",
            "format": "default",
            "nomenclature": "-",
            "dateCreated": "2006",
            "dateDeleted": "",
            "dateMissing": [],
            "observation": "",
            "regle_gestion": "",
            "type_oracle": "number"
        },
        {
            "name": "TRT_STA_COD",
            "description": "Statut de traitement",
            "type": "integer",
            "length": "2",
            "format": "default",
            "nomenclature": "-",
            "dateCreated": "2006",
            "dateDeleted": "",
            "dateMissing": [],
            "observation": "",
            "regle_gestion": "",
            "type_oracle": "number"
        },
        {
            "name": "TYP_CER_COD",
            "description": "Type de certificat",
            "type": "integer",
            "length": "2",
            "format": "default",
            "nomenclature": "-",
            "dateCreated": "2006",
            "dateDeleted": "",
            "dateMissing": [],
            "observation": "",
            "regle_gestion": "",
            "type_oracle": "number"
        },
        {
            "name": "TYP_VOL_COD",
            "description": "Type de volet",
            "type": "integer",
            "length": "2",
            "format": "default",
            "nomenclature": "-",
            "dateCreated": "2006",
            "dateDeleted": "",
            "dateMissing": [],
            "observation": "",
            "regle_gestion": "",
            "type_oracle": "number"
        }
    ],
    "title": "Table des circonstances et de la cause initiale du d\u00e9c\u00e8s",
    "produit": "Causes de d\u00e9c\u00e8s",
    "history": {
        "dateCreated": "2006",
        "dateDeleted": "",
        "dateMissing": []
    },
    "champ": "",
    "observation": "",
    "foreignKeys": [
        {
            "fields": [
                "BEN_IDT_ANO"
            ],
            "reference": {
                "resource": "IR_BEN_R",
                "fields": [
                    "BEN_IDT_ANO"
                ]
            }
        }
    ]
}