{
    "fields": [
        {
            "name": "PRS_NAT",
            "type": "integer",
            "format": "default",
            "role": "code"
        },
        {
            "name": "DPN_QLF",
            "type": "integer",
            "format": "default"
        }
    ],
    "missingValues": [
        ""
    ],
    "name": "IR_NAT_DEP_C",
    "title": "Compatibilite Nature de Prestation _ Qualificatif Depense",
    "primaryKey": [
        "PRS_NAT", "DPN_QLF"
    ]
}