ATT_ELE_MAT;ATT_ELD_MAT;ATT_ELP_MAT;ATT_ELD_LIB;TEC_COL
01;01;01;NON PRECISE - EMPLACEMENT DE TRAVAIL ET SURFACES DE CIRCULATIONS (CAS DES ACCIDENTS SURVENUS DE PLAIN-PIED);0
01;02;01;NON CLASSE - FAUX PAS ET S'EST TORDU LE PIED - PERTED'EQUILIBRE - PORTE FERMEE PAR UN TIERS OU PAR LUI-MEME, EST TOMBE EN S'ASSEYANT;0
01;03;01;SOLS (GLISSANTS OU NON, EN MAUVAIS ETAT) TROTTOIRS, SOLS DE CARRIERES, EGOUTS, SOUTERRAINS, (GLISSADES);0
01;04;01;PLANCHES A CLOUS;0
01;05;01;OBSTACLES NORMALEMENT FIXES PAR NATURE;0
01;06;01;OBSTACLES ABANDONNES OU ENTREPOSES TEMPORAIREMENT (ENCOMBREMENT);0
01;07;01;VOIES FERREES ET APPAREILS DE VOIE;0
02;01;01;NON PRECISE - EMPLACEMENTS DE TRAVAIL ET SURFACES DE CIRCULATION (CAS DES ACCIDENTS COMPORTANT UNE CHUTE AVEC DENIVELLATION);0
02;02;01;NON CLASSE - PORTES-FENETRES, BALCONS, BAIES, VOLETS, CORDES A NOEUDS, ECHELLES DE CORDES - QUAIS DE CHARGEMENT;0
02;03;01;ESCALIERS. - ESCALIERS FIXES, ESCALIERS MOBILES ET ROULANTS, ECHELLES DE MEUNIERS;0
02;04;01;ECHELLE MOBILES, ECHELLES FIXES, ESCABEAUX. - SALARIE TOMBANT D'UNE ECHELLE SUR UN AUTRE OUVRIER;0
02;05;01;ECHAFAUDAGES,COFFRAGES(A L'EXCEPTION DES SUPPORTS DE FORTUNE:CHAISES,TONNEAUX,CAISSES,ETC...),ECHAFAUDAGES VOLANTS OU ROULANTS,PLATE-FORMES ELEVATRICES,CHEMINEES,CHATEAUX D'EAU(EN CONSTRUCTION);0
02;06;01;SUPPORTS DE FORTUNE. - TRETEAUX, CHAISES, TONNEAUX, CAISSES, CHUTES DEPUIS MATIERES EMPILEES;0
02;07;01;PASSERELLES ET GALERIES SURELEVEES. - RECETTES;0
02;08;01;TOITURES, TERRASSES, VERRIERES. - FAUX PLAFONDS LEGERS;0
02;09;01;OUVERTURES DIVERSES DANS LE SOL D'UN BATIMENT TERMINE OU DE SES DEPENDANCES : FOSSES, TRAPPES, CANIVEAUX, TREMIES, SILOS ET ACCUMULATEURS DE MATIERE;0
02;10;01;OUVERTURE DANS LES SOLS DES BATIMENTS EN COURS DE CONSTRUCTION OU D'AMENAGEMENT. - AINSI QUE LES CAGES D'ASCENSEURS ET ESCALIERS EN CONSTRUCTION, (TREMIES);0
02;11;01;MATS, POTEAUX, PYLONES, CHARPENTES. - MONTAGE - LEVAGE;0
02;12;01;FOUILLES, PUITS EN CONSTRUCTION, TRANCHEES;0
02;13;01;VEHICULES A L'ARRET - CHUTES DEPUIS LA CABINE OU LE PLATEAU, L'ECHELLE DE LA CITERNE, DU CAMION, DU WAGON, DE L'AUTOCAR;0
02;14;01;MACHINES DIVERSES OU APPAREILS DIVERS. - ASCENSEURS ET PONTS ROULANTS, GRUES, ENTRETIEN ET REPARATION DES MACHINES SANS CONSIDERATION DU MOYEN D'ACCES;0
03;01;01;NON PRECISE : OBJETS EN COURS DE MANIPULATION;0
03;02;01;NON CLASSE CI-DESSOUS;0
03;03;01;PARTIE DE MACHINE OU DE MATERIEL EN COURS DE MONTAGE OU DE DEMONTAGE;0
03;04;01;OBJETS MANIPULES HABITUELLEMENT AU POSTE MEME DU TRAVAIL.;0
04;00;01;OBJETS EN COURS DE TRANSPORT MANUEL;0
05;01;01;NON PRECISE : OBJETS, MASSES, PARTICULES EN MOUVEMENT ACCIDENTEL;0
05;02;01;NON CLASSE - CHUTES D'OBJETS;0
05;03;01;OBJETS OU MASSES PROVENANT D'UN EBOULEMENT OU D'UN EFFONDREMENT (CARRIERES, GALERIES, FOUILLES...) DEMOLITION.;0
05;04;01;EFFONDREMENTS DE MATIERES STOCKEES OU EMPILEES;0
05;05;01;PARTICULES IMPUTABLES AUX MEULES. - PORTATIVES OU FIXES, RECTIFIEUSES;0
05;06;01;PARTICULES IMPUTABLES AUX AUTRES MACHINES. - PORTATIVES OU FIXES MACHINES A SOUDER, POLISSAGE;0
05;07;01;AUTRES PARTICULES (A L'EXCEPTION DES PROJECTIONS DE PRODUITS CORROSIFS, CAUSTIQUES, TOXIQUES OU RADIO-ACTIFS VISEES AUX RUBRIQUES 35 ET 40) OUTILS A MAIN, SOUFLETTES, CALAMINE, LAITIER DE SOUDURE;0
06;01;01;NON PRECISE : APPAREILS DE LEVAGE ET DE MANUTENTION;0
06;02;01;NON CLASSE - CHEVRES, BIGUES, MATS DE CHARGE, ENCAISSEUSES, DECAISSEUSES - BATIS ORIENTABLES;0
06;03;01;ASCENSEURS, MONTE-CHARGE ET AUTRES APPAREILS DE LEVAGE SUR GUIDES.SKIPS (SAUF SI C'EST UN ACCESSOIRE DE MACHINE);0
06;04;01;PONTS ROULANTS, PORTIQUES. - GRUES OU CHARIOTS PIVOTANTS SUR PORTIQUE;0
06;05;01;GRUES, DERRICKS, TITANS. - GRUES A TOUR OU A MARTEAU, GRUES VELOCIPEDES;0
06;06;01;PALANS, MOUFLES, POULIES DE LEVAGE;0
06;07;01;TREUILS. - TIRE-SACS, TIRE-PORTS, CABESTANS;0
06;08;01;CRICS, VERINS (DE MANUTENTION);0
06;09;01;CONVOYEURS (A CHAINES A ROULEAUX, TRANSROULEURS). - TAPIS ROULANTS, TRANSPORTEURS A PALETTES, RACLETTES,TRAVERSES (REDLER), SAUTERELLES, MOTORAMPES OU GERBEURS;0
06;10;01;ELEVATEURS A GODETS, VIS TRANSPORTEUSES ET AUTRES APPAREILS DE DISTRIBUTION ET D'ALIMENTATION. - TRANSPORTEURS A AIR, TRANSPORTEURS PAR INERTIE, A SECOUSSES OU VIBRANTS;0
06;11;01;CHARIOTS TRANSPORTEURS, ELEVATEURS OU GERBEURS, TRACTEURS DE CHARIOTS OU WAGONNETS SUR PNEUS;0
06;12;01;CHARIOTS DE MANUTENTION A MAIN, NON SUR RAILS (BROUETTES, DIABLES);0
06;13;01;TRANSPORTEURS SUR RAILS AERIENS, MONORAILS (TELEPHERIQUES). CARROUSSELS A PALETTE, PLATEAUX OU BALANCELLES, BLONDINS, TELESIEGES ET TELESKIS;0
06;14;01;PLANS INCLINES. - TOBOGGANS OU DESCENSEURS HELICOIDAUX (REALISES EN TOLE ET NON PAR DES TRANSPORTEURS A ROULEAUX.), GOULOTTES ET GLISSIERES, FUNICULAIRES;0
07;01;01;NON PRECISE : APPARAUX DE LEVAGE, AMARRAGE ET PREHENSION;0
07;02;01;NON CLASSE - PALETTES (ET PRATICABLES) ELECTRO-AIMANTS, HAUBANS, BITTES ET JOINTS D'AMARRAGE, CONTREPOIDS.;0
07;03;01;CHAINES;0
07;04;01;CABLES METALLIQUES;0
07;05;01;CORDAGES TEXTILES;0
07;06;01;ELINGUES. - ALLONGES;0
07;07;01;PALONNIERS, CROCHETS. - GRAPINS DENT DE LOUP;0
07;08;01;PINCES. - MORS A CHIEN, PINCES A AUTOSERRAGE, GRIFFES, VENTOUSES;0
07;09;01;SANGLES, TENDEURS ELASTIQUES.;0
08;01;01;NON PRECISE;0
08;02;01;NON CLASSE CI-DESSOUS.;0
08;03;01;VOITURES PARTICULIERES;0
08;04;01;VEHICULES UTILITAIRES DE MOINS DE 3.5 TONNES;0
08;05;01;CAMIONS DE PLUS DE 3.5 TONNES;0
08;06;01;TRANSPORTS EN COMMUN SUR ROUTE;0
08;07;01;MOTOCYCLES, VELOMOTEURS, SCOOTERS;0
08;08;01;BICYCLETTES;0
08;09;01;LOCOMOTIVES;0
08;10;01;WAGONS, WAGONNETS ET LORRIES;0
08;11;01;AVIONS, HELICOPTERES;0
08;12;01;VEHICULES AGRICOLES;0
08;13;01;PIETONS ACCROCHES PAR UN VEHICULE;0
09;01;01;NON PRECISE : MACHINES PRODUCTRICES ET TRANSFORMATRICES D'ENERGIE;0
09;02;01;NON CLASSE CI-DESSOUS. - REACTEURS, MACHINES A VAPEUR;0
09;03;01;POMPES, COMPRESSEURS, VENTILATEURS;0
09;04;01;MOTEURS A EXPLOSION ET A COMBUSTION INTERNE (CLASSER ICI LES RETOURS DE MANIVELLE);0
09;05;01;MACHINES ELECTRIQUES TOURNANTES. - ALTERNATEURS (SAUF LES RISQUES ELECTRIQUES VISES A LA RUBRIQUE 39);0
10;01;01;NON PRECISE : ORGANES DE TRANSMISSION (INTERIEURS OU EXTERIEURS AUX MACHINES);0
10;02;01;NON CLASSE CI-DESSOUS. -MANIIVELLES DE STORES;0
10;03;01;COURROIES, CABLES ET POULIES DE TRANSMISSION;0
10;04;01;CHAINES ET PIGNONS;0
10;05;01;ENGRENAGES ET REDUCTEURS;0
10;06;01;ARBRES, MANCHONS,CLAYETTES;0
10;07;01;VOLANTS (NE FAISANT PAS PARTIE INTEGRANTE D'UNE MACHINE);0
10;08;01;CYLINDRES ET CONES D'ENTRAINEMENT;0
11;01;01;NON PRECISE : MACHINES A BROYER, CONCASSER, PULVERISER, DIVISER;0
11;02;01;NON CLASSE CI-DESSOUS. - DECHIQUETEURS A PATE, HYDROPULPEURS;0
11;03;01;BROYEURS A BILLES,TUBES,CYLINDRES,ROUES(BROYEURS A MARTEAU LAIT POUDRE,DECHIQUETEURS/DEFIBREURS PAPIER,GRANULATEURS,MEULETONS,MOULIN CAFE,SABLE,PILES RAFFINEUSES,PREDECHIQUETEURS,RAFFINEURS);0
11;04;01;CONCASSEURS. - BOCARDS ET PILONS DE CONCASSAGE, MEULONS ET CASSE-FONTE;0
12;01;01;NON PRECISE : MACHINES A MALAXER OU MELANGER;0
12;02;01;NON CLASSE;0
12;03;01;MALAXEURS,MELANGEURS(A L'EXCEPTION DES MELANGEURS A CYLINDRES POUR CAOUTCHOUC ET MATIERES QUI SONT DES MACHINES A LAMINER, ET REPRIS A LA RUBRIQUE 16).-WERNER,BAMBURRY,BARATTES,APPAREILS A MOUSSE;0
12;04;01;BETONNIERES;0
12;05;01;PETRINS MELANGEURS, BOUDINEUSES A PATE;0
12;06;01;AGITATEURS A CUVE FIXE, DELAYEURS ... - SORBETIERES, CUVES DE BRASSERIE;0
13;01;01;NON PRECISE : MACHINES A CRIBLER, TAMISER, SEPARER;0
13;02;01;NON CLASSE CI-DESSOUS;0
13;03;01;CRIBLES ET TAMIS OSCILLANTS . - GRILLES DE DECOCHAGE;0
13;04;01;CRIBLES ROTATIFS, TROMMELS, BLUTERIES;0
13;05;01;ESSOREUSES CENTRIFUGES;0
13;06;01;FILTRES PRESSES;0
13;07;01;TONNEAUX ET FOULONS (TANNAGE, LAVAGE, POLISSAGE, DESSABLAGE). MACHINES A LAVER ET DEGRAISSER LE LINGE, BOULONS D'APPRET ET TEINTURE;0
13;08;01;MACHINES A DECORTIQUER ET A ECOSSER . - MACHINES A EPLUCHER;0
13;09;01;DEPOUSSIEREURS, TARARES, SEPARATEURS D'AIR;0
14;01;01;NON PRECISE : PRESSES MECANIOQUES ET PILONS;0
14;02;01;NON CLASSE CI-DESSOUS . - MACHINES A BILLER, A RETREINDRE.;0
14;03;01;PRESSES A DECOUPER, EMBOUTIR, DEFORMER LES METAUX . PLIEUSES ET PRESSES A BALANCER, BIGORNES, POINCONNEUSES;0
14;04;01;PRESSES A EMPORTE-PIECE (CUIR, CARTON, ETC... ) . - CAOUTCHOUC, PLASTIQUE, TISSU;0
14;05;01;PRESSES A IMPRIMER A PLATINE, MINERVES;0
14;06;01;MARTEAUX-PILONS, MOUTONS, MARTINETS;0
15;01;01;NON PRECISE : MACHINES A PRESSER, MOULER ET INJECTER;0
15;02;01;NON CLASSE:POINCONNEUSES A LEVIER,A MAIN,BALANCIERS ET PRESSES PLIEUSES A MAIN.PRESSES A DECOUPER ET A MARQUER LES PLIS SUR CARTON.PENDULUMS,PRESSES PNEUMATIQUES OU ELECTRIQUES,DEMANDRINEUSES;0
15;03;01;PRESSES A FORGER;0
15;04;01;PRESSES HYDRAULIQUES AUTRES QUE CELLES A FORGER . - PRESSES D'ESSAI, MACHINES A FILER (VERINS);0
15;05;01;PRESSES ET MACHINES A MOULER OU A INJECTER LE CAOUTCHOUC ET LES MATIERES PLASTIQUES . - EXTRUDEUSES, BOUDINEUSES - PRESSES A;0
15;06;01;PRESSES ET MACHINES A MOULER DES AUTRES INDUSTRIES . PASTILLEUSES,;0
15;07;01;PRESSES A SATINER ET A GAUFFRER;0
15;08;01;PRESSES A BALLES(PAPIER,TEXTILES,DECHETS METALLIQUES,ETC)PRESSES A TUILES,BRIQUES.INJECTION DE ZAMAC OU ALUMINIUM,FONDEUSES DE CLICHERIE ET LINOTYPES,POUSSOIRS,ALIMENTAIRES-EXTRULEUSES DE;0
16;01;01;NON PRECISE : MACHINES A CYLINDRES POUR LAMINER, MELANGER,PLANER, IMPRIMER;0
16;02;01;"""NON CLASSE: MACHINES A DRESSER, A ENDUIRE, A ENCOLLER; MOLETTES POUR TALONS DE PNEUMATIQUES, FORMAGE DES TUBES PAR MOLETTES, DRESSEUSES DE TUBES ET FILS""";0
16;03;01;LAMINOIRS (A L'EXCLUSION DU LAMINOIR SPECIAL A L'INDUSTRIE TEXTILE CLASSE EN RUBRIQUE 26). - BLOOMINGS, LAMINOIRS A PATE ROULEUSES, FORMEUSES, TOURNEUSES, BOULEUSES DE BOULANGERIE;0
16;04;01;MACHINES A TREFILER, BANCS D'ETIRAGE;0
16;05;01;CALANDRES, MELANGEURS A CAOUTCHOUC ET MATIERES SIMILAIRES. - LINOLEUMS ET MATIERES PLASTIQUES, MACHINES A GRAINER;0
16;06;01;MACHINES A PAPIER ET DE PAPETERIE (Y COMPRIS BOBINEUSES, DEVIDEUSES, ENROULEUSES A PAPIER). - MACHINES A MARQUER LES PLIS PAR MOLETTES;0
16;07;01;MACHINES A IMPRIMER A CYLINDRES (IL EST RAPPELE QUE LES PRESSES A PLATINE SONT CLASSEES A LA RUBRIQUE 14);0
16;08;01;MACHINES A PLANER ET A CINTRER (NOTAMMENT ROULEUSES DE TOLES);0
17;01;01;NON PRECISE : MACHINES A COUPER ET A TRANCHER (AUTRES QUE LES SCIES), A DEROULER ET DEFIBRER;0
17;02;01;NON CLASSE - ECORCEUSES, GRIGNOTEUSES, HACHE-PAILLE, HACHOIRS ET BROYEURS A VIANDE, COUPE DES BONBONS EN FORME DE BERLINGOTS OU AUTRES;0
17;03;01;CISAILLES GUILLOTINES;0
17;04;01;CISAILLES CROCODILES;0
17;05;01;CISAILLES NON MECANIQUES A LEVIER OU A PIED;0
17;06;01;CISAILLES CIRCULAIRES (A MOLETTE). - A ROULETTE OU MOLETTE POUR PLASTIQUES, CAOUTCHOUC, TISSU (PAPIER 16.06);0
17;07;01;AUTRES CISAILLES. -;0
17;08;01;MASSICOTS MECANIQUES A PAPIER;0
17;09;01;TRANCHEUSES A BOIS ET MATIERES SIMILAIRES;0
17;10;01;DEFIBREUSES A BOIS ET MATIERES SIMILAIRES, DEROULEUSES;0
17;11;01;REFENDEUSES A CUIR, TONDEUSES, RASEUSES, DERAYEUSES ET SIMILAIRES;0
17;12;01;DECOUPOIRS DE PRODUITS ALIMENTAIRES. - DIVISEUSES - PESEUSES DE BOULANGERIE, DECOUENNEUSES, CUTTERS (VOIR 18.05 POUR LE JAMBON, LE PAIN, LA VIANDE);0
18;01;01;NON PRECISE : SCIES;0
18;02;01;NON CLASSE;0
18;03;01;SCIES CIRCULAIRES A BOIS ET MATIERES SIMILAIRES;0
18;04;01;SCIES CIRCULAIRES A METAUX, - DITES AUSSI TRONCONNEUSES;0
18;05;01;AUTRES SCIES CIRCULAIRES. - SCIES OU MEULES POUR TISSUS OU VERRE, BRIQUES ET METAUX, JAMBON, PAIN, VIANDE;0
18;06;01;SCIES A RUBAN A BOIS ET MATIERES SIMILAIRES (SAUF SCIES A GRUMES);0
18;07;01;SCIES A RUBAN A GRUMES;0
18;08;01;SCIES A RUBAN A METAUX;0
18;09;01;AUTRES SCIES A RUBAN. - GUILLOTINES A PIERRE, SCIES A RUBAN POUR PLASTIQUES;0
18;10;01;SCIES ALTERNATIVES, METAUX, TISSUS, BOIS;0
18;11;01;SCIES A TRONCONNER A CHAINES, TRONCONNEUSES. - MEME PORTATIVES.;0
19;01;01;NON PRECISE : MACHINES A TOURNER, PERCER, ALESER, FRAISER, RABOTER LES METAUX;0
19;02;01;NON CLASSE - A ETINCELER, MACHINES TRANSFERT;0
19;03;01;TOURS PARALLELES. - A SPIRALER ET A RESSORT, A REPOUSSER, TOURS VERTICAUX;0
19;04;01;TOURS AUTOMATIQUES ET SEMI-AUTOMATIQUES, A DECOLLETER, (DE REPRISES) ETC... FILETEUSES;0
19;05;01;PERCEUSES, TARAUDEUSES;0
19;06;01;ALESEUSES. - VERTICALES OU HORIZONTALES;0
19;07;01;FRAISEUSES. - AUTOSHAWERS, BISEAUTEUSES -;0
19;08;01;RABOTEUSES;0
19;09;01;ETAUX LIMEURS;0
19;10;01;MORTAISEUSES;0
20;01;01;NON PRECISE : MACHINES A TOURNER, TOUPILLER, PERCER, RABOTER (BOIS ET MATIERES SIMILAIRES);0
20;02;01;NON CLASSE CI-DESSOUS. - PERCEUSES A BOIS;0
20;03;01;TOURS A BOIS. - ET A CUIR;0
20;04;01;TOURS A OUTILS ROTATIFS SEMI-AUTOMATIQUES ET AUTOMATIQUES;0
20;05;01;TOUPIES, TENONNEUSES;0
20;06;01;DEGAUCHISSEUSES;0
20;07;01;RABOTEUSES;0
20;08;01;MACHINES A RABOTER ET A MOULURER SUR PLUSIEURS FACES;0
20;09;01;MORTAISEUSES;0
20;10;01;DEFONCEUSES;0
20;11;01;MACHINES COMBINEES. - PAQUETEUSES, BOUCHONNEUSES ET JOINTEUSES;0
21;01;01;NON PRECISE : MACHINES A MEULER, PONCER, POLIR;0
21;02;01;NON CLASSE - BALLES OU BLOCS A VERRES, CABINES DE SABLAGE, SURFAGEUSES DE CAOUTCHOUC - MEULES PENDULAIRES;0
21;03;01;MEULES D'AFFUTAGE OU D'EBARBAGE (LA PIECE ETANT TENUE A LA MAIN), LAPIDAIRES;0
21;04;01;MEULES D'AFFUTAGE AUTOMATIQUES OU SEMI-AUTOMATIQUES (FRAISES, SCIES..);0
21;05;01;RECTIFIEUSES, SURFACEUSES;0
21;06;01;TOURETS A POLIR, A BRUNIR, A BROSSER;0
21;07;01;PONCEUSES. - TOURS OU TANKS A PONCER;0
22;01;01;NON PRECISE : MACHINES ET MATERIEL A SOUDER;0
22;02;01;NON CLASSE - CHALUMEAUX A GAZ, A ESSENCE, FERS ELECTRIQUES OU NON. LAMPES A SOUDER OU A BRASER;0
22;03;01;SOUDEUSES PAR RESISTANCE, PINCES A SOUDER. - (METAUX ET PLASTIQUES).;0
22;04;01;POSTES DE SOUDURE AUTOGENE, DETENDEURS, CHALUMEAUX ET TUYAUX, A L'EXCLUSION DES BOUTEILLES OU DES GENERATEURS TRAITES A LA RUBRIQUE 32;0
22;05;01;POSTES DE SOUDURE A L'ARC, PORTE ELECTRODE ET SES CABLES, COUP D'ARC (A L'EXCLUSION DES ACCIDENTS DUS A L'ELECTRICITE CLASSES A LA RUBRIQUE 39;0
22;06;01;MACHINES FIXES A DECOUPER AU CHALUMEAU;0
23;01;01;NON PRECISE : MACHINES A RIVETER, COUDRE, AGRAFER, METRE LES OEILLETS;0
23;02;01;NON CLASSE - MACHINES A SPIRALER LES CAHIERS, MACHINES A BROCHER, ENCARTER;0
23;03;01;MACHINES FIXES A RIVETER;0
23;04;01;MACHINES A COUDRE.;0
23;05;01;MACHINES A AGRAFER, A PIQUER;0
23;06;01;MACHINES A METTRE LES OEILLETS;0
24;01;01;NON PRECISE : MACHINES A REMPLIR, CONDITIONNER, EMPAQUETER, EMBALLER, CLOUER;0
24;02;01;NON CLASSE - (ENCAISSEUSES ET DECAISSEUSES 06 - 02) ERTISSEUSES (SANS REMPLISSAGE), PLACEUSE - PLIEUSES, FABRICATION DE SACS OU BOITES EN PAPIER, CARTON, EMMOULEUSES (PATISSERIE ET CONFISERIE);0
24;03;01;REMPLISSEUSES, CAPSULEUSES, BOUCHEUSES DE BOUTEILLES, SOUTIREUSES;0
24;04;01;MACHINES A REMPLIR ET A FERMER - SOUVENT AVEC SERTISSAGE, RAVIOLEUSES, BONBONS FOURRES;0
24;05;01;MACHINES A CONDITIONNER (CHOCOLAT...), EMPAQUETER, ENVELOPPER;0
24;06;01;ENSACHEUSES;0
24;07;01;MACHINES A COLLER DES ETIQUETTES;0
24;08;01;MACHINES A CLOUER. - (CAISSES ET TALONS);0
25;01;01;NON PRECISE : MACHINES A EFFILOCHER, OUVRIR, BATTRE, CARDER;0
25;02;01;NON CLASSE CI-DESSOUS;0
25;03;01;CHARGEUSES, BRISE-BALLES;0
25;04;01;OUVREUSES, EFFILOCHEUSES, BATTEURS, LOUPS;0
25;05;01;CARDES, CARDEUSES;0
26;01;01;NON PRECISE : MACHINES DE FILATURES, DE TISSAGE, DE CABLERIE ET D'APPRET (AUTRES QUE CELLES CLASSEES A LA RUBRIQUE 25);0
26;02;01;NON CLASSE - MACHINES A TRESSER OU ENROULER UNE BANDE AUTOUR DES TUYAUX ET CABLES.;0
26;03;01;ETIRAGE, LAMINOIRS, GRILLS, PEIGNEUSES. - (VOIR 16-04);0
26;04;01;BANCS A BROCHES CONTINUS, A FILER, A RETORDRE;0
26;05;01;METIERS A FILER;0
26;06;01;MACHINES DE CABLERIE (FIL FIN);0
26;07;01;BOBINOIRS MOULEURS, CANNETIERES.- ENROULEUSES ET DEROULEUSES DE TISSUS ENDUITS OU NON;0
26;08;01;OURDISSOIRS;0
26;09;01;ENCOLLEUSES;0
26;10;01;METIERS A TISSER (TEXTILES);0
26;11;01;METIERS A TISSER OU A GRILLAGER (METAUX);0
26;12;01;MACHINES A TRICOTER;0
26;13;01;CABLEUSES, TORONNEUSES, BOBINOIRS (METAUX). - SPIRALEUSES (CABLES);0
27;01;01;NON PRECISE : MATERIELS ET ENGINS DE TERRASSEMENT ET TRAVAUX ANNEXES;0
27;02;01;NON CLASSE;0
27;03;01;ENGINS DE TRANSPORT DE TERRASSEMENTS ET MATERIAUX DIVERS (CAMIONS, BENNES, DUMPERS, REMORQUES). LORSQU'IL S'AGIT D'ACCIDENTS SURVENUS, EN DEHORS DES TRAVAUX DE TERRASEMENT PROPREMENTS DITS;0
27;04;01;ENGINS D'EXCAVATION ET DE TRANSPORT COMBINES (SCRAPERS DE TOUS ODELES TRACTES OU AUTOMOTEURS);0
27;05;01;RACLEURS A CABLES (SLACKLINES, SCRAPERS A CABLE) SCRAPERETTES;0
27;06;01;REFOULEURS ET NIVELEURS A LAME FIXE OU ORIENTABLE (DOZERS, GRADERS).APPELES EGALEMENT BULLDOZERS ET ANGLEDOZERS, NIVELEUSES, CHASSE-NEIGE;0
27;07;01;EXCAVATEURS A GODET UNIQUE - PELLES MECANIQUES;0
27;08;01;EXCAVATEURS A GODETS MULTIPLES, (DRAGUES, EXCAVATEURS);0
27;09;01;DESAGREGEURS, SCARIFICATEURS (RIPPERS, CHARRUES);0
27;10;01;PELLETEUSES ET AUTRES APPAREILS DE CHARGEMENT (EUCLID, EIMCO, LOADERS...) SPECIFIQUES DES TRAVAUX DE TERRASSEMENT ET NE FIGURANT PAS A LA RUBRIQUE 06 APP. DE LEVAGE. - CHOULEURS.;0
27;11;01;DAMEURS ET COMPACTEURS (CYLINDRES, PIEDS DE MOUTON);0
27;12;01;GOUDRONNEUSES, EPANDEUSES ET AUTRES ENGINS POUR TRAVAUX ROUTIERS, PISTES ET AERODROMES;0
27;13;01;APPAREILS DE TRANSLATION ET DE MISE EN OEUVRE DU BETON (POMPES A BETON,VIBRATEURS A BETON TALOCHEUSES (OU HELICOPTERES) ET VIBREURS (ET AIGUILLES A BETON) - BENNES A BETON;0
27;14;01;SONDEUSES ET FOREUSES;0
27;15;01;ENGINS DE BATTAGE DE PIEUX SONNETTES;0
27;16;01;MATERIEL MECANIQUE DE POSE OU DE REPARATION DE VOIES FERREES;0
27;17;01;CAISSONS A AIR COMPRIME, BOUCLIERS (ON CLASSERA ICI LES ACCIDENTS DENOMMES : COUPS DE PRESSION);0
27;18;01;SCAPHANDRES;0
28;00;01;MACHINES DIVERSES NE RENTRANT DANS AUCUNE DES RUBRIQUES PRECEDENTES(10 A 27).PRESSES DE BLANCHISSERIE,MACHINES/TOURS A CONFECTIONNER LES PNEUS,IMPRESSIONS DES BANDES ADRESSOGRAPHE,LISSEUSES DE CUIR;0
29;00;01;MACHINES NON PRECISEES PAR LA DECLARATION;0
30;01;01;NON PRECISE - PISTOLETS PNEUMATIQUES SANS PRECISION DE L'OUTIL;0
30;02;01;NON CLASSE- ETAUX PNEUMATIQUES, CINTREUSES, PISTOLETS DE PEINTURE, IMMER-ROLL (OU CASH OU CONSULE) DE MATELAS;0
30;03;01;MEULES;0
30;04;01;PONCEUSES, POLISSEUSES, DISQUEUSES;0
30;05;01;VISSEUSES, SERREUSES;0
30;06;01;MARTEAUX RIVETEURS;0
30;07;01;BURINS, DERIVETEURS;0
30;08;01;PERCEUSES, CHIGNOLES;0
30;09;01;SCIES. - CIRCULAIRES OU ALTERNATIVES (SCIES SAUTEUSES);0
30;10;01;MARTEAUX PIQUEURS, MARTEAUX PNEUMATIQUES SANS PRECISION DE L'OUTIL;0
30;11;01;MARTEAUX PERFORATEURS;0
30;12;01;BRISE-BETON;0
30;13;01;PISTOLETS DE SCELLEMENT A CARTOUCHES EXPLOSIVES;0
30;14;01;TONDEUSES, FAUCHEUSES;0
31;01;01;NON PRECISE : OUTILS A MAIN;0
31;02;01;NON CLASSE - ETAUX, BALAIS, BROSSES, FERS A REPASSER (ELECTRIQUES OU NON), PERCEUSES A MAIN, CREPISSEURS - APPAREILS A CERCLER. PINCES;0
31;03;01;LIMES, RAPES.;0
31;04;01;BURINS, BROCHES, POINCONS, TRANCHES, GOUGES, CISEAUX A BOIS. POINTES A TRACER, RABOTS, VARLOPES;0
31;05;01;CISEAUX A BRANCHES ET CISAILLES. -;0
31;06;01;SCIES A MAIN;0
31;07;01;HACHES, SERPES, HERMINETTES. - HACHOIRS A MAIN, FAUX, FAUCILLES,;0
31;08;01;COUTEAUX, TRANCHETS, SERPETTES. - GRATTOIRS ET COUPE-PAPIER, SCALPELS;0
31;09;01;CROCS, CROCHETS, GAFFES. -;0
31;10;01;MARTEAUX, MASSES, MASSETTES. - MAILLETS;0
31;11;01;CLEFS. - CLEFS A GRIFFES;0
31;12;01;TOURNEVIS. -;0
31;13;01;TENAILLES, ARRACHE-CLOUS, PINCES COUPANTES;0
31;14;01;LEVIERS, PINCES DE MANUTENTION. BARRES A MINE, DEMONTE-PNEUS;0
31;15;01;PELLES, BECHES, PICS, PIOCHES, FOURCHES;0
31;16;01;COUTELAS;0
32;01;01;NON PRECISE : APPAREILS A PRESSION;0
32;02;01;NON CLASSE CI-DESSOUS;0
32;03;01;CHAUDIERES, AUTOCLAVES, CHAUDRONS;0
32;04;01;RESERVOIRS SOUS PRESSION. - CHAUFFE-EAU;0
32;05;01;BOUTEILLES;0
32;06;01;GENERATEURS D'ACETYLENE;0
32;07;01;RECIPIENTS SOUPLES (PNEUMATIQUES, VESSIES);0
32;08;01;CANALISATIONS, VANNES ET JOINTS (AUTRES QUE CEUX DES POSTES DE SOUDURE ET DES OUTILS PORTATIFS TRAITES AUX RUBRIQUES 22 ET 30) PIPE-LINES;0
33;01;01;NON PRECISE : APPAREILS OU USTENSILES METTANT EN OEUVRE DES PRODUITS CHAUDS, FOURS, ETUVES, APPAREILS DE CUISSON...;0
33;02;01;NON CLASSE - BRULEURS, EAU CHAUDE, RADIATEURS DE MOTEURS THERMIQUE;0
33;03;01;HAUTS FOURNEAUX (SAUF CAS D'INTOXICATION PAR L'OXYDE DE CARBONE A CLASSER A LA RUBRIQUE 36);0
33;04;01;CUBILLOTS (SAUF CAS D'INTOXICATION PAR L'OXYDE DE CARBONE A CLASSER A LA RUBRIQUE 36);0
33;05;01;FOURS DE FUSION, CONVERTISSEURS (CLASSER ICI EN PARTICULIER : FOURS MARTIN, DE VERRERIE...);0
33;06;01;FOURS DE TRAITEMENT, DE RECHAUFFAGE, DE CUISSON (LES FOURS A CHAUX, CIMENT, CERAMIQUE... SONT A CLASSER DANS CETTE RUBRIQUE) BOUILLEURS, CUISEURS, RECHAUDS ET CUISINIERES, GRILLOIRS;0
33;07;01;APPAREILS DE CHAUFFAGE . - POELES, BRASEROS, RADIATEURS, AEROTHERMES;0
33;08;01;POCHES DE COULEE, CREUSETS, LINGOTIERES, LOUCHES, POTS. - TUYAUX DE COULEE;0
33;09;01;CANNES DE VERRIERS, CHASSIS, MOULES ET COQUILLES DE FONDERIE, PIECES CHAUDES DE FORGE OU DE FONDERIE;0
33;10;01;ETUVES, SECHOIRS. - PASTEURISATEURS, RECHAUFFEURS, LAVEUSES, (BOUTEILLES ET VAISSELLE), SECHOIRS ROTATIFS OU NON;0
33;11;01;BAINS DE TREMPE, BAINS DE TRAITEMENT THERMIQUE.;0
34;00;01;APPAREILLAGE ET INSTALLATIONS FRIGORIFIQUES A L'EXCEPTION DES ACCIDENTS PROVENANT DES ELEMENTS OU DES APPAREILLAGES DEJA CLASSES A D'AUTRES RUBRIQUES - CONDITIONNEMENT D'AIR;0
35;01;01;NON PRECISE : APPAREILS OU USTENSILES METTANT EN OEUVRE DES PRODUITS CAUSTIQUES, CORROSIFS, TOXIQUES;0
35;02;01;NON CLASSE - CIMENTS, SOLVANTS, MACHINES A DEGRAISSER AU TRI OU AU PERCHLO SAUF LES TEXTILES;0
35;03;01;BAINS ET APPAREILS DE TRAITEMENT CHIMIQUE (GALVANISATION, ETAMAGE...);0
35;04;01;BAINS ET APPAREILS DE TRAITEMENT ELECTROLYTIQUE (CHROMAGE). - CYANURES;0
35;05;01;CITERNES, TANCKS, BONBONNES, VIDE-TOURIES, BOUTEILLES. - ACIDES ET BASES (SOUDE, POTASSE);0
35;06;01;PIPETTES, SIPHONS, CANALISATIONS;0
36;01;01;NON PRECISE : VAPEURS, GAZ ET POUSSIERES DELETERES;0
36;02;01;NON CLASSE;0
36;03;01;OXYDE DE CARBONE. - SEUL OU EN MELANGE (GAZ DE VILLE) ASPHYXIE PAR TOUS MOYENS DE CHAUFFAGE (CUISINIERES ET RECHAUDS, CHAUFFE-EAU, POELES A COMBUSTION LENTE...);0
36;04;01;GAZ D'ECLAIRAGE, DE HAUT FOURNEAU, D'ECHAPPEMENT.;0
36;05;01;EMANATIONS DE FOSSES, SOUTERRAINS, EGOUTS, CITERNES;0
36;06;01;AUTRES GAZ ET VAPEURS DELETERES. - GAZ CARBONIQUE, BUTANE ET AUTRE PROPANE (CONFINEMENT);0
36;07;01;POUSSIERES DELETERES OU TOXIQUES. - BRAI DE HOUILLE;0
37;01;01;NON PRECISE : MATIERES COMBUSTILES EN FLAMMES;0
37;02;01;NON CLASSE CI-DESSOUS;0
37;03;01;GAZ;0
37;04;01;ETHER, SULFURE DE CARBONE;0
37;05;01;ESSENCES, BENZOLS, ALCOOLS;0
37;06;01;AUTRES LIQUIDES;0
37;07;01;SOLIDES DERIVES DE LA CELLULOSE (CELLULOID, ACETATE...);0
37;08;01;AUTRES SOLIDES, SCORIES.;0
38;01;01;NON PRECISE : MATIERES EXPLOSIVES;0
38;02;01;NON CLASSE CI-DESSOUS. - REACTIONS CHIMIQUES EXPLOSIVES;0
38;03;01;EXPLOSIFS OU ARTIFICES EN APPROVISIONNEMENT ET FABRICATION;0
38;04;01;EXPLOSIFS OU ARTIFICES EN COURS D'EMPLOI;0
38;05;01;DISPOSITIFS DE MISE A FEU;0
38;06;01;MELANGES EXPLOSIFS AIR-GAZ;0
38;07;01;MELANGES EXPLOSIFS AIR-POUSSIERES;0
39;01;01;NON PRECISE : ELECTRICITE;0
39;02;01;NON CLASSE - TRANSFORMATEURS MOBILES BT ET FLASHES CIRCUITS FIXES HT, ENSEIGNES LUMINEUSES;0
39;03;01;INSTALLATIONS FIXES BASSE TENSION (Y COMPRIS LES MACHINES);0
39;04;01;PONTS ROULANTS (TROLLEYS ET APPAREILS DE COMMANDE). - GRUES ET PALANS, SAUTERELLES;0
39;05;01;MACHINES-OUTILS PORTATIVES. - OU MOBILES, APPAREILS D'ANESTHESIE ELECTRIQUE D'ABATTAGE;0
39;06;01;MACHINES ET APPAREILS DE SOUDURE ELECTRIQUE (IL EST RAPELE QUE LES COUPS D'ARC SONT CLASSES A LA RUBRIQUE 22);0
39;07;01;LAMPES PORTATIVES (BALLADEUSES, LAMPES TEMOINS);0
39;08;01;PLATEFORME D'ESSAIS;0
39;09;01;POSTE DE TRANSFORMATION, COTE B.T.;0
39;10;01;POSTE DE TRANSFORMATION, COTE H.T.;0
39;11;01;LIGNES AERIENNES B.T.;0
39;12;01;LIGNES AERIENNES H.T.;0
39;13;01;CANALISATIONS ENTERREES;0
39;14;01;MATERIEL A HAUTE FREQUENCE.;0
40;01;01;RAYONNEMENTS IONISANTS ET SUBSTANCES RADIOACTIVES (IRRADIATIONS BRUTALES SEULEMENT);0
40;02;01;RAYONNEMENTS NON IONISANTS - LASERS;0
88;88;88;Valeur Inconnue;1
98;01;01;AGENTS MATERIELS, NON CLASSES AILLEURS (A L'EXCEPTION DES MACHINES QUI SONT REPRISES A LA RUBRIQUE 28). CONGESTIONS DUES AU FROID ET AUX INONDATIONS;0
98;02;01;INCENDIES DES LOCAUX DE TRAVAIL;0
98;03;01;RIXES ET ATTENTATS;0
98;04;01;JEUX ET SPORTS;0
98;05;01;ANIMAUX;0
98;06;01;INSECTES;0
98;07;01;ENGINS DE GUERRE;0
98;08;01;FOUDRE;0
98;09;01;INSOLATIONS.;0
98;10;01;AGRESSION A L ARME BLANCHE (COUTELAS, ETC ...);0
98;11;01;AGRESSION PAR ARMES A FEU OU EXPLOSIFS;0
99;00;01;DECLARATIONS NON CLASSEES FAUTE DE DONNEES SUFFISANTES MALAISES, MORT SUBITE OU NON;0
