{
    "name": "T_SSRaaE",
    "fields": [
        {
            "name": "ETA_NUM",
            "description": "N\u00b0FINESS",
            "type": "string",
            "length": "9",
            "format": "default",
            "nomenclature": "-",
            "dateCreated": "2005",
            "dateDeleted": "nan",
            "dateMissing": [],
            "observation": "",
            "regle_gestion": "",
            "type_oracle": "string"
        },
        {
            "name": "SOC_RAI",
            "description": "Raison sociale",
            "type": "string",
            "length": "60",
            "format": "default",
            "nomenclature": "-",
            "dateCreated": "2005",
            "dateDeleted": "nan",
            "dateMissing": [],
            "observation": "",
            "regle_gestion": "",
            "type_oracle": "string"
        },
        {
            "name": "REG_ETA",
            "description": "R\u00e9gion",
            "type": "string",
            "length": "30",
            "format": "default",
            "nomenclature": "-",
            "dateCreated": "2005",
            "dateDeleted": "nan",
            "dateMissing": [],
            "observation": "",
            "regle_gestion": "",
            "type_oracle": "string"
        },
        {
            "name": "ANN_TRT",
            "description": "N\u00b0 du trimestre PMSI transmis",
            "type": "string",
            "length": "7",
            "format": "default",
            "nomenclature": "-",
            "dateCreated": "2005",
            "dateDeleted": "nan",
            "dateMissing": [],
            "observation": "",
            "regle_gestion": "",
            "type_oracle": "string"
        },
        {
            "name": "STA_ETA",
            "description": "Statut de l'\u00e9tablissement",
            "type": "string",
            "length": "3",
            "format": "default",
            "nomenclature": "-",
            "dateCreated": "2005",
            "dateDeleted": "nan",
            "dateMissing": [],
            "observation": "",
            "regle_gestion": "",
            "type_oracle": "string"
        },
        {
            "name": "VAL_ETA",
            "description": "Validation des donn\u00e9es",
            "type": "string",
            "length": "20",
            "format": "default",
            "nomenclature": "-",
            "dateCreated": "2005",
            "dateDeleted": "nan",
            "dateMissing": [],
            "observation": "",
            "regle_gestion": "",
            "type_oracle": "string"
        },
        {
            "name": "ETB_EXE_FIN",
            "description": "N\u00b0FINESS sans cl\u00e9",
            "type": "string",
            "length": "8",
            "format": "default",
            "nomenclature": "-",
            "dateCreated": "2005",
            "dateDeleted": "nan",
            "dateMissing": [],
            "observation": "Variable cr\u00e9\u00e9e par CNAMTS",
            "regle_gestion": "",
            "type_oracle": "string"
        },
        {
            "name": "COM_ETA",
            "description": "Commentaires",
            "type": "string",
            "length": "50",
            "format": "default",
            "nomenclature": "-",
            "dateCreated": "2020",
            "dateDeleted": "nan",
            "dateMissing": [],
            "observation": "",
            "regle_gestion": "",
            "type_oracle": "string"
        }
    ],
    "title": "Etablissement",
    "produit": "PMSI SSR",
    "history": {
        "dateCreated": "2005",
        "dateDeleted": "",
        "dateMissing": []
    },
    "champ": "Public et Priv\u00e9",
    "observation": "",
    "foreignKeys": [
        {
            "fields": [
                "ETA_NUM"
            ],
            "reference": {
                "resource": "T_SSRaaB",
                "fields": [
                    "ETA_NUM"
                ]
            }
        }
    ]
}