{
  "fields": [
    {
      "format": "default",
      "name": "PSE_ACT_SNDS",
      "role": "code",
      "type": "integer"
    },
    {
      "format": "default",
      "name": "PSE_ACT_LIB",
      "role": "label",
      "type": "string"
    }
  ],
  "missingValues": [],
  "name": "PSE_ACT_SNDS",
  "primaryKey": "PSE_ACT_SNDS",
  "title": "Nature d'activit\u00e9 du professionnel de sant\u00e9 ex\u00e9cutant (OPEN DAMIR)"
}
