{
  "fields": [
    {
      "format": "default",
      "name": "ORG_CLE_REG",
      "role": "code",
      "type": "integer"
    },
    {
      "format": "default",
      "name": "ORG_CLE_LIB",
      "role": "label",
      "type": "string"
    }
  ],
  "missingValues": [],
  "name": "ORG_CLE_REG",
  "primaryKey": "ORG_CLE_REG",
  "title": "R\u00e9gion de l'organisme de liquidation (OPEN DAMIR)"
}
