{
  "fields": [
    {
      "format": "default",
      "name": "ATC2",
      "type": "string"
    },
    {
      "format": "default",
      "name": "Libell\u00c3\u00a9 ATC2",
      "type": "string"
    }
  ],
  "missingValues": [
    ""
  ],
  "name": "openmedic_ATC2",
  "primaryKey": "ATC2",
  "title": "Libell\u00e9 ATC2"
}
