{
  "fields": [
    {
      "format": "default",
      "name": "PSE_STJ_SNDS",
      "role": "code",
      "type": "integer"
    },
    {
      "format": "default",
      "name": "PSE_STJ_LIB",
      "role": "label",
      "type": "string"
    }
  ],
  "missingValues": [],
  "name": "PSE_STJ_SNDS",
  "primaryKey": "PSE_STJ_SNDS",
  "title": "Statut juridique du professonnel de sant\u00e9 ex\u00e9cutant (OPEN DAMIR)"
}
