{
  "fields": [
    {
      "format": "default",
      "name": "ATC1",
      "type": "string"
    },
    {
      "format": "default",
      "name": "Libell\u00e9 ATC1",
      "type": "string"
    }
  ],
  "missingValues": [
    ""
  ],
  "name": "openmedic_ATC1",
  "primaryKey": "ATC1",
  "title": "Libell\u00e9 ATC1"
}
