{
  "fields": [
    {
      "format": "default",
      "name": "PSP_ACT_CAT",
      "role": "code",
      "type": "integer"
    },
    {
      "format": "default",
      "name": "PSP_ACT_LIB",
      "role": "label",
      "type": "string"
    }
  ],
  "missingValues": [],
  "name": "PSP_ACT_CAT",
  "primaryKey": "PSP_ACT_CAT",
  "title": "Cat\u00e9gorie d'activit\u00e9 du prescripteur (OPEN DAMIR)"
}
