{
  "fields": [
    {
      "format": "default",
      "name": "PSP_STJ_SNDS",
      "role": "code",
      "type": "integer"
    },
    {
      "format": "default",
      "name": "PSP_STJ_LIB",
      "role": "label",
      "type": "string"
    }
  ],
  "missingValues": [],
  "name": "PSP_STJ_SNDS",
  "primaryKey": "PSP_STJ_SNDS",
  "title": "Statut juridique du professonnel de sant\u00e9 prescripteur (OPEN DAMIR)"
}
