<?xml version="1.0" encoding="utf-8"?>
<!-- Generator: Adobe Illustrator 18.0.0, SVG Export Plug-In . SVG Version: 6.00 Build 0)  -->
<!DOCTYPE svg PUBLIC "-//W3C//DTD SVG 1.1//EN" "http://www.w3.org/Graphics/SVG/1.1/DTD/svg11.dtd">
<svg version="1.1" id="Layer_1" xmlns="http://www.w3.org/2000/svg" xmlns:xlink="http://www.w3.org/1999/xlink" x="0px" y="0px"
	 viewBox="0 0 200 200" enable-background="new 0 0 200 200" xml:space="preserve">
<rect fill="#CA2B26" width="200" height="200"/>
<g>
	<path fill="#FFFFFF" d="M90.9,96.1c0,1.9,0.9,3.8,2.6,5.7c1.7,1.8,3.8,3.7,6.2,5.5c2.4,1.8,4.8,3.8,7.3,5.9
		c2.4,2.1,4.5,4.9,6.2,8.3c1.7,3.4,2.6,7.2,2.6,11.4c0,4.8-1.3,9.4-3.9,13.9c-3.8,6.5-9.5,11.3-16.9,14.4
		c-7.4,3.1-15.4,4.6-23.9,4.6c-7.1,0-13.6-1.1-19.8-3.3s-10.7-5.9-13.7-11c-2-3.2-3-6.7-3-10.5c0-4.3,1.2-8.3,3.6-12
		c2.4-3.7,5.5-6.8,9.5-9.2c7-4.4,17.8-7.1,32.4-8c-1.7-2.2-3-4.2-3.8-5.9c-0.8-1.7-1.2-3.7-1.2-5.9c0-1.9,0.6-4.2,1.7-6.8
		c-2.5,0.2-4.3,0.3-5.5,0.3c-7.9,0-14.6-2.6-20-7.7c-5.4-5.2-8.1-11.7-8.1-19.6c0-4.4,1-8.6,2.9-12.7c1.9-4.1,4.6-7.6,7.9-10.5
		c4.1-3.5,9-6.1,14.6-7.9c5.6-1.7,11.5-2.6,17.4-2.6h33.5l-11.1,7.1H97.9c4,3.4,6.9,6.9,9,10.7c2,3.7,3,8,3,12.8
		c0,3.8-0.7,7.3-2,10.4s-2.9,5.6-4.7,7.5c-1.8,1.9-3.7,3.6-5.6,5.2c-1.9,1.6-3.5,3.2-4.8,4.9C91.6,92.5,90.9,94.3,90.9,96.1z
		 M79.4,158.4c3.1,0,6.1-0.3,8.9-1c2.9-0.7,5.5-1.7,7.9-3.1c2.4-1.4,4.4-3.3,5.9-5.9c1.5-2.5,2.2-5.4,2.2-8.7c0-1.3-0.2-2.6-0.6-3.9
		c-0.4-1.3-0.8-2.4-1.2-3.4c-0.4-1-1.1-2.1-2.2-3.3c-1-1.3-1.8-2.2-2.4-2.8c-0.5-0.6-1.6-1.5-3.1-2.8c-1.5-1.2-2.5-2-2.9-2.3
		c-0.4-0.3-1.5-1.1-3.3-2.4c-1.8-1.3-2.8-2-2.9-2.1c-0.9-0.1-2.1-0.2-3.8-0.2c-2.8,0-5.6,0.2-8.4,0.6c-2.8,0.4-5.7,1-8.6,2
		c-3,1-5.6,2.2-7.8,3.7c-2.2,1.5-4,3.5-5.5,6c-1.4,2.5-2.2,5.3-2.2,8.5c0,3.7,0.9,7,2.8,9.9c1.9,2.9,4.3,5.1,7.3,6.7
		c3,1.6,6.2,2.8,9.5,3.5C72.5,158,75.9,158.4,79.4,158.4z M79.2,88.4c2,0,4.1-0.4,6.3-1.3c2.1-0.9,3.9-2,5.3-3.5
		c2.8-3,4.2-7.3,4.2-12.7c0-3.1-0.5-6.4-1.4-10c-0.9-3.6-2.2-7-3.9-10.4s-3.9-6.1-6.8-8.3s-6-3.3-9.4-3.3c-2.2,0-4.4,0.5-6.6,1.6
		c-2.2,1-3.9,2.4-5.3,4.2c-2.5,3.2-3.8,7.4-3.8,12.8c0,2.5,0.3,5.1,0.8,7.8c0.5,2.8,1.4,5.5,2.5,8.3c1.1,2.8,2.5,5.2,4.2,7.4
		c1.6,2.2,3.6,4,6,5.4C73.9,87.7,76.5,88.4,79.2,88.4z M144.3,88.2h17.1v8.7h-17.1v17.6h-8.4V96.8h-17v-8.7h17V70.8h8.4V88.2z"/>
</g>
</svg>
