44af2840126c
72d295015933
2ee8be1253b1
b4ec02935f66
723485afd304
dca63284c7db
7c7176024b27
e6558809156f
2cf432368844
027ca5b5b674
805ec0f6f274
4ac144f5dbb1
7263893f70dd
da5c1604e915
e40439c99382
56e52313dbdb
cc2f71707218
f4cfa269d51c
6854fdd016d1
988d46b3ce78
f02f4b06c2d8
e655880915e8
ae97b514dfd7
342d0d46cdcb
30074de700ec
964c18550383
daa1197d1972
b04a39148644
b827eb921194
7495ece7fb47
8a81998f3d84
92de44390aa4
84f3eb0a12e2
ec8c9a5eb370
e4a7a08a2311
d2b50e0a98b9
5a59404deb41
aa1065dcb69b
2ea8537f8fec
c2b07ff47ecf
08c5e1f93b33
620c0204de74
5ae4a663425e
92bae9b98ffa
9c28bfce1577
128a0a744744
4c6641be6039
b827eb1ca582
0a85f1f7e272
dc15c8dc3c18
f275e64a721d
58b10f7e9384
7c50796c267c
d81265ccb95d
d6a202667787
4a1102818b38
044eafc37cc8
84cfbf94ef1c
be93edcf2230
e2280ec2531b
5622869451f4
5ada57062746
fa0735f7e057
5c51814b176d
ced8e4c08096
daa1198374ec
f297793cd510
52005e5fbc1e
526afd599c62
d2d6ef0bf52d
fa733238c033
060256c45207
404e361b30d9
f0272dad32c1
daa119d5545b
daa11988c409
d8557529aafd
42205a61ab53
a2b50e17cc3a
daa119ed5d07
b827ebb341d6
365c086109bc
e23f4dd56721
226fdb607b8a
daa119fc0fe8
c8d7b0b2e6d0
6c88145cd4dc
88365fb3e905
d4c94b5d0b95
daa1190a4642
001a138829d4
b69b9e58808e
068383a6d976
9eabe4051eec
dca632530c85
b894365355f0
b0a460d99554
daa119018598
04d6aae5fc34
dca63267e227
70288ba889f1
ac7a4d44814a
2afed57f1766
0a77d8da60db
542758ee06a1
ccce1e6ac107
50eb71b48e30
3074968f9f87
24181dc0fb62
2c91ab3d68f4
0c54150c1908
f25fa8589158
5681c4136eb7
2289b325d7fd
849866dc2dd9
6cc7ec8f283b
4083ded08fb7
7cff4dc76e0c
38b8003cb7e6
001020ab962a
5a1a7c17889f
44af2840a8f8
bcddc2241b55
3800259fa510
c0b6f96f3fc9
40704a057ec1
e0286dbbd2c1
380025a1ce35
7e0b707d604d
fe612b2a0370
388b59ae4509
3cfa43ecb4d8
7470fd1b5d2d
020000000000
484520cc4d90
3800259f41a6
a65328b887e6
840d8e6f8e05
bc17b8bd3f03
541473150653
c4dd572189ce
dc15c8dc3ba8
e45f01876b77
586c25b3e291
b827eb37cf56
44af284001be
84f3eb22ba02
803253672b7c
dc15c8dc3813
f008d1d049d4
b827ebd047e2
e45f01877415
b4293d02c562
e45f013e6678
b827ebb3b8ae
e02be98eabe8
001343aa68df
