[
  {
    "from": {
      "name": "aws-ip-ranges",
      "version": "0.391.0"
    },
    "to": {
      "name": "serde",
      "version": "1.0.203"
    },
    "range": ""
  },
  {
    "from": {
      "name": "aws-ip-ranges",
      "version": "0.391.0"
    },
    "to": {
      "name": "serde_json",
      "version": "1.0.118"
    },
    "range": ""
  },
  {
    "from": {
      "name": "proc-macro2",
      "version": "1.0.86"
    },
    "to": {
      "name": "unicode-ident",
      "version": "1.0.12"
    },
    "range": ""
  },
  {
    "from": {
      "name": "quote",
      "version": "1.0.36"
    },
    "to": {
      "name": "proc-macro2",
      "version": "1.0.86"
    },
    "range": ""
  },
  {
    "from": {
      "name": "serde",
      "version": "1.0.203"
    },
    "to": {
      "name": "serde_derive",
      "version": "1.0.203"
    },
    "range": ""
  },
  {
    "from": {
      "name": "serde_derive",
      "version": "1.0.203"
    },
    "to": {
      "name": "proc-macro2",
      "version": "1.0.86"
    },
    "range": ""
  },
  {
    "from": {
      "name": "serde_derive",
      "version": "1.0.203"
    },
    "to": {
      "name": "quote",
      "version": "1.0.36"
    },
    "range": ""
  },
  {
    "from": {
      "name": "serde_derive",
      "version": "1.0.203"
    },
    "to": {
      "name": "syn",
      "version": "2.0.68"
    },
    "range": ""
  },
  {
    "from": {
      "name": "serde_json",
      "version": "1.0.118"
    },
    "to": {
      "name": "itoa",
      "version": "1.0.11"
    },
    "range": ""
  },
  {
    "from": {
      "name": "serde_json",
      "version": "1.0.118"
    },
    "to": {
      "name": "ryu",
      "version": "1.0.18"
    },
    "range": ""
  },
  {
    "from": {
      "name": "serde_json",
      "version": "1.0.118"
    },
    "to": {
      "name": "serde",
      "version": "1.0.203"
    },
    "range": ""
  },
  {
    "from": {
      "name": "syn",
      "version": "2.0.68"
    },
    "to": {
      "name": "proc-macro2",
      "version": "1.0.86"
    },
    "range": ""
  },
  {
    "from": {
      "name": "syn",
      "version": "2.0.68"
    },
    "to": {
      "name": "quote",
      "version": "1.0.36"
    },
    "range": ""
  },
  {
    "from": {
      "name": "syn",
      "version": "2.0.68"
    },
    "to": {
      "name": "unicode-ident",
      "version": "1.0.12"
    },
    "range": ""
  }
]
