{
  "bomFormat": "CycloneDX",
  "specVersion": "1.4",
  "serialNumber": "urn:uuid:e1f33e25-ca1b-4c17-8d2d-705f13471e3d",
  "version": 1,
  "metadata": {
    "timestamp": "2023-03-13T11:15:31Z",
    "tools": [
      {
        "vendor": "GitLab",
        "name": "Gemnasium",
        "version": "not-configured"
      }
    ],
    "authors": [
      {
        "name": "GitLab",
        "email": "support@gitlab.com"
      }
    ],
    "properties": [
      {
        "name": "gitlab:dependency_scanning:input_file:path",
        "value": "yarn.lock"
      },
      {
        "name": "gitlab:dependency_scanning:package_manager:name",
        "value": "yarn"
      },
      {
        "name": "gitlab:meta:schema_version",
        "value": "1"
      }
    ]
  },
  "components": [
    {
      "name": "accepts",
      "version": "1.2.13",
      "purl": "pkg:npm/accepts@1.2.13",
      "type": "library",
      "bom-ref": "pkg:npm/accepts@1.2.13"
    },
    {
      "name": "accepts",
      "version": "1.3.8",
      "purl": "pkg:npm/accepts@1.3.8",
      "type": "library",
      "bom-ref": "pkg:npm/accepts@1.3.8"
    },
    {
      "name": "base64-url",
      "version": "1.2.1",
      "purl": "pkg:npm/base64-url@1.2.1",
      "type": "library",
      "bom-ref": "pkg:npm/base64-url@1.2.1"
    },
    {
      "name": "basic-auth",
      "version": "1.0.4",
      "purl": "pkg:npm/basic-auth@1.0.4",
      "type": "library",
      "bom-ref": "pkg:npm/basic-auth@1.0.4"
    },
    {
      "name": "basic-auth-connect",
      "version": "1.0.0",
      "purl": "pkg:npm/basic-auth-connect@1.0.0",
      "type": "library",
      "bom-ref": "pkg:npm/basic-auth-connect@1.0.0"
    },
    {
      "name": "batch",
      "version": "0.5.3",
      "purl": "pkg:npm/batch@0.5.3",
      "type": "library",
      "bom-ref": "pkg:npm/batch@0.5.3"
    },
    {
      "name": "body-parser",
      "version": "1.13.3",
      "purl": "pkg:npm/body-parser@1.13.3",
      "type": "library",
      "bom-ref": "pkg:npm/body-parser@1.13.3"
    },
    {
      "name": "bytes",
      "version": "2.1.0",
      "purl": "pkg:npm/bytes@2.1.0",
      "type": "library",
      "bom-ref": "pkg:npm/bytes@2.1.0"
    },
    {
      "name": "bytes",
      "version": "2.4.0",
      "purl": "pkg:npm/bytes@2.4.0",
      "type": "library",
      "bom-ref": "pkg:npm/bytes@2.4.0"
    },
    {
      "name": "commander",
      "version": "2.6.0",
      "purl": "pkg:npm/commander@2.6.0",
      "type": "library",
      "bom-ref": "pkg:npm/commander@2.6.0"
    },
    {
      "name": "compressible",
      "version": "2.0.18",
      "purl": "pkg:npm/compressible@2.0.18",
      "type": "library",
      "bom-ref": "pkg:npm/compressible@2.0.18"
    },
    {
      "name": "compression",
      "version": "1.5.2",
      "purl": "pkg:npm/compression@1.5.2",
      "type": "library",
      "bom-ref": "pkg:npm/compression@1.5.2"
    },
    {
      "name": "connect",
      "version": "2.30.2",
      "purl": "pkg:npm/connect@2.30.2",
      "type": "library",
      "bom-ref": "pkg:npm/connect@2.30.2"
    },
    {
      "name": "connect-timeout",
      "version": "1.6.2",
      "purl": "pkg:npm/connect-timeout@1.6.2",
      "type": "library",
      "bom-ref": "pkg:npm/connect-timeout@1.6.2"
    },
    {
      "name": "content-disposition",
      "version": "0.5.0",
      "purl": "pkg:npm/content-disposition@0.5.0",
      "type": "library",
      "bom-ref": "pkg:npm/content-disposition@0.5.0"
    },
    {
      "name": "content-type",
      "version": "1.0.5",
      "purl": "pkg:npm/content-type@1.0.5",
      "type": "library",
      "bom-ref": "pkg:npm/content-type@1.0.5"
    },
    {
      "name": "cookie",
      "version": "0.1.3",
      "purl": "pkg:npm/cookie@0.1.3",
      "type": "library",
      "bom-ref": "pkg:npm/cookie@0.1.3"
    },
    {
      "name": "cookie-parser",
      "version": "1.3.5",
      "purl": "pkg:npm/cookie-parser@1.3.5",
      "type": "library",
      "bom-ref": "pkg:npm/cookie-parser@1.3.5"
    },
    {
      "name": "cookie-signature",
      "version": "1.0.6",
      "purl": "pkg:npm/cookie-signature@1.0.6",
      "type": "library",
      "bom-ref": "pkg:npm/cookie-signature@1.0.6"
    },
    {
      "name": "core-util-is",
      "version": "1.0.3",
      "purl": "pkg:npm/core-util-is@1.0.3",
      "type": "library",
      "bom-ref": "pkg:npm/core-util-is@1.0.3"
    },
    {
      "name": "crc",
      "version": "3.3.0",
      "purl": "pkg:npm/crc@3.3.0",
      "type": "library",
      "bom-ref": "pkg:npm/crc@3.3.0"
    },
    {
      "name": "csrf",
      "version": "3.0.6",
      "purl": "pkg:npm/csrf@3.0.6",
      "type": "library",
      "bom-ref": "pkg:npm/csrf@3.0.6"
    },
    {
      "name": "csurf",
      "version": "1.8.3",
      "purl": "pkg:npm/csurf@1.8.3",
      "type": "library",
      "bom-ref": "pkg:npm/csurf@1.8.3"
    },
    {
      "name": "debug",
      "version": "2.2.0",
      "purl": "pkg:npm/debug@2.2.0",
      "type": "library",
      "bom-ref": "pkg:npm/debug@2.2.0"
    },
    {
      "name": "debug",
      "version": "2.6.9",
      "purl": "pkg:npm/debug@2.6.9",
      "type": "library",
      "bom-ref": "pkg:npm/debug@2.6.9"
    },
    {
      "name": "depd",
      "version": "1.0.1",
      "purl": "pkg:npm/depd@1.0.1",
      "type": "library",
      "bom-ref": "pkg:npm/depd@1.0.1"
    },
    {
      "name": "depd",
      "version": "1.1.2",
      "purl": "pkg:npm/depd@1.1.2",
      "type": "library",
      "bom-ref": "pkg:npm/depd@1.1.2"
    },
    {
      "name": "destroy",
      "version": "1.0.3",
      "purl": "pkg:npm/destroy@1.0.3",
      "type": "library",
      "bom-ref": "pkg:npm/destroy@1.0.3"
    },
    {
      "name": "destroy",
      "version": "1.0.4",
      "purl": "pkg:npm/destroy@1.0.4",
      "type": "library",
      "bom-ref": "pkg:npm/destroy@1.0.4"
    },
    {
      "name": "ee-first",
      "version": "1.1.1",
      "purl": "pkg:npm/ee-first@1.1.1",
      "type": "library",
      "bom-ref": "pkg:npm/ee-first@1.1.1"
    },
    {
      "name": "errorhandler",
      "version": "1.4.3",
      "purl": "pkg:npm/errorhandler@1.4.3",
      "type": "library",
      "bom-ref": "pkg:npm/errorhandler@1.4.3"
    },
    {
      "name": "escape-html",
      "version": "1.0.2",
      "purl": "pkg:npm/escape-html@1.0.2",
      "type": "library",
      "bom-ref": "pkg:npm/escape-html@1.0.2"
    },
    {
      "name": "escape-html",
      "version": "1.0.3",
      "purl": "pkg:npm/escape-html@1.0.3",
      "type": "library",
      "bom-ref": "pkg:npm/escape-html@1.0.3"
    },
    {
      "name": "etag",
      "version": "1.7.0",
      "purl": "pkg:npm/etag@1.7.0",
      "type": "library",
      "bom-ref": "pkg:npm/etag@1.7.0"
    },
    {
      "name": "express",
      "version": "3.21.2",
      "purl": "pkg:npm/express@3.21.2",
      "type": "library",
      "bom-ref": "pkg:npm/express@3.21.2"
    },
    {
      "name": "express-session",
      "version": "1.11.3",
      "purl": "pkg:npm/express-session@1.11.3",
      "type": "library",
      "bom-ref": "pkg:npm/express-session@1.11.3"
    },
    {
      "name": "finalhandler",
      "version": "0.4.0",
      "purl": "pkg:npm/finalhandler@0.4.0",
      "type": "library",
      "bom-ref": "pkg:npm/finalhandler@0.4.0"
    },
    {
      "name": "forwarded",
      "version": "0.1.2",
      "purl": "pkg:npm/forwarded@0.1.2",
      "type": "library",
      "bom-ref": "pkg:npm/forwarded@0.1.2"
    },
    {
      "name": "fresh",
      "version": "0.3.0",
      "purl": "pkg:npm/fresh@0.3.0",
      "type": "library",
      "bom-ref": "pkg:npm/fresh@0.3.0"
    },
    {
      "name": "http-errors",
      "version": "1.3.1",
      "purl": "pkg:npm/http-errors@1.3.1",
      "type": "library",
      "bom-ref": "pkg:npm/http-errors@1.3.1"
    },
    {
      "name": "iconv-lite",
      "version": "0.4.11",
      "purl": "pkg:npm/iconv-lite@0.4.11",
      "type": "library",
      "bom-ref": "pkg:npm/iconv-lite@0.4.11"
    },
    {
      "name": "iconv-lite",
      "version": "0.4.13",
      "purl": "pkg:npm/iconv-lite@0.4.13",
      "type": "library",
      "bom-ref": "pkg:npm/iconv-lite@0.4.13"
    },
    {
      "name": "inherits",
      "version": "2.0.4",
      "purl": "pkg:npm/inherits@2.0.4",
      "type": "library",
      "bom-ref": "pkg:npm/inherits@2.0.4"
    },
    {
      "name": "ipaddr.js",
      "version": "1.0.5",
      "purl": "pkg:npm/ipaddr.js@1.0.5",
      "type": "library",
      "bom-ref": "pkg:npm/ipaddr.js@1.0.5"
    },
    {
      "name": "isarray",
      "version": "0.0.1",
      "purl": "pkg:npm/isarray@0.0.1",
      "type": "library",
      "bom-ref": "pkg:npm/isarray@0.0.1"
    },
    {
      "name": "media-typer",
      "version": "0.3.0",
      "purl": "pkg:npm/media-typer@0.3.0",
      "type": "library",
      "bom-ref": "pkg:npm/media-typer@0.3.0"
    },
    {
      "name": "merge-descriptors",
      "version": "1.0.0",
      "purl": "pkg:npm/merge-descriptors@1.0.0",
      "type": "library",
      "bom-ref": "pkg:npm/merge-descriptors@1.0.0"
    },
    {
      "name": "method-override",
      "version": "2.3.10",
      "purl": "pkg:npm/method-override@2.3.10",
      "type": "library",
      "bom-ref": "pkg:npm/method-override@2.3.10"
    },
    {
      "name": "methods",
      "version": "1.1.2",
      "purl": "pkg:npm/methods@1.1.2",
      "type": "library",
      "bom-ref": "pkg:npm/methods@1.1.2"
    },
    {
      "name": "mime",
      "version": "1.3.4",
      "purl": "pkg:npm/mime@1.3.4",
      "type": "library",
      "bom-ref": "pkg:npm/mime@1.3.4"
    },
    {
      "name": "mime-db",
      "version": "1.52.0",
      "purl": "pkg:npm/mime-db@1.52.0",
      "type": "library",
      "bom-ref": "pkg:npm/mime-db@1.52.0"
    },
    {
      "name": "mime-types",
      "version": "2.1.35",
      "purl": "pkg:npm/mime-types@2.1.35",
      "type": "library",
      "bom-ref": "pkg:npm/mime-types@2.1.35"
    },
    {
      "name": "minimist",
      "version": "0.0.8",
      "purl": "pkg:npm/minimist@0.0.8",
      "type": "library",
      "bom-ref": "pkg:npm/minimist@0.0.8"
    },
    {
      "name": "mkdirp",
      "version": "0.5.1",
      "purl": "pkg:npm/mkdirp@0.5.1",
      "type": "library",
      "bom-ref": "pkg:npm/mkdirp@0.5.1"
    },
    {
      "name": "morgan",
      "version": "1.6.1",
      "purl": "pkg:npm/morgan@1.6.1",
      "type": "library",
      "bom-ref": "pkg:npm/morgan@1.6.1"
    },
    {
      "name": "ms",
      "version": "0.7.1",
      "purl": "pkg:npm/ms@0.7.1",
      "type": "library",
      "bom-ref": "pkg:npm/ms@0.7.1"
    },
    {
      "name": "ms",
      "version": "0.7.2",
      "purl": "pkg:npm/ms@0.7.2",
      "type": "library",
      "bom-ref": "pkg:npm/ms@0.7.2"
    },
    {
      "name": "ms",
      "version": "2.0.0",
      "purl": "pkg:npm/ms@2.0.0",
      "type": "library",
      "bom-ref": "pkg:npm/ms@2.0.0"
    },
    {
      "name": "multiparty",
      "version": "3.3.2",
      "purl": "pkg:npm/multiparty@3.3.2",
      "type": "library",
      "bom-ref": "pkg:npm/multiparty@3.3.2"
    },
    {
      "name": "negotiator",
      "version": "0.5.3",
      "purl": "pkg:npm/negotiator@0.5.3",
      "type": "library",
      "bom-ref": "pkg:npm/negotiator@0.5.3"
    },
    {
      "name": "negotiator",
      "version": "0.6.3",
      "purl": "pkg:npm/negotiator@0.6.3",
      "type": "library",
      "bom-ref": "pkg:npm/negotiator@0.6.3"
    },
    {
      "name": "on-finished",
      "version": "2.3.0",
      "purl": "pkg:npm/on-finished@2.3.0",
      "type": "library",
      "bom-ref": "pkg:npm/on-finished@2.3.0"
    },
    {
      "name": "on-headers",
      "version": "1.0.2",
      "purl": "pkg:npm/on-headers@1.0.2",
      "type": "library",
      "bom-ref": "pkg:npm/on-headers@1.0.2"
    },
    {
      "name": "parseurl",
      "version": "1.3.3",
      "purl": "pkg:npm/parseurl@1.3.3",
      "type": "library",
      "bom-ref": "pkg:npm/parseurl@1.3.3"
    },
    {
      "name": "pause",
      "version": "0.1.0",
      "purl": "pkg:npm/pause@0.1.0",
      "type": "library",
      "bom-ref": "pkg:npm/pause@0.1.0"
    },
    {
      "name": "proxy-addr",
      "version": "1.0.10",
      "purl": "pkg:npm/proxy-addr@1.0.10",
      "type": "library",
      "bom-ref": "pkg:npm/proxy-addr@1.0.10"
    },
    {
      "name": "qs",
      "version": "4.0.0",
      "purl": "pkg:npm/qs@4.0.0",
      "type": "library",
      "bom-ref": "pkg:npm/qs@4.0.0"
    },
    {
      "name": "random-bytes",
      "version": "1.0.0",
      "purl": "pkg:npm/random-bytes@1.0.0",
      "type": "library",
      "bom-ref": "pkg:npm/random-bytes@1.0.0"
    },
    {
      "name": "range-parser",
      "version": "1.0.3",
      "purl": "pkg:npm/range-parser@1.0.3",
      "type": "library",
      "bom-ref": "pkg:npm/range-parser@1.0.3"
    },
    {
      "name": "raw-body",
      "version": "2.1.7",
      "purl": "pkg:npm/raw-body@2.1.7",
      "type": "library",
      "bom-ref": "pkg:npm/raw-body@2.1.7"
    },
    {
      "name": "readable-stream",
      "version": "1.1.14",
      "purl": "pkg:npm/readable-stream@1.1.14",
      "type": "library",
      "bom-ref": "pkg:npm/readable-stream@1.1.14"
    },
    {
      "name": "response-time",
      "version": "2.3.2",
      "purl": "pkg:npm/response-time@2.3.2",
      "type": "library",
      "bom-ref": "pkg:npm/response-time@2.3.2"
    },
    {
      "name": "rndm",
      "version": "1.2.0",
      "purl": "pkg:npm/rndm@1.2.0",
      "type": "library",
      "bom-ref": "pkg:npm/rndm@1.2.0"
    },
    {
      "name": "send",
      "version": "0.13.0",
      "purl": "pkg:npm/send@0.13.0",
      "type": "library",
      "bom-ref": "pkg:npm/send@0.13.0"
    },
    {
      "name": "send",
      "version": "0.13.2",
      "purl": "pkg:npm/send@0.13.2",
      "type": "library",
      "bom-ref": "pkg:npm/send@0.13.2"
    },
    {
      "name": "serve-favicon",
      "version": "2.3.2",
      "purl": "pkg:npm/serve-favicon@2.3.2",
      "type": "library",
      "bom-ref": "pkg:npm/serve-favicon@2.3.2"
    },
    {
      "name": "serve-index",
      "version": "1.7.3",
      "purl": "pkg:npm/serve-index@1.7.3",
      "type": "library",
      "bom-ref": "pkg:npm/serve-index@1.7.3"
    },
    {
      "name": "serve-static",
      "version": "1.10.3",
      "purl": "pkg:npm/serve-static@1.10.3",
      "type": "library",
      "bom-ref": "pkg:npm/serve-static@1.10.3"
    },
    {
      "name": "statuses",
      "version": "1.2.1",
      "purl": "pkg:npm/statuses@1.2.1",
      "type": "library",
      "bom-ref": "pkg:npm/statuses@1.2.1"
    },
    {
      "name": "statuses",
      "version": "1.5.0",
      "purl": "pkg:npm/statuses@1.5.0",
      "type": "library",
      "bom-ref": "pkg:npm/statuses@1.5.0"
    },
    {
      "name": "stream-counter",
      "version": "0.2.0",
      "purl": "pkg:npm/stream-counter@0.2.0",
      "type": "library",
      "bom-ref": "pkg:npm/stream-counter@0.2.0"
    },
    {
      "name": "string_decoder",
      "version": "0.10.31",
      "purl": "pkg:npm/string_decoder@0.10.31",
      "type": "library",
      "bom-ref": "pkg:npm/string_decoder@0.10.31"
    },
    {
      "name": "tsscmp",
      "version": "1.0.5",
      "purl": "pkg:npm/tsscmp@1.0.5",
      "type": "library",
      "bom-ref": "pkg:npm/tsscmp@1.0.5"
    },
    {
      "name": "type-is",
      "version": "1.6.18",
      "purl": "pkg:npm/type-is@1.6.18",
      "type": "library",
      "bom-ref": "pkg:npm/type-is@1.6.18"
    },
    {
      "name": "uid-safe",
      "version": "2.0.0",
      "purl": "pkg:npm/uid-safe@2.0.0",
      "type": "library",
      "bom-ref": "pkg:npm/uid-safe@2.0.0"
    },
    {
      "name": "uid-safe",
      "version": "2.1.4",
      "purl": "pkg:npm/uid-safe@2.1.4",
      "type": "library",
      "bom-ref": "pkg:npm/uid-safe@2.1.4"
    },
    {
      "name": "unpipe",
      "version": "1.0.0",
      "purl": "pkg:npm/unpipe@1.0.0",
      "type": "library",
      "bom-ref": "pkg:npm/unpipe@1.0.0"
    },
    {
      "name": "utils-merge",
      "version": "1.0.0",
      "purl": "pkg:npm/utils-merge@1.0.0",
      "type": "library",
      "bom-ref": "pkg:npm/utils-merge@1.0.0"
    },
    {
      "name": "vary",
      "version": "1.0.1",
      "purl": "pkg:npm/vary@1.0.1",
      "type": "library",
      "bom-ref": "pkg:npm/vary@1.0.1"
    },
    {
      "name": "vary",
      "version": "1.1.2",
      "purl": "pkg:npm/vary@1.1.2",
      "type": "library",
      "bom-ref": "pkg:npm/vary@1.1.2"
    },
    {
      "name": "vhost",
      "version": "3.0.2",
      "purl": "pkg:npm/vhost@3.0.2",
      "type": "library",
      "bom-ref": "pkg:npm/vhost@3.0.2"
    }
  ]
}
