[
  {
    "from": {
      "name": "org.apache.geode/geode-core",
      "version": "1.1.1"
    },
    "to": {
      "name": "com.fasterxml.jackson.core/jackson-databind",
      "version": "2.9.2"
    },
    "range": "2.9.2"
  },
  {
    "from": {
      "name": "org.apache.geode/geode-core",
      "version": "1.1.1"
    },
    "to": {
      "name": "commons-lang/commons-lang",
      "version": "2.5"
    },
    "range": "2.5"
  },
  {
    "from": {
      "name": "org.apache.geode/geode-core",
      "version": "1.1.1"
    },
    "to": {
      "name": "it.unimi.dsi/fastutil",
      "version": "7.0.2"
    },
    "range": "7.0.2"
  },
  {
    "from": {
      "name": "org.apache.geode/geode-core",
      "version": "1.1.1"
    },
    "to": {
      "name": "javax.resource/javax.resource-api",
      "version": "1.7"
    },
    "range": "1.7"
  },
  {
    "from": {
      "name": "org.apache.geode/geode-core",
      "version": "1.1.1"
    },
    "to": {
      "name": "org.apache.geode/geode-common",
      "version": "1.1.1"
    },
    "range": "1.1.1"
  },
  {
    "from": {
      "name": "org.apache.geode/geode-core",
      "version": "1.1.1"
    },
    "to": {
      "name": "org.apache.logging.log4j/log4j-core",
      "version": "2.6.1"
    },
    "range": "2.6.1"
  },
  {
    "from": {
      "name": "org.apache.geode/geode-core",
      "version": "1.1.1"
    },
    "to": {
      "name": "org.jgroups/jgroups",
      "version": "3.6.10.Final"
    },
    "range": "3.6.10.Final"
  },
  {
    "from": {
      "name": "org.apache.geode/geode-core",
      "version": "1.1.1"
    },
    "to": {
      "name": "com.github.stephenc.findbugs/findbugs-annotations",
      "version": "1.3.9-1"
    },
    "range": "1.3.9-1"
  },
  {
    "from": {
      "name": "org.apache.geode/geode-core",
      "version": "1.1.1"
    },
    "to": {
      "name": "commons-io/commons-io",
      "version": "2.3"
    },
    "range": "2.3"
  },
  {
    "from": {
      "name": "org.apache.geode/geode-core",
      "version": "1.1.1"
    },
    "to": {
      "name": "net.java.dev.jna/jna",
      "version": "4.0.0"
    },
    "range": "4.0.0"
  },
  {
    "from": {
      "name": "org.apache.geode/geode-core",
      "version": "1.1.1"
    },
    "to": {
      "name": "net.sf.jopt-simple/jopt-simple",
      "version": "5.0.1"
    },
    "range": "5.0.1"
  },
  {
    "from": {
      "name": "org.apache.geode/geode-core",
      "version": "1.1.1"
    },
    "to": {
      "name": "org.apache.logging.log4j/log4j-api",
      "version": "2.6.1"
    },
    "range": "2.6.1"
  },
  {
    "from": {
      "name": "org.apache.geode/geode-core",
      "version": "1.1.1"
    },
    "to": {
      "name": "antlr/antlr",
      "version": "2.7.7"
    },
    "range": "2.7.7"
  },
  {
    "from": {
      "name": "org.apache.geode/geode-core",
      "version": "1.1.1"
    },
    "to": {
      "name": "org.apache.geode/geode-json",
      "version": "1.1.1"
    },
    "range": "1.1.1"
  },
  {
    "from": {
      "name": "org.apache.geode/geode-core",
      "version": "1.1.1"
    },
    "to": {
      "name": "org.apache.shiro/shiro-core",
      "version": "1.3.1"
    },
    "range": "1.3.1"
  },
  {
    "from": {
      "name": "org.apache.shiro/shiro-core",
      "version": "1.3.1"
    },
    "to": {
      "name": "commons-beanutils/commons-beanutils",
      "version": "1.8.3"
    },
    "range": "1.8.3"
  },
  {
    "from": {
      "name": "org.apache.shiro/shiro-core",
      "version": "1.3.1"
    },
    "to": {
      "name": "org.slf4j/slf4j-api",
      "version": "1.6.4"
    },
    "range": "1.6.4"
  },
  {
    "from": {
      "name": "com.fasterxml.jackson.core/jackson-databind",
      "version": "2.9.2"
    },
    "to": {
      "name": "com.fasterxml.jackson.core/jackson-annotations",
      "version": "2.9.0"
    },
    "range": "2.9.0"
  },
  {
    "from": {
      "name": "com.fasterxml.jackson.core/jackson-databind",
      "version": "2.9.2"
    },
    "to": {
      "name": "com.fasterxml.jackson.core/jackson-core",
      "version": "2.9.2"
    },
    "range": "2.9.2"
  },
  {
    "from": {
      "name": "org.apache.logging.log4j/log4j-core",
      "version": "2.6.1"
    },
    "to": {
      "name": "org.apache.logging.log4j/log4j-api",
      "version": "2.6.1"
    },
    "range": "2.6.1"
  },
  {
    "from": {
      "name": "javax.resource/javax.resource-api",
      "version": "1.7"
    },
    "to": {
      "name": "javax.transaction/javax.transaction-api",
      "version": "1.2"
    },
    "range": "1.2"
  },
  {
    "to": {
      "name": "org.apache.geode/geode-core",
      "version": "1.1.1"
    },
    "range": "1.1.1"
  },
  {
    "to": {
      "name": "org.mozilla/rhino",
      "version": "1.7.10"
    },
    "range": "1.7.10"
  }
]
