[
  {
    "name": "@babel/core",
    "version": "7.22.10"
  },
  {
    "name": "@babel/preset-env",
    "version": "7.22.9"
  },
  {
    "name": "@babel/helper-remap-async-to-generator",
    "version": "7.22.9"
  }
]
