[
  {
    "name": "atomicwrites",
    "version": "1.3.0"
  },
  {
    "name": "attrs",
    "version": "19.1.0"
  },
  {
    "name": "colorama",
    "version": "0.4.1"
  },
  {
    "name": "django",
    "version": "2.2.1"
  },
  {
    "name": "djangorestframework",
    "version": "3.8.2"
  },
  {
    "name": "importlib-metadata",
    "version": "0.23"
  },
  {
    "name": "more-itertools",
    "version": "7.2.0"
  },
  {
    "name": "packaging",
    "version": "19.2"
  },
  {
    "name": "pluggy",
    "version": "0.13.0"
  },
  {
    "name": "py",
    "version": "1.8.0"
  },
  {
    "name": "pyparsing",
    "version": "2.4.2"
  },
  {
    "name": "pytest",
    "version": "4.6.5"
  },
  {
    "name": "pytz",
    "version": "2019.2"
  },
  {
    "name": "requests",
    "version": "2.5.2"
  },
  {
    "name": "six",
    "version": "1.12.0"
  },
  {
    "name": "sqlparse",
    "version": "0.3.0"
  },
  {
    "name": "wcwidth",
    "version": "0.1.7"
  },
  {
    "name": "werkzeug",
    "version": "0.15.2"
  },
  {
    "name": "zipp",
    "version": "0.6.0"
  }
]
