{
  "filepath": "bundler/Gemfile",
  "package_manager": "bundler",
  "package_type": "gem",
  "packages": [
    {
      "name": "activesupport",
      "version": "5.1.4"
    },
    {
      "name": "byebug",
      "version": "10.0.0"
    },
    {
      "name": "coderay",
      "version": "1.1.2"
    },
    {
      "name": "concurrent-ruby",
      "version": "1.0.5"
    },
    {
      "name": "connection_pool",
      "version": "2.2.1"
    },
    {
      "name": "diff-lcs",
      "version": "1.3"
    },
    {
      "name": "faker",
      "version": "1.6.6"
    },
    {
      "name": "ffi",
      "version": "1.9.21"
    },
    {
      "name": "formatador",
      "version": "0.2.5"
    },
    {
      "name": "guard",
      "version": "2.14.2"
    },
    {
      "name": "guard-compat",
      "version": "1.2.1"
    },
    {
      "name": "guard-rspec",
      "version": "4.7.3"
    },
    {
      "name": "i18n",
      "version": "0.9.5"
    },
    {
      "name": "listen",
      "version": "3.1.5"
    },
    {
      "name": "lumberjack",
      "version": "1.0.12"
    },
    {
      "name": "method_source",
      "version": "0.9.0"
    },
    {
      "name": "mini_portile2",
      "version": "2.0.0"
    },
    {
      "name": "minitest",
      "version": "5.11.3"
    },
    {
      "name": "mustermann",
      "version": "1.0.1"
    },
    {
      "name": "nenv",
      "version": "0.3.0"
    },
    {
      "name": "nokogiri",
      "version": "1.6.7.2"
    },
    {
      "name": "notiffany",
      "version": "0.1.1"
    },
    {
      "name": "pg",
      "version": "1.0.0"
    },
    {
      "name": "pry",
      "version": "0.11.3"
    },
    {
      "name": "puma",
      "version": "3.12.0"
    },
    {
      "name": "rack",
      "version": "2.0.4"
    },
    {
      "name": "rack-protection",
      "version": "2.0.0"
    },
    {
      "name": "rb-fsevent",
      "version": "0.10.2"
    },
    {
      "name": "rb-inotify",
      "version": "0.9.10"
    },
    {
      "name": "redis",
      "version": "3.3.5"
    },
    {
      "name": "rspec",
      "version": "3.7.0"
    },
    {
      "name": "rspec-core",
      "version": "3.7.1"
    },
    {
      "name": "rspec-expectations",
      "version": "3.7.0"
    },
    {
      "name": "rspec-mocks",
      "version": "3.7.0"
    },
    {
      "name": "rspec-support",
      "version": "3.7.1"
    },
    {
      "name": "ruby_dep",
      "version": "1.5.0"
    },
    {
      "name": "shellany",
      "version": "0.0.1"
    },
    {
      "name": "sidekiq",
      "version": "4.2.10"
    },
    {
      "name": "sinatra",
      "version": "2.0.0"
    },
    {
      "name": "slim",
      "version": "3.0.9"
    },
    {
      "name": "spring",
      "version": "2.0.2"
    },
    {
      "name": "temple",
      "version": "0.8.0"
    },
    {
      "name": "thor",
      "version": "0.20.0"
    },
    {
      "name": "thread_safe",
      "version": "0.3.6"
    },
    {
      "name": "tilt",
      "version": "2.0.8"
    },
    {
      "name": "tzinfo",
      "version": "1.2.5"
    }
  ],
  "affections": []
}
