{
  "version": "15.1.4",
  "vulnerabilities": [
    {
      "id": "6782949fc1693799bf0bd1f54e585c98b5cbc6f3041d1fe9baf5ed2b78236c17",
      "name": "DoS by CPU exhaustion when using malicious SSL packets",
      "description": "The `SslHandler` in this package allows remote attackers to cause a denial of service (infinite loop and CPU consumption) via a crafted `SSLv2Hello` message.",
      "severity": "Medium",
      "solution": "Upgrade to the latest version",
      "location": {
        "file": "build.gradle",
        "dependency": {
          "package": {
            "name": "io.netty/netty"
          },
          "version": "3.9.1.Final"
        }
      },
      "identifiers": [
        {
          "type": "gemnasium",
          "name": "Gemnasium-d1bf36d9-9f07-46cd-9cfc-8675338ada8f",
          "value": "d1bf36d9-9f07-46cd-9cfc-8675338ada8f",
          "url": "https://gitlab.com/gitlab-org/security-products/gemnasium-db/-/blob/v1.2.142/maven/io.netty/netty/CVE-2014-3488.yml"
        },
        {
          "type": "cve",
          "name": "CVE-2014-3488",
          "value": "CVE-2014-3488",
          "url": "https://cve.mitre.org/cgi-bin/cvename.cgi?name=CVE-2014-3488"
        }
      ],
      "cvss_vectors": [
        {
          "vendor": "NVD",
          "vector": "AV:N/AC:L/Au:N/C:N/I:N/A:P"
        }
      ],
      "links": [
        {
          "url": "http://netty.io/news/2014/06/11/3.html"
        },
        {
          "url": "https://bugzilla.redhat.com/CVE-2014-3488"
        },
        {
          "url": "https://github.com/netty/netty/issues/2562"
        }
      ],
      "details": {
        "vulnerable_package": {
          "type": "text",
          "name": "Vulnerable Package",
          "value": "io.netty/netty:3.9.1.Final"
        }
      }
    }
  ],
  "scan": {
    "analyzer": {
      "id": "gemnasium-maven",
      "name": "gemnasium-maven",
      "url": "https://gitlab.com/gitlab-org/security-products/analyzers/gemnasium",
      "vendor": {
        "name": "GitLab"
      },
      "version": "5.7.0"
    },
    "scanner": {
      "id": "gemnasium-maven",
      "name": "gemnasium-maven",
      "url": "https://gitlab.com/gitlab-org/security-products/analyzers/gemnasium",
      "vendor": {
        "name": "GitLab"
      },
      "version": "5.7.0"
    },
    "type": "dependency_scanning",
    "start_time": "2024-09-05T10:09:55",
    "end_time": "2024-09-05T10:10:02",
    "status": "success"
  }
}
