{
  "version": "15.0.4",
  "vulnerabilities": [],
  "remediations": [],
  "scan": {
    "analyzer": {
      "id": "gemnasium-python",
      "name": "gemnasium-python",
      "url": "https://gitlab.com/gitlab-org/security-products/analyzers/gemnasium",
      "vendor": {
        "name": "GitLab"
      },
      "version": "3.6.0"
    },
    "scanner": {
      "id": "gemnasium-python",
      "name": "gemnasium-python",
      "url": "https://gitlab.com/gitlab-org/security-products/analyzers/gemnasium",
      "vendor": {
        "name": "GitLab"
      },
      "version": "2.20.1"
    },
    "type": "dependency_scanning",
    "start_time": "2021-12-03T10:16:46",
    "end_time": "2021-12-03T10:16:59",
    "status": "success"
  }
}
