[
  {
    "name": "org.codehaus.woodstox/stax2-api",
    "version": "3.1.4"
  },
  {
    "name": "junit/junit",
    "version": "3.8.1"
  },
  {
    "name": "io.netty/netty-all",
    "version": "4.1.0.Final"
  },
  {
    "name": "com.fasterxml.jackson.dataformat/jackson-dataformat-xml",
    "version": "2.7.3"
  },
  {
    "name": "com.fasterxml.jackson.core/jackson-core",
    "version": "2.7.3"
  },
  {
    "name": "com.fasterxml.jackson.core/jackson-annotations",
    "version": "2.7.0"
  },
  {
    "name": "com.fasterxml.jackson.core/jackson-databind",
    "version": "2.7.3"
  },
  {
    "name": "com.fasterxml.jackson.module/jackson-module-jaxb-annotations",
    "version": "2.7.3"
  }
]
