[
  {
    "name": "@ampproject/remapping",
    "version": "2.3.0"
  },
  {
    "name": "@babel/code-frame",
    "version": "7.24.2"
  },
  {
    "name": "@babel/compat-data",
    "version": "7.24.4"
  },
  {
    "name": "@babel/core",
    "version": "7.24.5"
  },
  {
    "name": "@babel/generator",
    "version": "7.24.5"
  },
  {
    "name": "@babel/helper-compilation-targets",
    "version": "7.23.6"
  },
  {
    "name": "@babel/helper-environment-visitor",
    "version": "7.22.20"
  },
  {
    "name": "@babel/helper-function-name",
    "version": "7.23.0"
  },
  {
    "name": "@babel/helper-hoist-variables",
    "version": "7.22.5"
  },
  {
    "name": "@babel/helper-module-imports",
    "version": "7.24.3"
  },
  {
    "name": "@babel/helper-module-transforms",
    "version": "7.24.5"
  },
  {
    "name": "@babel/helper-simple-access",
    "version": "7.24.5"
  },
  {
    "name": "@babel/helper-split-export-declaration",
    "version": "7.24.5"
  },
  {
    "name": "@babel/helper-string-parser",
    "version": "7.24.1"
  },
  {
    "name": "@babel/helper-validator-identifier",
    "version": "7.24.5"
  },
  {
    "name": "@babel/helper-validator-option",
    "version": "7.23.5"
  },
  {
    "name": "@babel/helpers",
    "version": "7.24.5"
  },
  {
    "name": "@babel/highlight",
    "version": "7.24.5"
  },
  {
    "name": "@babel/parser",
    "version": "7.24.5"
  },
  {
    "name": "@babel/template",
    "version": "7.24.0"
  },
  {
    "name": "@babel/traverse",
    "version": "7.24.5"
  },
  {
    "name": "@babel/types",
    "version": "7.24.5"
  },
  {
    "name": "@istanbuljs/load-nyc-config",
    "version": "1.1.0"
  },
  {
    "name": "@istanbuljs/schema",
    "version": "0.1.3"
  },
  {
    "name": "@jridgewell/gen-mapping",
    "version": "0.3.5"
  },
  {
    "name": "@jridgewell/resolve-uri",
    "version": "3.1.2"
  },
  {
    "name": "@jridgewell/set-array",
    "version": "1.2.1"
  },
  {
    "name": "@jridgewell/sourcemap-codec",
    "version": "1.4.15"
  },
  {
    "name": "@jridgewell/trace-mapping",
    "version": "0.3.25"
  },
  {
    "name": "agent-base",
    "version": "7.1.1"
  },
  {
    "name": "aggregate-error",
    "version": "3.1.0"
  },
  {
    "name": "ansi-regex",
    "version": "5.0.1"
  },
  {
    "name": "ansi-styles",
    "version": "3.2.1"
  },
  {
    "name": "ansi-styles",
    "version": "4.3.0"
  },
  {
    "name": "append-transform",
    "version": "2.0.0"
  },
  {
    "name": "archy",
    "version": "1.0.0"
  },
  {
    "name": "argparse",
    "version": "1.0.10"
  },
  {
    "name": "asynckit",
    "version": "0.4.0"
  },
  {
    "name": "balanced-match",
    "version": "1.0.2"
  },
  {
    "name": "brace-expansion",
    "version": "1.1.11"
  },
  {
    "name": "browserslist",
    "version": "4.23.0"
  },
  {
    "name": "caching-transform",
    "version": "4.0.0"
  },
  {
    "name": "camelcase",
    "version": "5.3.1"
  },
  {
    "name": "caniuse-lite",
    "version": "1.0.30001617"
  },
  {
    "name": "chalk",
    "version": "2.4.2"
  },
  {
    "name": "clean-stack",
    "version": "2.2.0"
  },
  {
    "name": "cliui",
    "version": "6.0.0"
  },
  {
    "name": "color-convert",
    "version": "1.9.3"
  },
  {
    "name": "color-convert",
    "version": "2.0.1"
  },
  {
    "name": "color-name",
    "version": "1.1.3"
  },
  {
    "name": "color-name",
    "version": "1.1.4"
  },
  {
    "name": "combined-stream",
    "version": "1.0.8"
  },
  {
    "name": "commondir",
    "version": "1.0.1"
  },
  {
    "name": "concat-map",
    "version": "0.0.1"
  },
  {
    "name": "convert-source-map",
    "version": "1.9.0"
  },
  {
    "name": "convert-source-map",
    "version": "2.0.0"
  },
  {
    "name": "cross-spawn",
    "version": "7.0.3"
  },
  {
    "name": "cssstyle",
    "version": "4.0.1"
  },
  {
    "name": "data-urls",
    "version": "5.0.0"
  },
  {
    "name": "debug",
    "version": "4.3.4"
  },
  {
    "name": "decamelize",
    "version": "1.2.0"
  },
  {
    "name": "decamelize",
    "version": "6.0.0"
  },
  {
    "name": "decimal.js",
    "version": "10.4.3"
  },
  {
    "name": "default-require-extensions",
    "version": "3.0.1"
  },
  {
    "name": "delayed-stream",
    "version": "1.0.0"
  },
  {
    "name": "electron-to-chromium",
    "version": "1.4.762"
  },
  {
    "name": "emoji-regex",
    "version": "8.0.0"
  },
  {
    "name": "entities",
    "version": "4.5.0"
  },
  {
    "name": "es6-error",
    "version": "4.1.1"
  },
  {
    "name": "escalade",
    "version": "3.1.2"
  },
  {
    "name": "escape-string-regexp",
    "version": "1.0.5"
  },
  {
    "name": "esprima",
    "version": "4.0.1"
  },
  {
    "name": "find-cache-dir",
    "version": "3.3.2"
  },
  {
    "name": "find-up",
    "version": "4.1.0"
  },
  {
    "name": "foreground-child",
    "version": "2.0.0"
  },
  {
    "name": "form-data",
    "version": "4.0.0"
  },
  {
    "name": "fromentries",
    "version": "1.3.2"
  },
  {
    "name": "fs.realpath",
    "version": "1.0.0"
  },
  {
    "name": "gensync",
    "version": "1.0.0-beta.2"
  },
  {
    "name": "get-caller-file",
    "version": "2.0.5"
  },
  {
    "name": "get-package-type",
    "version": "0.1.0"
  },
  {
    "name": "glob",
    "version": "7.2.3"
  },
  {
    "name": "globals",
    "version": "11.12.0"
  },
  {
    "name": "graceful-fs",
    "version": "4.2.11"
  },
  {
    "name": "has-flag",
    "version": "3.0.0"
  },
  {
    "name": "has-flag",
    "version": "4.0.0"
  },
  {
    "name": "hasha",
    "version": "5.2.2"
  },
  {
    "name": "highlight.js",
    "version": "11.9.0"
  },
  {
    "name": "html-encoding-sniffer",
    "version": "4.0.0"
  },
  {
    "name": "html-escaper",
    "version": "2.0.2"
  },
  {
    "name": "http-proxy-agent",
    "version": "7.0.2"
  },
  {
    "name": "https-proxy-agent",
    "version": "7.0.4"
  },
  {
    "name": "iconv-lite",
    "version": "0.6.3"
  },
  {
    "name": "imurmurhash",
    "version": "0.1.4"
  },
  {
    "name": "indent-string",
    "version": "4.0.0"
  },
  {
    "name": "inflight",
    "version": "1.0.6"
  },
  {
    "name": "inherits",
    "version": "2.0.4"
  },
  {
    "name": "is-fullwidth-code-point",
    "version": "3.0.0"
  },
  {
    "name": "is-potential-custom-element-name",
    "version": "1.0.1"
  },
  {
    "name": "is-stream",
    "version": "2.0.1"
  },
  {
    "name": "is-typedarray",
    "version": "1.0.0"
  },
  {
    "name": "is-windows",
    "version": "1.0.2"
  },
  {
    "name": "isexe",
    "version": "2.0.0"
  },
  {
    "name": "istanbul-lib-coverage",
    "version": "3.2.2"
  },
  {
    "name": "istanbul-lib-hook",
    "version": "3.0.0"
  },
  {
    "name": "istanbul-lib-instrument",
    "version": "4.0.3"
  },
  {
    "name": "istanbul-lib-processinfo",
    "version": "2.0.3"
  },
  {
    "name": "istanbul-lib-report",
    "version": "3.0.1"
  },
  {
    "name": "istanbul-lib-source-maps",
    "version": "4.0.1"
  },
  {
    "name": "istanbul-reports",
    "version": "3.1.7"
  },
  {
    "name": "js-tokens",
    "version": "4.0.0"
  },
  {
    "name": "js-yaml",
    "version": "3.14.1"
  },
  {
    "name": "jsdom",
    "version": "24.0.0"
  },
  {
    "name": "jsesc",
    "version": "2.5.2"
  },
  {
    "name": "json5",
    "version": "2.2.3"
  },
  {
    "name": "locate-path",
    "version": "5.0.0"
  },
  {
    "name": "lodash.flattendeep",
    "version": "4.4.0"
  },
  {
    "name": "lru-cache",
    "version": "5.1.1"
  },
  {
    "name": "make-dir",
    "version": "3.1.0"
  },
  {
    "name": "make-dir",
    "version": "4.0.0"
  },
  {
    "name": "mime-db",
    "version": "1.52.0"
  },
  {
    "name": "mime-types",
    "version": "2.1.35"
  },
  {
    "name": "minimatch",
    "version": "3.1.2"
  },
  {
    "name": "moment",
    "version": "2.30.1"
  },
  {
    "name": "ms",
    "version": "2.1.2"
  },
  {
    "name": "node-preload",
    "version": "0.2.1"
  },
  {
    "name": "node-releases",
    "version": "2.0.14"
  },
  {
    "name": "normalize.css",
    "version": "8.0.1"
  },
  {
    "name": "nwsapi",
    "version": "2.2.9"
  },
  {
    "name": "nyc",
    "version": "15.1.0"
  },
  {
    "name": "once",
    "version": "1.4.0"
  },
  {
    "name": "p-limit",
    "version": "2.3.0"
  },
  {
    "name": "p-locate",
    "version": "4.1.0"
  },
  {
    "name": "p-map",
    "version": "3.0.0"
  },
  {
    "name": "p-try",
    "version": "2.2.0"
  },
  {
    "name": "package-hash",
    "version": "4.0.0"
  },
  {
    "name": "parse5",
    "version": "7.1.2"
  },
  {
    "name": "path-exists",
    "version": "4.0.0"
  },
  {
    "name": "path-is-absolute",
    "version": "1.0.1"
  },
  {
    "name": "path-key",
    "version": "3.1.1"
  },
  {
    "name": "picocolors",
    "version": "1.0.0"
  },
  {
    "name": "pkg-dir",
    "version": "4.2.0"
  },
  {
    "name": "process-on-spawn",
    "version": "1.0.0"
  },
  {
    "name": "psl",
    "version": "1.9.0"
  },
  {
    "name": "punycode",
    "version": "2.3.1"
  },
  {
    "name": "querystringify",
    "version": "2.2.0"
  },
  {
    "name": "release-zalgo",
    "version": "1.0.0"
  },
  {
    "name": "require-directory",
    "version": "2.1.1"
  },
  {
    "name": "require-main-filename",
    "version": "2.0.0"
  },
  {
    "name": "requires-port",
    "version": "1.0.0"
  },
  {
    "name": "resolve-from",
    "version": "5.0.0"
  },
  {
    "name": "rimraf",
    "version": "3.0.2"
  },
  {
    "name": "rrweb-cssom",
    "version": "0.6.0"
  },
  {
    "name": "safer-buffer",
    "version": "2.1.2"
  },
  {
    "name": "saxes",
    "version": "6.0.0"
  },
  {
    "name": "semver",
    "version": "6.3.1"
  },
  {
    "name": "semver",
    "version": "7.6.2"
  },
  {
    "name": "set-blocking",
    "version": "2.0.0"
  },
  {
    "name": "shebang-command",
    "version": "2.0.0"
  },
  {
    "name": "shebang-regex",
    "version": "3.0.0"
  },
  {
    "name": "signal-exit",
    "version": "3.0.7"
  },
  {
    "name": "source-map",
    "version": "0.6.1"
  },
  {
    "name": "spawn-wrap",
    "version": "2.0.0"
  },
  {
    "name": "sprintf-js",
    "version": "1.0.3"
  },
  {
    "name": "string-width",
    "version": "4.2.3"
  },
  {
    "name": "strip-ansi",
    "version": "6.0.1"
  },
  {
    "name": "strip-bom",
    "version": "4.0.0"
  },
  {
    "name": "supports-color",
    "version": "5.5.0"
  },
  {
    "name": "supports-color",
    "version": "7.2.0"
  },
  {
    "name": "symbol-tree",
    "version": "3.2.4"
  },
  {
    "name": "test-exclude",
    "version": "6.0.0"
  },
  {
    "name": "to-fast-properties",
    "version": "2.0.0"
  },
  {
    "name": "tough-cookie",
    "version": "4.1.4"
  },
  {
    "name": "tr46",
    "version": "5.0.0"
  },
  {
    "name": "type-fest",
    "version": "0.8.1"
  },
  {
    "name": "typedarray-to-buffer",
    "version": "3.1.5"
  },
  {
    "name": "universalify",
    "version": "0.2.0"
  },
  {
    "name": "update-browserslist-db",
    "version": "1.0.15"
  },
  {
    "name": "url-parse",
    "version": "1.5.10"
  },
  {
    "name": "uuid",
    "version": "8.3.2"
  },
  {
    "name": "w3c-xmlserializer",
    "version": "5.0.0"
  },
  {
    "name": "webidl-conversions",
    "version": "7.0.0"
  },
  {
    "name": "whatwg-encoding",
    "version": "3.1.1"
  },
  {
    "name": "whatwg-mimetype",
    "version": "4.0.0"
  },
  {
    "name": "whatwg-url",
    "version": "14.0.0"
  },
  {
    "name": "which-module",
    "version": "2.0.1"
  },
  {
    "name": "which",
    "version": "2.0.2"
  },
  {
    "name": "wrap-ansi",
    "version": "6.2.0"
  },
  {
    "name": "wrappy",
    "version": "1.0.2"
  },
  {
    "name": "write-file-atomic",
    "version": "3.0.3"
  },
  {
    "name": "ws",
    "version": "8.17.0"
  },
  {
    "name": "xml-name-validator",
    "version": "5.0.0"
  },
  {
    "name": "xmlchars",
    "version": "2.2.0"
  },
  {
    "name": "y18n",
    "version": "4.0.3"
  },
  {
    "name": "yallist",
    "version": "3.1.1"
  },
  {
    "name": "yargs-parser",
    "version": "18.1.3"
  },
  {
    "name": "yargs",
    "version": "15.4.1"
  }
]
