{
  "bomFormat": "CycloneDX",
  "specVersion": "1.4",
  "serialNumber": "urn:uuid:b9b3a9a0-ff76-48f8-9064-436627f34adc",
  "version": 1,
  "metadata": {
    "timestamp": "2022-02-23T07:58:59Z",
    "tools": [
      {
        "vendor": "GitLab",
        "name": "Gemnasium",
        "version": "2.34.0"
      }
    ],
    "authors": [
      {
        "name": "GitLab",
        "email": "support@gitlab.com"
      }
    ],
    "properties": [
      {
        "name": "gitlab:dependency_scanning:input_file:path",
        "value": "ruby-project-1/Gemfile.lock"
      },
      {
        "name": "gitlab:dependency_scanning:package_manager:name",
        "value": "bundler"
      },
      {
        "name": "gitlab:meta:schema_version",
        "value": "1"
      }
    ]
  },
  "components": [
    {
      "name": "coderay",
      "version": "1.1.0.rc2",
      "purl": "pkg:gem/coderay@1.1.0.rc2",
      "type": "library",
      "bom-ref": "pkg:gem/coderay@1.1.0.rc2"
    }
  ]
}
