{
  "bomFormat": "CycloneDX",
  "specVersion": "1.4",
  "serialNumber": "urn:uuid:1ad7f960-1d64-4bb4-a3ca-9fa2585ee2df",
  "version": 1,
  "metadata": {
    "timestamp": "2024-05-24T07:14:05Z",
    "tools": [
      {
        "vendor": "GitLab",
        "name": "Gemnasium",
        "version": "5.1.3"
      }
    ],
    "authors": [
      {
        "name": "GitLab",
        "email": "support@gitlab.com"
      }
    ],
    "properties": [
      {
        "name": "gitlab:dependency_scanning:input_file:path",
        "value": "go.mod"
      },
      {
        "name": "gitlab:dependency_scanning:package_manager:name",
        "value": "go"
      },
      {
        "name": "gitlab:meta:schema_version",
        "value": "1"
      }
    ]
  },
  "components": [
    {
      "name": "github.com/astaxie/beego",
      "version": "v1.10.0",
      "purl": "pkg:golang/github.com/astaxie/beego@v1.10.0",
      "type": "library",
      "bom-ref": "pkg:golang/github.com/astaxie/beego@v1.10.0"
    },
    {
      "name": "github.com/minio/minio",
      "version": "v0.0.0-20180419184637-5a16671f721f",
      "purl": "pkg:golang/github.com/minio/minio@v0.0.0-20180419184637-5a16671f721f",
      "type": "library",
      "bom-ref": "pkg:golang/github.com/minio/minio@v0.0.0-20180419184637-5a16671f721f"
    },
    {
      "name": "github.com/minio/minio-go",
      "version": "v6.0.14+incompatible",
      "purl": "pkg:golang/github.com/minio/minio-go@v6.0.14+incompatible",
      "type": "library",
      "bom-ref": "pkg:golang/github.com/minio/minio-go@v6.0.14+incompatible"
    },
    {
      "name": "github.com/minio/sha256-simd",
      "version": "v0.1.1",
      "purl": "pkg:golang/github.com/minio/sha256-simd@v0.1.1",
      "type": "library",
      "bom-ref": "pkg:golang/github.com/minio/sha256-simd@v0.1.1"
    },
    {
      "name": "github.com/sirupsen/logrus",
      "version": "v1.4.2",
      "purl": "pkg:golang/github.com/sirupsen/logrus@v1.4.2",
      "type": "library",
      "bom-ref": "pkg:golang/github.com/sirupsen/logrus@v1.4.2"
    },
    {
      "name": "go.uber.org/zap",
      "version": "v1.23.0",
      "purl": "pkg:golang/go.uber.org/zap@v1.23.0",
      "type": "library",
      "bom-ref": "pkg:golang/go.uber.org/zap@v1.23.0"
    },
    {
      "name": "gopkg.in/yaml.v2",
      "version": "v2.2.2",
      "purl": "pkg:golang/gopkg.in/yaml.v2@v2.2.2",
      "type": "library",
      "bom-ref": "pkg:golang/gopkg.in/yaml.v2@v2.2.2"
    }
  ]
}
