[
  {
    "name": "alabaster",
    "version": "0.7.12"
  },
  {
    "name": "apipkg",
    "version": "1.5"
  },
  {
    "name": "atomicwrites",
    "version": "1.3.0"
  },
  {
    "name": "attrs",
    "version": "19.1.0"
  },
  {
    "name": "babel",
    "version": "2.7.0"
  },
  {
    "name": "bleach",
    "version": "3.1.0"
  },
  {
    "name": "blinker",
    "version": "1.4"
  },
  {
    "name": "brotlipy",
    "version": "0.7.0"
  },
  {
    "name": "certifi",
    "version": "2019.9.11"
  },
  {
    "name": "cffi",
    "version": "1.12.3"
  },
  {
    "name": "chardet",
    "version": "3.0.4"
  },
  {
    "name": "click",
    "version": "7.0"
  },
  {
    "name": "codecov",
    "version": "2.0.15"
  },
  {
    "name": "configparser",
    "version": "4.0.2"
  },
  {
    "name": "contextlib2",
    "version": "0.5.5"
  },
  {
    "name": "coverage",
    "version": "4.5.4"
  },
  {
    "name": "decorator",
    "version": "4.4.0"
  },
  {
    "name": "detox",
    "version": "0.19"
  },
  {
    "name": "dnspython",
    "version": "1.16.0"
  },
  {
    "name": "docutils",
    "version": "0.15.2"
  },
  {
    "name": "entrypoints",
    "version": "0.3"
  },
  {
    "name": "enum34",
    "version": "1.1.6"
  },
  {
    "name": "eventlet",
    "version": "0.25.1"
  },
  {
    "name": "execnet",
    "version": "1.7.1"
  },
  {
    "name": "filelock",
    "version": "3.0.12"
  },
  {
    "name": "flake8",
    "version": "3.7.8"
  },
  {
    "name": "flask",
    "version": "1.1.1"
  },
  {
    "name": "funcsigs",
    "version": "1.0.2"
  },
  {
    "name": "functools32",
    "version": "3.2.3.post2"
  },
  {
    "name": "greenlet",
    "version": "0.4.15"
  },
  {
    "name": "httpbin",
    "version": "0.7.0"
  },
  {
    "name": "idna",
    "version": "2.8"
  },
  {
    "name": "imagesize",
    "version": "1.1.0"
  },
  {
    "name": "importlib-metadata",
    "version": "0.23"
  },
  {
    "name": "itsdangerous",
    "version": "1.1.0"
  },
  {
    "name": "jinja2",
    "version": "2.10.1"
  },
  {
    "name": "markupsafe",
    "version": "1.1.1"
  },
  {
    "name": "mccabe",
    "version": "0.6.1"
  },
  {
    "name": "mock",
    "version": "3.0.5"
  },
  {
    "name": "monotonic",
    "version": "1.5"
  },
  {
    "name": "more-itertools",
    "version": "5.0.0"
  },
  {
    "name": "pathlib2",
    "version": "2.3.4"
  },
  {
    "name": "pluggy",
    "version": "0.13.0"
  },
  {
    "name": "py",
    "version": "1.8.0"
  },
  {
    "name": "pycodestyle",
    "version": "2.5.0"
  },
  {
    "name": "pycparser",
    "version": "2.19"
  },
  {
    "name": "pyflakes",
    "version": "2.1.1"
  },
  {
    "name": "pygments",
    "version": "2.4.2"
  },
  {
    "name": "pysocks",
    "version": "1.7.0"
  },
  {
    "name": "pytest",
    "version": "3.10.1"
  },
  {
    "name": "pytest-cov",
    "version": "2.7.1"
  },
  {
    "name": "pytest-forked",
    "version": "1.0.2"
  },
  {
    "name": "pytest-httpbin",
    "version": "0.3.0"
  },
  {
    "name": "pytest-mock",
    "version": "1.10.4"
  },
  {
    "name": "pytest-xdist",
    "version": "1.25.0"
  },
  {
    "name": "pytz",
    "version": "2019.2"
  },
  {
    "name": "raven",
    "version": "6.10.0"
  },
  {
    "name": "readme-renderer",
    "version": "24.0"
  },
  {
    "name": "requests",
    "version": "2.22.0"
  },
  {
    "name": "scandir",
    "version": "1.10.0"
  },
  {
    "name": "six",
    "version": "1.12.0"
  },
  {
    "name": "snowballstemmer",
    "version": "1.9.1"
  },
  {
    "name": "sphinx",
    "version": "1.5.5"
  },
  {
    "name": "toml",
    "version": "0.10.0"
  },
  {
    "name": "tox",
    "version": "3.6.1"
  },
  {
    "name": "typing",
    "version": "3.7.4.1"
  },
  {
    "name": "urllib3",
    "version": "1.25.4"
  },
  {
    "name": "virtualenv",
    "version": "16.7.5"
  },
  {
    "name": "webencodings",
    "version": "0.5.1"
  },
  {
    "name": "werkzeug",
    "version": "0.16.0"
  },
  {
    "name": "win-inet-pton",
    "version": "1.1.0"
  },
  {
    "name": "zipp",
    "version": "0.6.0"
  }
]