{
  "version": "15.0.4",
  "vulnerabilities": [
    {
      "id": "338d431df13d5966d028ede7252a8cc5357ad91e91d1adbb6a1b92675d2b0b59",
      "name": "Improper Restriction of Operations within the Bounds of a Memory Buffer",
      "description": "A remote code execution vulnerability exists in the way that the ChakraCore scripting engine handles objects in memory.",
      "severity": "High",
      "solution": "Upgrade to version 1.11.20 or above.",
      "location": {
        "file": "src/web.api/packages.lock.json",
        "dependency": {
          "package": {
            "name": "Microsoft.ChakraCore"
          },
          "version": "1.11.18"
        }
      },
      "identifiers": [
        {
          "type": "gemnasium",
          "name": "Gemnasium-67c33ce7-1101-4dd0-bbd4-b1585409e1c0",
          "value": "67c33ce7-1101-4dd0-bbd4-b1585409e1c0",
          "url": "https://gitlab.com/gitlab-org/security-products/gemnasium-db/-/blob/v1.2.142/nuget/Microsoft.ChakraCore/CVE-2020-1073.yml"
        },
        {
          "type": "cve",
          "name": "CVE-2020-1073",
          "value": "CVE-2020-1073",
          "url": "https://cve.mitre.org/cgi-bin/cvename.cgi?name=CVE-2020-1073"
        }
      ],
      "links": [
        {
          "url": "https://nvd.nist.gov/vuln/detail/CVE-2020-1073"
        },
        {
          "url": "https://portal.msrc.microsoft.com/en-US/security-guidance/advisory/CVE-2020-1073"
        }
      ],
      "details": {
        "vulnerable_package": {
          "name": "Vulnerable Package",
          "type": "text",
          "value": "Microsoft.ChakraCore:1.11.18"
        }
      }
    },
    {
      "id": "3c1f8180696035c9c5f2ef2a9fb0889da231d6f7c98e1629647a1483d5a5bf6c",
      "name": "Improper Restriction of Operations within the Bounds of a Memory Buffer",
      "description": "A remote code execution vulnerability exists in the way that the ChakraCore scripting engine handles objects in memory.",
      "severity": "High",
      "solution": "Upgrade to version 1.11.19 or above.",
      "location": {
        "file": "src/web.api/packages.lock.json",
        "dependency": {
          "package": {
            "name": "Microsoft.ChakraCore"
          },
          "version": "1.11.18"
        }
      },
      "identifiers": [
        {
          "type": "gemnasium",
          "name": "Gemnasium-95dc11dc-fa8f-46b1-9170-57b11100d7c7",
          "value": "95dc11dc-fa8f-46b1-9170-57b11100d7c7",
          "url": "https://gitlab.com/gitlab-org/security-products/gemnasium-db/-/blob/v1.2.142/nuget/Microsoft.ChakraCore/CVE-2020-1065.yml"
        },
        {
          "type": "cve",
          "name": "CVE-2020-1065",
          "value": "CVE-2020-1065",
          "url": "https://cve.mitre.org/cgi-bin/cvename.cgi?name=CVE-2020-1065"
        }
      ],
      "links": [
        {
          "url": "https://nvd.nist.gov/vuln/detail/CVE-2020-1065"
        },
        {
          "url": "https://portal.msrc.microsoft.com/en-US/security-guidance/advisory/CVE-2020-1065"
        }
      ],
      "details": {
        "vulnerable_package": {
          "name": "Vulnerable Package",
          "type": "text",
          "value": "Microsoft.ChakraCore:1.11.18"
        }
      }
    },
    {
      "id": "d5011d96e4493d6d47d042e8cef3ce2890fab8f1f68f6fa8637630fd867609c4",
      "name": "Improper Restriction of Operations within the Bounds of a Memory Buffer",
      "description": "A remote code execution vulnerability exists in the way that Microsoft browsers access objects in memory.",
      "severity": "High",
      "solution": "Upgrade to version 1.11.20 or above.",
      "location": {
        "file": "src/web.api/packages.lock.json",
        "dependency": {
          "package": {
            "name": "Microsoft.ChakraCore"
          },
          "version": "1.11.18"
        }
      },
      "identifiers": [
        {
          "type": "gemnasium",
          "name": "Gemnasium-eb211d3b-ee66-49c8-84a2-43d8d00b21ec",
          "value": "eb211d3b-ee66-49c8-84a2-43d8d00b21ec",
          "url": "https://gitlab.com/gitlab-org/security-products/gemnasium-db/-/blob/v1.2.142/nuget/Microsoft.ChakraCore/CVE-2020-1219.yml"
        },
        {
          "type": "cve",
          "name": "CVE-2020-1219",
          "value": "CVE-2020-1219",
          "url": "https://cve.mitre.org/cgi-bin/cvename.cgi?name=CVE-2020-1219"
        }
      ],
      "links": [
        {
          "url": "https://nvd.nist.gov/vuln/detail/CVE-2020-1219"
        },
        {
          "url": "https://portal.msrc.microsoft.com/en-US/security-guidance/advisory/CVE-2020-1219"
        },
        {
          "url": "https://www.zerodayinitiative.com/advisories/ZDI-20-698/"
        }
      ],
      "details": {
        "vulnerable_package": {
          "name": "Vulnerable Package",
          "type": "text",
          "value": "Microsoft.ChakraCore:1.11.18"
        }
      }
    }
  ],
  "scan": {
    "analyzer": {
      "id": "gemnasium",
      "name": "Gemnasium",
      "url": "https://gitlab.com/gitlab-org/security-products/analyzers/gemnasium",
      "vendor": {
        "name": "GitLab"
      },
      "version": "3.6.0"
    },
    "scanner": {
      "id": "gemnasium",
      "name": "Gemnasium",
      "url": "https://gitlab.com/gitlab-org/security-products/analyzers/gemnasium",
      "vendor": {
        "name": "GitLab"
      },
      "version": "2.33.0"
    },
    "type": "dependency_scanning",
    "start_time": "2022-02-16T04:36:35",
    "end_time": "2022-02-16T04:36:38",
    "status": "success"
  }
}
