{
   "_links" : {
      "events" : "https://gitlab.com/api/v4/projects/14850988/events",
      "issues" : "https://gitlab.com/api/v4/projects/14850988/issues",
      "labels" : "https://gitlab.com/api/v4/projects/14850988/labels",
      "members" : "https://gitlab.com/api/v4/projects/14850988/members",
      "merge_requests" : "https://gitlab.com/api/v4/projects/14850988/merge_requests",
      "repo_branches" : "https://gitlab.com/api/v4/projects/14850988/repository/branches",
      "self" : "https://gitlab.com/api/v4/projects/14850988"
   },
   "allow_merge_on_skipped_pipeline" : null,
   "analytics_access_level" : "enabled",
   "approvals_before_merge" : 0,
   "archived" : true,
   "auto_cancel_pending_pipelines" : "enabled",
   "auto_devops_deploy_strategy" : "continuous",
   "auto_devops_enabled" : false,
   "autoclose_referenced_issues" : true,
   "avatar_url" : null,
   "build_coverage_regex" : null,
   "build_timeout" : 3600,
   "builds_access_level" : "enabled",
   "can_create_merge_request_in" : false,
   "ci_config_path" : null,
   "ci_default_git_depth" : 50,
   "ci_forward_deployment_enabled" : null,
   "compliance_frameworks" : [],
   "container_registry_enabled" : true,
   "container_registry_image_prefix" : "registry.gitlab.com/gitlab-org/gitlab-developement-kit",
   "created_at" : "2019-10-16T11:04:06.065Z",
   "creator_id" : 101578,
   "default_branch" : null,
   "description" : null,
   "emails_disabled" : false,
   "emails_enabled": true,
   "empty_repo" : true,
   "external_authorization_classification_label" : "",
   "forking_access_level" : "enabled",
   "forks_count" : 0,
   "http_url_to_repo" : "https://gitlab.com/gitlab-org/gitlab-developement-kit.git",
   "id" : 14850988,
   "import_status" : "none",
   "issues_access_level" : "enabled",
   "issues_enabled" : true,
   "issues_template" : null,
   "jobs_enabled" : true,
   "last_activity_at" : "2019-10-16T11:04:06.065Z",
   "lfs_enabled" : true,
   "marked_for_deletion_at" : null,
   "marked_for_deletion_on" : null,
   "merge_method" : "merge",
   "merge_requests_access_level" : "enabled",
   "merge_requests_enabled" : true,
   "merge_requests_template" : null,
   "mirror" : false,
   "name" : "gitlab-developement-kit",
   "name_with_namespace" : "GitLab.org / gitlab-developement-kit",
   "namespace" : {
      "avatar_url" : "/uploads/-/system/group/avatar/9970/logo-extra-whitespace.png",
      "full_path" : "gitlab-org",
      "id" : 9970,
      "kind" : "group",
      "name" : "GitLab.org",
      "parent_id" : null,
      "path" : "gitlab-org",
      "web_url" : "https://gitlab.com/groups/gitlab-org"
   },
   "only_allow_merge_if_all_discussions_are_resolved" : false,
   "only_allow_merge_if_pipeline_succeeds" : false,
   "open_issues_count" : 0,
   "operations_access_level" : "enabled",
   "packages_enabled" : true,
   "pages_access_level" : "private",
   "path" : "gitlab-developement-kit",
   "path_with_namespace" : "gitlab-org/gitlab-developement-kit",
   "permissions" : {
      "group_access" : {
         "access_level" : 30,
         "notification_level" : 3
      },
      "project_access" : null
   },
   "printing_merge_request_link_enabled" : true,
   "public_jobs" : true,
   "readme_url" : null,
   "remove_source_branch_after_merge" : null,
   "repository_access_level" : "enabled",
   "request_access_enabled" : false,
   "requirements_enabled" : true,
   "resolve_outdated_diff_discussions" : false,
   "restrict_user_defined_variables" : false,
   "security_and_compliance_enabled" : true,
   "service_desk_address" : "incoming+gitlab-org-gitlab-developement-kit-14850988-issue-@incoming.gitlab.com",
   "service_desk_enabled" : true,
   "shared_runners_enabled" : true,
   "shared_with_groups" : [],
   "snippets_access_level" : "enabled",
   "snippets_enabled" : true,
   "ssh_url_to_repo" : "git@gitlab.com:gitlab-org/gitlab-developement-kit.git",
   "star_count" : 0,
   "suggestion_commit_message" : null,
   "tag_list" : [],
   "visibility" : "private",
   "web_url" : "https://gitlab.com/gitlab-org/gitlab-developement-kit",
   "wiki_access_level" : "enabled",
   "wiki_enabled" : true
}
