{
    "subject": "5050424c323032335348524559",
    "alias": "SHREY",
    "contactData": {
        "value": [
            "e-mail: shrey.naik@gmail.com.com",
            "discord: Shrey#0633"
        ]
    },
    "url": {
        "value": [
            "https://www.linkedin.com/in/shrey-naik/",
        ]
    },
    "bio": {
        "value": [
            "Blockchain developer and options trader",
            "Certified full stack developer ,Udacity"
        ]
    },
    "goals": {
        "value": "Develop and audit smart contracts and dApps"
    }
}
