<?xml version="1.0" encoding="UTF-8" standalone="no"?>
<!-- Created with Inkscape (http://www.inkscape.org/) -->

<svg
   width="6.1999998mm"
   height="6.1999998mm"
   viewBox="0 0 6.1999998 6.1999998"
   version="1.1"
   id="svg5"
   xml:space="preserve"
   inkscape:version="1.2.2 (b0a8486541, 2022-12-01)"
   sodipodi:docname="icon_db_delete.svg"
   xmlns:inkscape="http://www.inkscape.org/namespaces/inkscape"
   xmlns:sodipodi="http://sodipodi.sourceforge.net/DTD/sodipodi-0.dtd"
   xmlns="http://www.w3.org/2000/svg"
   xmlns:svg="http://www.w3.org/2000/svg"><sodipodi:namedview
     id="namedview7"
     pagecolor="#ffffff"
     bordercolor="#000000"
     borderopacity="0.25"
     inkscape:showpageshadow="2"
     inkscape:pageopacity="0.0"
     inkscape:pagecheckerboard="0"
     inkscape:deskcolor="#d1d1d1"
     inkscape:document-units="mm"
     showgrid="false"
     inkscape:zoom="11.313708"
     inkscape:cx="16.086679"
     inkscape:cy="14.805048"
     inkscape:window-width="1920"
     inkscape:window-height="1172"
     inkscape:window-x="1920"
     inkscape:window-y="0"
     inkscape:window-maximized="1"
     inkscape:current-layer="layer1" /><defs
     id="defs2" /><g
     inkscape:label="Calque 1"
     inkscape:groupmode="layer"
     id="layer1"><g
       id="g3297-2"
       transform="translate(2.1244819,-6.3426823)"><path
         d="M -1.8585489,9.9919732 H 3.430129 L 3.416225,11.549019 C 2.0477856,11.799895 0.85183109,12.005112 -0.32132348,11.87433 -0.83918688,11.8166 -1.3419821,11.640547 -1.8615476,11.543805 Z"
         fill="#6d97c4"
         id="path256-2-0"
         style="stroke-width:0.644631"
         sodipodi:nodetypes="cccscc" /><path
         d="m -1.8585489,9.9042707 v 1.5983863 l 0.5298679,0.249191 -0.002,-1.847993 z"
         fill="#bacee3"
         id="path258-7-2"
         style="stroke-width:0.644631"
         sodipodi:nodetypes="ccccc" /><path
         d="m 3.432128,9.983852 0.01738,1.569479 -1.0751154,0.293455 V 9.9842662 Z"
         fill="#55769a"
         id="path260-0-3"
         style="stroke-width:0.643479"
         sodipodi:nodetypes="ccccc" /><path
         d="m 3.432128,9.850856 h 0.264934 v 1.314967 H 3.432128 Z m -5.5556099,0 h 0.264933 v 1.314967 h -0.265933 z"
         fill="#415a75"
         id="path262-9-7"
         style="stroke-width:0.99986"
         sodipodi:nodetypes="cccccccccc" /><ellipse
         cx="0.78678846"
         cy="9.8518562"
         fill="#bacee3"
         rx="2.7783053"
         ry="0.79397619"
         stroke="#415a75"
         stroke-linecap="round"
         stroke-linejoin="round"
         stroke-width="0.264963"
         id="ellipse266-6-5" /><path
         d="m -2.1234819,11.151919 c 0,0.169995 0.09498,0.32799 0.253936,0.439987 0.154961,0.114996 0.3919019,0.209994 0.6518369,0.289991 0.51987,0.159996 1.223694,0.222994 2.003499,0.222994 0.779805,0 1.473632,-0.062 1.997501,-0.221994 0.259935,-0.078 0.493876,-0.175995 0.652836,-0.289991 0.155961,-0.112997 0.259935,-0.269992 0.259935,-0.439987 H 3.431129 c 0,0 -0.008,0.154995 -0.139965,0.244993 -0.124969,0.09 -0.314922,0.169995 -0.55986,0.243992 C 2.241426,11.7899 1.5456,11.838898 0.78579,11.838898 c -0.75981,0 -1.445638,-0.046 -1.932517,-0.194994 -0.241939,-0.072 -0.4318919,-0.151995 -0.5558609,-0.244992 -0.122969,-0.085 -0.155961,-0.183995 -0.155961,-0.246993 z"
         fill="#415a75"
         id="path268-0-92"
         style="stroke-width:0.99986"
         sodipodi:nodetypes="ccsscccccsscccc" /></g><path
       d="M 0.26593307,2.3579328 H 5.554611 L 5.540707,3.9149786 C 4.1722676,4.1658546 2.9763131,4.3710716 1.8031585,4.2402896 1.2852951,4.1825596 0.7824999,4.0065066 0.26293437,3.9097646 Z"
       fill="#6d97c4"
       id="path256-2-2"
       style="fill:#59d866;fill-opacity:1;stroke-width:0.644631"
       sodipodi:nodetypes="cccscc" /><path
       d="m 0.26593307,2.2702303 v 1.5983863 l 0.52986793,0.249191 -0.002,-1.847993 z"
       fill="#bacee3"
       id="path258-7-6"
       style="fill:#b2eeb7;fill-opacity:1;stroke-width:0.644631"
       sodipodi:nodetypes="ccccc" /><ellipse
       cx="2.9112704"
       cy="2.2178159"
       fill="#bacee3"
       rx="2.7783053"
       ry="0.79397619"
       stroke="#415a75"
       stroke-linecap="round"
       stroke-linejoin="round"
       stroke-width="0.264963"
       id="ellipse266-6-7"
       style="fill:#b0ded4;fill-opacity:1" /><path
       d="m 5.55661,2.3498116 0.01738,1.569479 -1.0751154,0.293455 V 2.3502258 Z"
       fill="#55769a"
       id="path260-0-1"
       style="fill:#29ab35;fill-opacity:1;stroke-width:0.643479"
       sodipodi:nodetypes="ccccc" /><path
       d="m 5.55661,2.2168156 h 0.264934 v 1.314967 H 5.55661 Z m -5.55560993,0 h 0.264933 v 1.314967 H 7e-8 Z"
       fill="#415a75"
       id="path262-9-8"
       style="stroke-width:0.99986"
       sodipodi:nodetypes="cccccccccc" /><path
       d="m 0.00100007,3.5178786 c 0,0.169995 0.09498,0.32799 0.253936,0.439987 0.15496103,0.114996 0.39190193,0.209994 0.65183693,0.289991 0.51987,0.159996 1.223694,0.222994 2.003499,0.222994 0.779805,0 1.473632,-0.062 1.997501,-0.221994 0.259935,-0.078 0.493876,-0.175995 0.652836,-0.289991 0.155961,-0.112997 0.259935,-0.269992 0.259935,-0.439987 H 5.555611 c 0,0 -0.008,0.154995 -0.139965,0.244993 -0.124969,0.09 -0.314922,0.169995 -0.55986,0.243992 -0.489878,0.147996 -1.185704,0.196994 -1.945514,0.196994 -0.75981,0 -1.445638,-0.046 -1.932517,-0.194994 -0.241939,-0.072 -0.4318919,-0.151995 -0.5558609,-0.244992 -0.122969,-0.085 -0.15596103,-0.183995 -0.15596103,-0.246993 z"
       fill="#415a75"
       id="path268-0-9"
       style="stroke-width:0.99986"
       sodipodi:nodetypes="ccsscccccsscccc" /><g
       id="g3297"
       transform="translate(2.1244819,-8.9253985)"><path
         d="M -1.8585489,9.9919732 H 3.430129 L 3.416225,11.549019 C 2.0477856,11.799895 0.85183109,12.005112 -0.32132348,11.87433 -0.83918688,11.8166 -1.3419821,11.640547 -1.8615476,11.543805 Z"
         fill="#6d97c4"
         id="path256-2"
         style="stroke-width:0.644631"
         sodipodi:nodetypes="cccscc" /><path
         d="m -1.8585489,9.9042707 v 1.5983863 l 0.5298679,0.249191 -0.002,-1.847993 z"
         fill="#bacee3"
         id="path258-7"
         style="stroke-width:0.644631"
         sodipodi:nodetypes="ccccc" /><path
         d="m 3.432128,9.983852 0.01738,1.569479 -1.0751154,0.293455 V 9.9842662 Z"
         fill="#55769a"
         id="path260-0"
         style="stroke-width:0.643479"
         sodipodi:nodetypes="ccccc" /><path
         d="m 3.432128,9.850856 h 0.264934 v 1.314967 H 3.432128 Z m -5.5556099,0 h 0.264933 v 1.314967 h -0.265933 z"
         fill="#415a75"
         id="path262-9"
         style="stroke-width:0.99986"
         sodipodi:nodetypes="cccccccccc" /><ellipse
         cx="0.78678846"
         cy="9.8518562"
         fill="#bacee3"
         rx="2.7783053"
         ry="0.79397619"
         stroke="#415a75"
         stroke-linecap="round"
         stroke-linejoin="round"
         stroke-width="0.264963"
         id="ellipse266-6" /><path
         d="m -2.1234819,11.151919 c 0,0.169995 0.09498,0.32799 0.253936,0.439987 0.154961,0.114996 0.3919019,0.209994 0.6518369,0.289991 0.51987,0.159996 1.223694,0.222994 2.003499,0.222994 0.779805,0 1.473632,-0.062 1.997501,-0.221994 0.259935,-0.078 0.493876,-0.175995 0.652836,-0.289991 0.155961,-0.112997 0.259935,-0.269992 0.259935,-0.439987 H 3.431129 c 0,0 -0.008,0.154995 -0.139965,0.244993 -0.124969,0.09 -0.314922,0.169995 -0.55986,0.243992 C 2.241426,11.7899 1.5456,11.838898 0.78579,11.838898 c -0.75981,0 -1.445638,-0.046 -1.932517,-0.194994 -0.241939,-0.072 -0.4318919,-0.151995 -0.5558609,-0.244992 -0.122969,-0.085 -0.155961,-0.183995 -0.155961,-0.246993 z"
         fill="#415a75"
         id="path268-0"
         style="stroke-width:0.99986"
         sodipodi:nodetypes="ccsscccccsscccc" /></g><g
       transform="matrix(0.23738024,0,0,0.23879596,0.4874219,-1.4989981)"
       id="g360"><path
         d="m 15.143,22.5 h 7.715 c 0.354,0 0.643,0.288 0.643,0.643 v 7.715 c 0,0.354 -0.288,0.643 -0.643,0.643 h -7.715 c -0.354,0 -0.643,-0.288 -0.643,-0.643 v -7.715 c 0,-0.355 0.288,-0.643 0.643,-0.643 z"
         fill="#cc0000"
         opacity="0.9"
         stroke="#cc0000"
         stroke-linecap="square"
         stroke-linejoin="round"
         id="path350" /><path
         d="m 14.5,27 h 9 v -3 c 0,-1.5 0,-1.5 -2.25,-1.5 -0.523,0 -4.555,0 -5.25,0 -1.5,0 -1.5,0 -1.5,1.5 z"
         fill="#fcffff"
         opacity="0.3"
         id="path352" /><g
         fill="#5c3566"
         stroke="#eeeeec"
         stroke-linecap="round"
         stroke-width="1.7056"
         id="g358"><path
           d="m 16,24 6.001,6"
           id="path354" /><path
           d="m 16,30 6.001,-6"
           id="path356" /></g></g></g></svg>
