<?xml version="1.0" encoding="UTF-8" standalone="no"?>
<!-- Created with Inkscape (http://www.inkscape.org/) -->

<svg
   width="20"
   height="20"
   viewBox="0 0 5.2916664 5.2916668"
   version="1.1"
   id="svg38609"
   inkscape:version="1.2 (1:1.2.1+202207142221+cd75a1ee6d)"
   sodipodi:docname="apply_selection.svg"
   xmlns:inkscape="http://www.inkscape.org/namespaces/inkscape"
   xmlns:sodipodi="http://sodipodi.sourceforge.net/DTD/sodipodi-0.dtd"
   xmlns="http://www.w3.org/2000/svg"
   xmlns:svg="http://www.w3.org/2000/svg">
  <sodipodi:namedview
     id="namedview38611"
     pagecolor="#ffffff"
     bordercolor="#666666"
     borderopacity="1.0"
     inkscape:showpageshadow="false"
     inkscape:pageopacity="0.0"
     inkscape:pagecheckerboard="0"
     inkscape:deskcolor="#d1d1d1"
     inkscape:document-units="px"
     showgrid="false"
     inkscape:zoom="9.448059"
     inkscape:cx="17.410984"
     inkscape:cy="23.179364"
     inkscape:window-width="1920"
     inkscape:window-height="1171"
     inkscape:window-x="1920"
     inkscape:window-y="0"
     inkscape:window-maximized="1"
     inkscape:current-layer="layer1" />
  <defs
     id="defs38606" />
  <g
     inkscape:label="Calque 1"
     inkscape:groupmode="layer"
     id="layer1">
    <rect
       style="fill:#cccccc;fill-opacity:0;stroke:none;stroke-width:0.472478;stroke-linecap:round;stroke-linejoin:round;stroke-dasharray:none;stroke-opacity:1"
       id="rect1865-0-6-3-7"
       width="5.2916665"
       height="5.2916665"
       x="8.8817842e-16"
       y="-8.8817842e-16"
       inkscape:export-filename="../../../apply_selection.png"
       inkscape:export-xdpi="192"
       inkscape:export-ydpi="192" />
    <rect
       style="fill:#fce94f;fill-opacity:1;stroke:#ceb234;stroke-width:0.148448;stroke-linecap:round;stroke-linejoin:round;stroke-dasharray:none;stroke-opacity:1"
       id="rect4881"
       width="2.7614932"
       height="2.7338927"
       x="2.2003212"
       y="2.1836853" />
    <g
       id="g4764-4"
       transform="matrix(0.7289023,0,0,0.7289023,-36.115388,-22.334973)">
      <circle
         style="opacity:1;fill:#21c521;fill-opacity:1;stroke:none;stroke-width:0.165;stroke-linecap:round;stroke-linejoin:round;stroke-dasharray:none;stroke-opacity:1"
         id="path3396-43"
         cx="51.876434"
         cy="33.200294"
         r="1.9039394" />
      <path
         id="path3396-4-0"
         style="fill:#1ba31b;stroke-width:0.165;stroke-linecap:round;stroke-linejoin:round"
         d="m 51.876434,35.104234 c -1.051517,0 -1.903939,-0.852423 -1.903939,-1.90394 0,-0.680285 0.356783,-1.277238 0.893438,-1.61395 0.292853,-0.183743 0.639269,-0.289989 1.010501,-0.289989 -1.008846,0.943383 -0.506273,3.259735 0,3.807879 z"
         sodipodi:nodetypes="csscc" />
      <path
         style="fill:none;stroke:#ffffff;stroke-width:0.264583px;stroke-linecap:butt;stroke-linejoin:miter;stroke-opacity:1"
         d="M 53.066049,32.44121 51.53613,33.964337 50.725555,33.153762"
         id="path4295-7"
         sodipodi:nodetypes="ccc" />
    </g>
  </g>
</svg>
