<?xml version="1.0" encoding="UTF-8" standalone="no"?>
<!-- Created with Inkscape (http://www.inkscape.org/) -->

<svg
   width="20"
   height="20"
   viewBox="0 0 5.2916665 5.2916666"
   version="1.1"
   id="svg1"
   inkscape:version="1.3 (1:1.3+202307231459+0e150ed6c4)"
   sodipodi:docname="icon_bar_chart.svg"
   xmlns:inkscape="http://www.inkscape.org/namespaces/inkscape"
   xmlns:sodipodi="http://sodipodi.sourceforge.net/DTD/sodipodi-0.dtd"
   xmlns="http://www.w3.org/2000/svg"
   xmlns:svg="http://www.w3.org/2000/svg">
  <sodipodi:namedview
     id="namedview1"
     pagecolor="#ffffff"
     bordercolor="#666666"
     borderopacity="1.0"
     inkscape:showpageshadow="false"
     inkscape:pageopacity="0.0"
     inkscape:pagecheckerboard="0"
     inkscape:deskcolor="#d1d1d1"
     inkscape:document-units="mm"
     borderlayer="false"
     inkscape:zoom="26.882379"
     inkscape:cx="12.703489"
     inkscape:cy="16.3118"
     inkscape:window-width="1920"
     inkscape:window-height="1171"
     inkscape:window-x="1920"
     inkscape:window-y="0"
     inkscape:window-maximized="1"
     inkscape:current-layer="layer1"
     showgrid="false" />
  <defs
     id="defs1" />
  <g
     inkscape:label="Calque 1"
     inkscape:groupmode="layer"
     id="layer1">
    <path
       id="rect25806-3-0-0-8"
       style="fill:#42aee0;fill-opacity:1;stroke:none;stroke-width:0.805774;stroke-linecap:round;stroke-linejoin:round;stroke-dasharray:none;stroke-opacity:1"
       d="m 0.43573695,4.4851848 4.65336795,8e-7 2e-7,-0.2343405 -0.1527249,5e-7 6e-7,-0.9122139 -0.2826491,9e-7 2e-7,0.9122127 h -0.091743 l -1e-7,-0.9122127 -0.2826485,-7e-7 10e-8,0.9122129 -0.091742,-1.4e-6 3e-7,-1.2228156 -0.282649,1e-6 5e-7,1.2228145 -0.091741,-1.2e-6 3e-7,-3.1246788 -0.2821191,7e-7 5e-7,3.1246776 -0.092274,-2.5e-6 -5e-7,-1.7674758 -0.2821185,-9e-7 -2e-7,1.7674772 -0.092274,-2.5e-6 V 3.3386242 l -0.2821119,2e-7 10e-8,0.9122127 h -0.09174 l -4e-7,-1.6286385 -0.2826488,-1.2e-6 -4e-7,1.6286398 -0.091742,-1.3e-6 -2e-7,-0.5811473 -0.2826486,-7e-7 -7e-7,0.5811483 h -0.091741 l -1e-7,-0.9122127 -0.2826485,-6e-7 10e-8,0.9122128 -0.091742,-1.3e-6 -10e-8,-2.4180444 -0.2826495,2e-7 10e-8,2.4180447 -0.091741,-1.5e-6 6e-7,-1.912542 -0.28211917,7e-7 1.7e-7,1.9125408 -0.092274,-2.6e-6 -1e-7,-0.9122128 -0.28211479,3e-7 9e-8,0.9122127 -0.10076382,1.3e-6 z"
       sodipodi:nodetypes="ccccccccccccccccccccccccccccccccccccccccccccccccccccc" />
    <path
       id="path1"
       style="color:#000000;fill:#42aee0;-inkscape-stroke:none;fill-opacity:1"
       d="M 0.26768392 0.39067383 L 0.26768392 4.5759481 L 0.1173055 4.5759481 L 0.1173055 4.6426107 L 0.26768392 4.6426107 L 0.26768392 4.8379476 L 0.33382975 4.8379476 L 0.33382975 4.6426107 L 5.1288859 4.6426107 L 5.1288859 4.5759481 L 0.33382975 4.5759481 L 0.33382975 0.39067383 L 0.26768392 0.39067383 z " />
  </g>
</svg>
