<?xml version="1.0" encoding="UTF-8"?>
<!DOCTYPE svg PUBLIC "-//W3C//DTD SVG 1.1//EN" "http://www.w3.org/Graphics/SVG/1.1/DTD/svg11.dtd">
<!-- Creator: Rod Holcombe, modified from CorelDRAW 2020 (64-Bit) -->
<svg xmlns="http://www.w3.org/2000/svg" xml:space="preserve" width="60mm" height="60mm" version="1.1" style="shape-rendering:geometricPrecision; text-rendering:geometricPrecision; image-rendering:optimizeQuality; fill-rule:evenodd; clip-rule:evenodd"
viewBox="0 0 10000 10000"
 xmlns:xlink="http://www.w3.org/1999/xlink"
 xmlns:xodm="http://www.corel.com/coreldraw/odm/2003">

 <g id="Square_x0020_frame">
  <rect fill="none" y="0" width="10000" height="10000"/>
 </g>
 <g id="symbol">
  <g>
   <path fill="black" d="
   M5000 5500
   l0 -5000 0 5000
   zm-477.82 -1967.14
   l480 -236.4 480 236.4 -482.51 -1252.31 -477.49 1252.31z"/>
   <path id="1" fill="none"  stroke="black" stroke-width="70" d="
   M5000 7500
   l0 -5240
   m-477.82 1272.86
   l480 -236.4 480 236.4 -482.51 -1252.31 -477.49 1252.31z"/>
  </g>
 </g>
</svg>
