\relax 
\providecommand \oddpage@label [2]{}
\@writefile{toc}{\contentsline {section}{\numberline {1}Supplementary Tables}{2}\protected@file@percent }
\@writefile{lot}{\contentsline {table}{\numberline {1}{\ignorespaces Number of unique cell lines assayed from each population for the EUR and AFR super populations.\relax }}{3}\protected@file@percent }
\providecommand*\caption@xref[2]{\@setref\relax\@undefined{#1}}
\newlabel{supptab:sample-pops}{{1}{3}}
\@writefile{lot}{\contentsline {table}{\numberline {2}{\ignorespaces Breakdown of experiments conducted as described in main text.\ For experiments A, B, and E, 120 unique cell lines were run in triplicate.\ For experiment C, NA12878 was run 30x in replicate.\ For experiment C, a subset of 30 for each superpopulation was run once.\ Mapped coverage was computed as the number of mapped bases divided by $3.3\mathrm  {e}9$.\ Coverage is reported as the mean $\pm $ standard deviation.\relax }}{3}\protected@file@percent }
\newlabel{supptab:sample-experiment-breakdown}{{2}{3}}
\newlabel{tab:supptab:samples-passing-qc}{{3}{3}}
\@writefile{lot}{\contentsline {table}{\numberline {3}{\ignorespaces This table shows the number of samples for each cell line in each experiment which passed QC. A dot indicates that the particular cell line was not part of the experiment.\relax }}{3}\protected@file@percent }
\gdef \LT@i {\LT@entry 
    {5}{56.18028pt}\LT@entry 
    {1}{64.16466pt}\LT@entry 
    {1}{94.76389pt}\LT@entry 
    {1}{47.43547pt}\LT@entry 
    {1}{46.97923pt}\LT@entry 
    {1}{47.1313pt}\LT@entry 
    {1}{47.58755pt}\LT@entry 
    {1}{46.67505pt}}
\@writefile{lot}{\contentsline {table}{\numberline {4}{\ignorespaces Nominal and effective coverages (each cell is the mean $\pm $ standard deviation) of the representative cohorts for each superpopulation for each experiment.\relax }}{7}\protected@file@percent }
\newlabel{supptab:representative-sample-coverage}{{4}{7}}
\@writefile{lot}{\contentsline {table}{\numberline {5}{\ignorespaces Mean and interquartile range (in parentheses) NRC for filtered SNPs by experiment and super population.\relax }}{7}\protected@file@percent }
\newlabel{supptab:filtered-snps-mean-nrc}{{5}{7}}
\@writefile{lot}{\contentsline {table}{\numberline {6}{\ignorespaces Mean and interquartile range (in parentheses) NRC for unfiltered indels by experiment and super population.\relax }}{7}\protected@file@percent }
\newlabel{supptab:unfiltered-indels-mean-nrc}{{6}{7}}
\@writefile{lot}{\contentsline {table}{\numberline {7}{\ignorespaces Mean and interquartile range (in parentheses) NRC for filtered indels by experiment and super population.\relax }}{7}\protected@file@percent }
\newlabel{supptab:filtered-indels-mean-nrc}{{7}{7}}
\@writefile{lot}{\contentsline {table}{\numberline {8}{\ignorespaces Mean and interquartile range (in parentheses) overall concordance for unfiltered SNPs by experiment and super population.\relax }}{7}\protected@file@percent }
\newlabel{supptab:unfiltered-snps-mean-oconc}{{8}{7}}
\@writefile{lot}{\contentsline {table}{\numberline {9}{\ignorespaces Mean and interquartile range (in parentheses) overall concordance for filtered SNPs by experiment and super population.\relax }}{8}\protected@file@percent }
\newlabel{supptab:filtered-snps-mean-oconc}{{9}{8}}
\@writefile{lot}{\contentsline {table}{\numberline {10}{\ignorespaces Mean and interquartile range (in parentheses) overall concordance for unfiltered indels by experiment and super population.\relax }}{8}\protected@file@percent }
\newlabel{supptab:unfiltered-indels-mean-oconc}{{10}{8}}
\@writefile{lot}{\contentsline {table}{\numberline {11}{\ignorespaces Mean and interquartile range (in parentheses) overall concordance for filtered indels by experiment and super population.\relax }}{8}\protected@file@percent }
\newlabel{supptab:filtered-indels-mean-oconc}{{11}{8}}
\@writefile{lot}{\contentsline {table}{\numberline {12}{\ignorespaces Mean non-reference concordance by minor allele frequency bin in 1KGP3 for EUR and AFR cohorts by experiment.\ The values in the Minor Allele Frequency column denote the midpoint of the respective bin.\ These are the values plotted in Figure 2\hbox {}\relax }}{9}\protected@file@percent }
\newlabel{supptab:unfiltered-snp-nrc-by-nraf}{{12}{9}}
\@writefile{lot}{\contentsline {table}{\numberline {13}{\ignorespaces Mean $r^2$s by minor allele frequency bin in 1KGP3 for the AFR cohort by experiment.\ The values in the Minor Allele Frequency column denote the midpoint of the respective bin.\ The bin edges are therefore at 0, 0.01, 0.02, 0.03, 0.04, 0.05, 0.06, 0.07, 0.08, 0.09, 0.1, 0.15, 0.2, 0.25, 0.5.\ These are the values plotted in the left pane of Figure 3\hbox {}.\relax }}{10}\protected@file@percent }
\newlabel{supptab:r2-by-maf-afr}{{13}{10}}
\@writefile{lot}{\contentsline {table}{\numberline {14}{\ignorespaces Mean $r^2$s by minor allele frequency in 1KGP3 for the EUR cohort by experiment.\ The values in the Minor Allele Frequency column denote the midpoint of the respective bin.\ The bin edges are therefore at 0, 0.01, 0.02, 0.03, 0.04, 0.05, 0.06, 0.07, 0.08, 0.09, 0.1, 0.15, 0.2, 0.25, 0.5.\ These are the values plotted in the right pane of Figure 3\hbox {}.\relax }}{10}\protected@file@percent }
\newlabel{supptab:r2-by-maf-eur}{{14}{10}}
\@writefile{lot}{\contentsline {table}{\numberline {15}{\ignorespaces Mean and interquartile range (in parentheses) imputation $r^2$s for each representative cohort for each experiment by superpopulation cohort at biallelic SNPs above $5\%$ minor allele frequency in the 1KGP3.\relax }}{11}\protected@file@percent }
\newlabel{supptab:mean-r2s-common}{{15}{11}}
\@writefile{lot}{\contentsline {table}{\numberline {16}{\ignorespaces Squared Pearson correlation coefficient ($r^2$) between PRS estimates from imputed dosages vs.\ true PRS as calculated off 1KGP3 genotypes by superpopulation and trait.\relax }}{11}\protected@file@percent }
\newlabel{supptab:prs-corr-with-truth}{{16}{11}}
\@writefile{lot}{\contentsline {table}{\numberline {17}{\ignorespaces MSE in array-based PRS estimates and the standard error of the MSE.\ The MSE is calculated by first taking the average of the squared error in PRS estimates among replicates of a given cell line and trait, and then averaging over all cell lines within a population for a given trait.\relax }}{11}\protected@file@percent }
\newlabel{supptab:array-score-mse}{{17}{11}}
\@writefile{lot}{\contentsline {table}{\numberline {18}{\ignorespaces Mean squared error (MSE) in sequence-based PRS estimates and the standard error (SE) of the MSE.\ The MSE is calculated by first taking the average of the squared error in PRS estimates among replicates of a given cell line and trait, and then averaging over all cell lines within a population for a given trait.\ MSE fold decrease is the $x$-fold decrease in MSE compared to the array counterpart.\ For instance, the MSE for experiment D's CAD PRS estimates for the AFR cohort was approximatedly four-fold the MSE of the array-based AFR CAD estimates (Supplementary Table 17\hbox {}).\relax }}{12}\protected@file@percent }
\newlabel{supptab:seq-score-mse}{{18}{12}}
\@writefile{lot}{\contentsline {table}{\numberline {19}{\ignorespaces $P$-values from Welch two-sample $t$-tests for differences in means of the squared errors in PRS estimates between each sequence-based experiment and the corresponding squared errors in PRS estimates from the array-based estimates. Bolded values are significant at a level $\alpha = 0.05$.\relax }}{12}\protected@file@percent }
\newlabel{supptab:prs-mse-significance-tests}{{19}{12}}
\@writefile{toc}{\contentsline {section}{\numberline {2}Figures}{13}\protected@file@percent }
\@writefile{lof}{\contentsline {figure}{\numberline {1}{\ignorespaces Distribution of mapped coverages by experiment.\relax }}{14}\protected@file@percent }
\newlabel{suppfig:density-mapped-coverage}{{1}{14}}
\@writefile{lof}{\contentsline {figure}{\numberline {2}{\ignorespaces Distribution of effective coverages by experiment.\relax }}{15}\protected@file@percent }
\newlabel{suppfig:density-effective-coverage}{{2}{15}}
\@writefile{lof}{\contentsline {figure}{\numberline {3}{\ignorespaces Mapped deduplicated coverage vs.\ effective coverage as described in main manuscript.\relax }}{16}\protected@file@percent }
\newlabel{suppfig:mapped-vs-effcov}{{3}{16}}
\@writefile{lof}{\contentsline {figure}{\numberline {4}{\ignorespaces Overall concordance for SNPs by effective coverage for both filtered and unfiltered variant calls.\relax }}{17}\protected@file@percent }
\newlabel{suppfig:effcov-oconc-snps}{{4}{17}}
\@writefile{lof}{\contentsline {figure}{\numberline {5}{\ignorespaces Non-reference concordance for indels by effective coverage for both filtered and unfiltered variant calls.\relax }}{18}\protected@file@percent }
\newlabel{suppfig:effcov-nrc-indels}{{5}{18}}
\@writefile{lof}{\contentsline {figure}{\numberline {6}{\ignorespaces Non-reference concordance for SNPs by nominal coverage for both filtered and unfiltered variant calls.\relax }}{19}\protected@file@percent }
\newlabel{suppfig:nomcov-nrc-snps}{{6}{19}}
\@writefile{lof}{\contentsline {figure}{\numberline {7}{\ignorespaces Non-reference concordance for indels by nominal coverage for both filtered and unfiltered variant calls.\relax }}{20}\protected@file@percent }
\newlabel{suppfig:nomcov-nrc-indels}{{7}{20}}
\@writefile{lof}{\contentsline {figure}{\numberline {8}{\ignorespaces Overall concordance for SNPs by nominal coverage for both filtered and unfiltered variant calls.\relax }}{21}\protected@file@percent }
\newlabel{suppfig:nomcov-conc-snps}{{8}{21}}
\@writefile{lof}{\contentsline {figure}{\numberline {9}{\ignorespaces Overall concordance for indels by nominal coverage for both filtered and unfiltered variant calls.\relax }}{22}\protected@file@percent }
\newlabel{suppfig:nomcov-conc-indels}{{9}{22}}
\@writefile{lof}{\contentsline {figure}{\numberline {10}{\ignorespaces Non-reference concordance for SNPs at filtered variant calls by non-reference allele frequency in the 1000 Genomes Phase 3 callset.\relax }}{23}\protected@file@percent }
\newlabel{suppfig:filtered-snp-nrc-by-nraf}{{10}{23}}
\@writefile{lof}{\contentsline {figure}{\numberline {11}{\ignorespaces Average non-reference concordance for unfiltered SNPs by superpopulation by non-reference allele frequency in 1KGP3.\ Same figure as Figure 2\hbox {} on a log scale.\relax }}{23}\protected@file@percent }
\newlabel{suppfig:unfiltered-snp-nrc-by-nraf-logscale}{{11}{23}}
\@writefile{lof}{\contentsline {figure}{\numberline {12}{\ignorespaces Non-reference concordance for SNPs at unfiltered variant calls by non-reference allele frequency in the 1000 Genomes Phase 3 callset, by imputation algorithm and Experiment.\relax }}{24}\protected@file@percent }
\newlabel{suppfig:revisions-chr21-nrc}{{12}{24}}
\@writefile{lof}{\contentsline {figure}{\numberline {13}{\ignorespaces Same as in Figure 3\hbox {} but on a log scale.\ The values on the $x$-axis are the midpoints of the minor allele frequency bins.\ The bin edges are at 0, 0.01, 0.02, 0.03, 0.04, 0.05, 0.06, 0.07, 0.08, 0.09, 0.1, 0.15, 0.2, 0.25, 0.5.\relax }}{25}\protected@file@percent }
\newlabel{suppfig:r2-logscale}{{13}{25}}
\@writefile{lof}{\contentsline {figure}{\numberline {14}{\ignorespaces Absolute errors in polygenic risk score estimates by effective coverage.\ The dotted horizontal lines denote the mean error in PRS estimation from Illumina GSA calls across cell lines replicates.\ The shaded area about each dotted horizontal line denotes the standard error of the mean of these quantities.\relax }}{26}\protected@file@percent }
\newlabel{suppfig:abserrs-prs-effcov}{{14}{26}}
\@writefile{lof}{\contentsline {figure}{\numberline {15}{\ignorespaces Scatterplot of estimated PRS from imputed dosages vs the true PRS for all samples across experiments, populations, and traits.\ The PRS computed off genotypes in the 1KGP3 genotypes was considered the ``truth'' value for all cell lines.\relax }}{27}\protected@file@percent }
\newlabel{suppfig:prs-estimated-true-scatterplot}{{15}{27}}
