\relax 
\citation{sella2019thinking,visscher2012five,wellcome2007genome,yang2010common}
\citation{walsh2018evolution,risch1999genomic,judson1979eighth}
\citation{visscher2012five}
\citation{li2009genotype,marchini2010genotype}
\citation{wetterstrand2019dna}
\citation{tran2020genetic,gilly2019very,rubinacci2020efficient,homburger2019low,wasik2019comparing,jensen2020sorghum,cai2015sparse,liu2018genomic}
\citation{10002015global}
\citation{tran2020genetic,liu2018genomic}
\citation{pasaniuc2012extremely}
\citation{gilly2019very,homburger2019low}
\citation{aird2011analyzing,jones2015library}
\citation{wetterstrand2019dna}
\citation{10002015global}
\citation{mavaddat2019polygenic,inouye2018genomic}
\@writefile{lot}{\contentsline {table}{\numberline {1}{\ignorespaces Details of experiments conducted.\ Experiments A-D were based on low-pass sequencing (lpSeq) while experiment E used the Illumina GSA v3.0.\ The samples column describes the number of unique cell lines and the number of replicates run for each of them.\ Library prep was performed by Gencove for experiments A-C and libraries were sequenced on the Illumina HiSeqX.\ For experiment D, DNA was sent to BGI who performed the library prep and sequencing.\ Empirical coverage for each sample was calculated by dividing the number of bases sequenced by the size of the human genome ($\sim 3.3$Gb).\relax }}{3}\protected@file@percent }
\providecommand*\caption@xref[2]{\@setref\relax\@undefined{#1}}
\newlabel{tab:experiment-overview}{{1}{3}}
\citation{harrell2017regression}
\citation{harrell2017regression}
\@writefile{lof}{\contentsline {figure}{\numberline {1}{\ignorespaces Non-reference concordance (NRC) (Methods) for imputed SNPs for all EUR samples in Experiments A-D plotted against effective coverage $\lambda _{\mathrm  {eff}}$ (left pane) or nominal mapped coverage (right pane).\ We modeled the NRC as the response variable for a $k=5$ knot cubic restricted spline with the respective coverage metric as the explanatory variable;\ the fitted values are shown as a solid line with the surrounding shaded regions representing 95\% confidence intervals.\ The knot locations were set at the 5th, 27.5th, 50th, 72.5th, and 95th percentiles of the respective coverage metrics following Harrell's rule of thumb \citep  {harrell2017regression}.\relax }}{5}\protected@file@percent }
\newlabel{fig:nrc-coverage-splines}{{1}{5}}
\newlabel{subsec:comparison-of-imputation-quality-metrics-across-experiments}{{}{5}}
\citation{balding2019,chapman2003detecting,pritchard2001linkage}
\citation{pritchard2001linkage}
\@writefile{lot}{\contentsline {table}{\numberline {2}{\ignorespaces Mean and interquartile range (in parentheses) non-reference concordance (NRC) across samples for each representative cohort for unfiltered SNPs by experiment and super population.\relax }}{6}\protected@file@percent }
\newlabel{tab:unfiltered-snps-mean-nrc}{{2}{6}}
\@writefile{lof}{\contentsline {figure}{\numberline {2}{\ignorespaces Average non-reference concordance for unfiltered SNPs by superpopulation by non-reference allele frequency in 1KGP3. The NRC for imputed sequence data was consistently higher than the NRC for the imputed GSA data across the allele frequency spectrum.\ Filtering to confidently imputed variants reveals a similar pattern (Supplementary Figure \G@refundefinedtrue \text  {\normalfont  \bfseries  ??}\GenericWarning  {               }{LaTeX Warning: Reference `suppfig:filtered-snp-nrc-by-nraf' on page 7 undefined}).\relax }}{7}\protected@file@percent }
\newlabel{fig:unfiltered-snp-nrc-by-nraf}{{2}{7}}
\citation{balding2019}
\citation{inouye2018genomic,mavaddat2019polygenic}
\@writefile{lof}{\contentsline {figure}{\numberline {3}{\ignorespaces Comparison of imputation quality across experiments for each superpopulation.\ Variants were binned according to their minor allele frequency in the 1KGP3 and imputation $r^2$ averaged across variants in each bin.\ For all experiments the 1KGP3 genotypes were treated as ``truth'' and imputation $r^2$ was computed by taking the squared correlation coefficient between the vector of imputed alternate allelic dosages and the truth genotypes.\ Same results on a log scale are shown in Supplementary Figure \G@refundefinedtrue \text  {\normalfont  \bfseries  ??}\GenericWarning  {               }{LaTeX Warning: Reference `suppfig:r2-logscale' on page 8 undefined}.\ Note that imputation performance at low MAF for a given sequencing experiment was often higher in the AFR cohort compared to the EUR cohort.\relax }}{8}\protected@file@percent }
\newlabel{fig:r2-linearscale}{{3}{8}}
\@writefile{lof}{\contentsline {figure}{\numberline {4}{\ignorespaces For each imputed sample, we computed a PRS for breast cancer and CAD and calculated the squared error of the estimate compared to the PRS of the ``truth'' genotypes in the 1KGP3.\ Each dot represents this squared error for each sequenced sample for a given trait and is colored by which experiment it belongs to.\ To provide a point of comparison to PRS estimated from imputed array data, we computed the mean squared error for each cell line across array replicates and averaged that across all cell lines.\ This quantity is represented by the dashed line for each trait and superpopulation along with the standard error of the mean, represented by the shaded regions about each dashed line.\ The mean squared error for each experiment was calculated in the same way and is rendered as a colored line segment on the rightmost margin of each pane.\ These results indicate that sequencing at effective coverages of \nobreakspace  {}0.5$\times $ or higher generally affords lower measurement error in PRS estimates.\relax }}{9}\protected@file@percent }
\newlabel{fig:sqerrors-prs-effcov}{{4}{9}}
\citation{tran2020genetic,pasaniuc2012extremely,gilly2019very}
\citation{homburger2019low}
\citation{patterson2019impact,xia2019advanced}
\newlabel{sec:Discussion}{{}{10}}
\citation{schurz2019evaluating}
\citation{mccarthy2016reference,taliun2019sequencing}
\citation{stevenson2019neuropsychiatric}
\citation{fisher1919xv,risch1999genomic,barton2017infinitesimal,boyle2017expanded}
\citation{berg2014population,guo2018global}
\citation{Zhou735,dong2016low}
\citation{cai2015genetic,krause2010complete}
\citation{wood2019improved}
\citation{IlluminaS4FlowCell}
\citation{IlluminaGSA}
\citation{lachance2013snp,nielsen2004population}
\citation{wasik2019comparing}
\citation{loh2016reference}
\citation{das2015minimac}
\citation{wasik2019comparing}
\@writefile{lot}{\contentsline {table}{\numberline {3}{\ignorespaces Possible combinations of genotype calls between two callsets at a given biallelic site.\ The diagonal represents concordant calls.\relax }}{15}\protected@file@percent }
\newlabel{tab:nrc-definition}{{3}{15}}
\citation{10002015global}
\bibdata{main}
\bibstyle{genres}
