<?xml version="1.0" encoding="UTF-8" standalone="no"?>
<!--Created with Inkscape (http://www.inkscape.org/)-->
<svg width="155.94629mm" height="118.57878mm" viewBox="0 0 155.94628 118.57878" version="1.1" id="svg5" inkscape:version="1.1 (c68e22c387, 2021-05-23)" sodipodi:docname="ecosystem_rules.svg" xmlns:inkscape="http://www.inkscape.org/namespaces/inkscape" xmlns:sodipodi="http://sodipodi.sourceforge.net/DTD/sodipodi-0.dtd" xmlns="http://www.w3.org/2000/svg" xmlns:svg="http://www.w3.org/2000/svg">
  <sodipodi:namedview id="namedview7" pagecolor="#ffffff" bordercolor="#666666" borderopacity="1.0" inkscape:pageshadow="2" inkscape:pageopacity="0.0" inkscape:pagecheckerboard="0" inkscape:document-units="mm" showgrid="false" fit-margin-top="0" fit-margin-left="0" fit-margin-right="0" fit-margin-bottom="0" inkscape:zoom="2" inkscape:cx="232.75" inkscape:cy="188.75" inkscape:window-width="3840" inkscape:window-height="2071" inkscape:window-x="3831" inkscape:window-y="-9" inkscape:window-maximized="1" inkscape:current-layer="g1053"/>
  <defs id="defs2">
    <clipPath id="clip0">
      <rect x="39" y="151" width="590" height="544" id="rect1008"/>
    </clipPath>
  </defs>
  <g inkscape:label="Layer 1" inkscape:groupmode="layer" id="layer1" transform="translate(8.145826,-26.963583)">
    <g clip-path="url(#clip0)" transform="matrix(0.26458333,0,0,0.26458333,-18.543513,-38.26411)" id="g1053">
      <path d="m 41,470.61576 c 0,-122.81952 131.181,-222.38424 293,-222.38424 161.819,0 293,99.56472 293,222.38424 C 627,593.43528 495.819,693 334,693 172.181,693 41,593.43528 41,470.61576 Z" stroke="#7030a0" stroke-width="3.40331" stroke-linejoin="round" stroke-miterlimit="10" fill="none" fill-rule="evenodd" id="path1013"/>
      <text fill="#7030a0" font-family="Calibri, Calibri_MSFontService, sans-serif" font-weight="400" font-size="30px" id="text1017" x="154.961" y="323">Domain specific compliance <tspan font-size="30px" x="225.5943" y="359" id="tspan1015">rules</tspan></text>
      <text fill="#7030a0" font-family="'Cambria Math', 'Cambria Math_MSFontService', sans-serif" font-weight="400" font-size="30px" id="text1023" x="292.26099" y="359">(ℝ<tspan font-size="22px" x="327.0527" y="365" id="tspan1019">𝑑𝑜𝑚𝑎𝑖𝑛</tspan><tspan font-size="30px" x="411.586" y="359" id="tspan1021">)</tspan></text>
      <path d="m 119,551.34977 c 0,-72.43229 96.483,-131.15024 215.5,-131.15024 119.017,0 215.5,58.71795 215.5,131.15024 C 550,623.78205 453.517,682.5 334.5,682.5 215.483,682.5 119,623.78205 119,551.34977 Z" stroke="#4472c4" stroke-width="3.34329" stroke-linejoin="round" stroke-miterlimit="10" fill="none" fill-rule="evenodd" id="path1025"/>
      <text fill="#4472c4" font-family="Calibri, Calibri_MSFontService, sans-serif" font-weight="400" font-size="30px" id="text1033" x="222.858" y="479">Gaia<tspan font-size="30px" x="277.44131" y="479" id="tspan1027">-</tspan><tspan font-size="30px" x="286.608" y="479" id="tspan1029">X Compliance</tspan><tspan font-size="30px" x="250.94971" y="515" id="tspan1031">rules</tspan></text>
      <text fill="#4472c4" font-family="'Cambria Math', 'Cambria Math_MSFontService', sans-serif" font-weight="400" font-size="30px" id="text1039" x="310.741" y="515">(ℝ<tspan font-size="22px" x="345.53268" y="521" id="tspan1035">𝐺𝑎𝑖𝑎𝑋</tspan><tspan font-size="30px" x="411.841" y="515" id="tspan1037">)</tspan></text>
      <path d="m 275,550.5 c 0,-2.485 2.015,-4.5 4.5,-4.5 h 25 c 2.485,0 4.5,2.015 4.5,4.5 v 18 c 0,2.485 -2.015,4.5 -4.5,4.5 h -25 c -2.485,0 -4.5,-2.015 -4.5,-4.5 z" stroke="#000000" stroke-width="1.66667" stroke-miterlimit="8" fill="#4472c4" fill-rule="evenodd" id="path1041"/>
      <path d="m 365,550.5 c 0,-2.485 2.015,-4.5 4.5,-4.5 h 26 c 2.485,0 4.5,2.015 4.5,4.5 v 18 c 0,2.485 -2.015,4.5 -4.5,4.5 h -26 c -2.485,0 -4.5,-2.015 -4.5,-4.5 z" stroke="#000000" stroke-width="1.66667" stroke-miterlimit="8" fill="#4472c4" fill-rule="evenodd" id="path1043"/>
      <path d="m 331,597.5 c 0,-2.485 2.015,-4.5 4.5,-4.5 h 25 c 2.485,0 4.5,2.015 4.5,4.5 v 18 c 0,2.485 -2.015,4.5 -4.5,4.5 h -25 c -2.485,0 -4.5,-2.015 -4.5,-4.5 z" stroke="#000000" stroke-width="1.66667" stroke-miterlimit="8" fill="#4472c4" fill-rule="evenodd" id="path1045"/>
      <path d="m 297,644.5 c 0,-2.485 2.015,-4.5 4.5,-4.5 h 25 c 2.485,0 4.5,2.015 4.5,4.5 v 18 c 0,2.485 -2.015,4.5 -4.5,4.5 h -25 c -2.485,0 -4.5,-2.015 -4.5,-4.5 z" stroke="#000000" stroke-width="1.66667" stroke-miterlimit="8" fill="#4472c4" fill-rule="evenodd" id="path1047"/>
      <path d="m 436,391.5 c 0,-2.485 2.015,-4.5 4.5,-4.5 h 25 c 2.485,0 4.5,2.015 4.5,4.5 v 18 c 0,2.485 -2.015,4.5 -4.5,4.5 h -25 c -2.485,0 -4.5,-2.015 -4.5,-4.5 z" stroke="#000000" stroke-width="1.66667" stroke-miterlimit="8" fill="#7030a0" fill-rule="evenodd" id="path1049"/>
      <path d="m 143.62501,370.625 c 0,-2.485 2.015,-4.5 4.5,-4.5 h 25 c 2.485,0 4.5,2.015 4.5,4.5 v 18 c 0,2.485 -2.015,4.5 -4.5,4.5 h -25 c -2.485,0 -4.5,-2.015 -4.5,-4.5 z" stroke="#000000" stroke-width="1.66667" stroke-miterlimit="8" fill="#7030a0" fill-rule="evenodd" id="path1049-1"/>
      <path d="m 509,422.5 c 0,-2.485 2.015,-4.5 4.5,-4.5 h 26 c 2.485,0 4.5,2.015 4.5,4.5 v 18 c 0,2.485 -2.015,4.5 -4.5,4.5 h -26 c -2.485,0 -4.5,-2.015 -4.5,-4.5 z" stroke="#000000" stroke-width="1.66667" stroke-miterlimit="8" fill="#7030a0" fill-rule="evenodd" id="path1051"/>
    </g>
  </g>
</svg>
