{
  "@context": [
    "http://www.w3.org/ns/odrl.jsonld",
    { "gx" :"https://registry.lab.gaia-x.eu/development/api/trusted-shape-registry/v1/shapes/jsonld/trustframework#" },
    { "ovc": "https://w3id.org/gaia-x/ovc/1/" }
  ],
  "@type": "Offer",
  "uid": "http://example.com/policy/124",
  "profile": "https://w3id.org/gaia-x/ovc/1/",
  "permission": [
    {
      "@type": "Permission",
      "target": "http://example.com/asset/456",
      "action": "http://www.w3.org/ns/odrl/2/display",
      "assigner": "http://example.com/provider",
      "assignee": {
          "ovc:refinement": [
              {
                  "ovc:leftOperand": "$.credentialSubject.gx:vatID",
                  "operator": "http://www.w3.org/ns/odrl/2/eq",
                  "rightOperand": "BE0762747721",
                  "ovc:credentialSubjectType": "gx:legalRegistrationNumber"
              }
          ]
      }
    }
  ]
}
