{
  "id": "policy-reasoning",
  "params": {
    "rdfsSubClassReasoning": {
      "name": "rdfsSubClassReasoning",
      "label": "RDFS subClass reasoning",
      "value": "true"
    },
    "imports": {
      "name": "imports",
      "label": "Imported RDF files(';' delimited)",
      "value": ""
    },
    "ruleset": {
      "name": "ruleset",
      "label": "Ruleset",
      "value": "rdfsplus-optimized"
    },
    "readOnly": {
      "name": "readOnly",
      "label": "Read-only",
      "value": "false"
    },
    "defaultNS": {
      "name": "defaultNS",
      "label": "Default namespaces for imports(';' delimited)",
      "value": ""
    },
    "globalLogValidationExecution": {
      "name": "globalLogValidationExecution",
      "label": "Log every execution step of the SHACL validation",
      "value": "false"
    },
    "repositoryType": {
      "name": "repositoryType",
      "label": "Repository type",
      "value": "file-repository"
    }
  },
  "title": "PolicyReasoningRepository",
  "type": "graphdb"
}
