{
  "@context": [
    "http://www.w3.org/ns/odrl.jsonld",
    { "gx": "https://registry.lab.gaia-x.eu/development/api/trusted-shape-registry/v1/shapes/jsonld/trustframework#" },
    { "ovc": "https://w3id.org/gaia-x/ovc/1/" }
  ],
  "@type": "Offer",
  "uid": "http://example.com/policy/123",
  "profile": "https://w3id.org/ovc/1/",
  "permission": [
    {
      "@type": "Permission",
      "target": "http://example.com/asset/456",
      "action": "http://www.w3.org/ns/odrl/2/play",
      "assigner": "http://example.com/provider",
      "assignee": {
        "ovc:constraint": [
          {
            "ovc:leftOperand": "$.credentialSubject.gx:legalAddress.gx:countrySubdivisionCode",
            "operator": "http://www.w3.org/ns/odrl/2/isAnyOf",
            "rightOperand": ["FR-HDF", "BE-BRU"],
            "ovc:credentialSubjectType": "gx:LegalParticipant"
          }
        ]
      }
    }
  ]
}
