<svg width="32" height="32" viewBox="0 0 32 32" fill="none" xmlns="http://www.w3.org/2000/svg">
<path d="M10.3541 12.9167C9.36107 12.9167 8.36801 12.5556 7.64579 11.7431L2.58329 6.67361C1.04857 5.13889 1.04857 2.69444 2.58329 1.25C4.11801 -0.291666 6.56246 -0.291666 8.0069 1.25L13.0625 6.3125C14.6041 7.85417 14.6041 10.2917 13.0625 11.7431C12.3402 12.5556 11.3472 12.9167 10.3541 12.9167Z" fill="#000F8E"/>
<path d="M22.7361 12.9167C21.743 12.9167 20.75 12.5556 20.0208 11.7431C18.4861 10.2014 18.4861 7.76389 20.0208 6.3125L25.0833 1.25C26.618 -0.291666 29.0625 -0.291666 30.5069 1.25C32.0416 2.78472 32.0416 5.22917 30.5069 6.67361L25.4444 11.7431C24.7222 12.5556 23.7291 12.9167 22.7361 12.9167Z" fill="#000F8E"/>
<path d="M5.29163 30.4722C4.29857 30.4722 3.30551 30.1111 2.58329 29.2917C1.04857 27.757 1.04857 25.3125 2.58329 23.8681L7.64579 18.7986C9.18051 17.2639 11.618 17.2639 13.0625 18.7986C14.6041 20.3403 14.6041 22.7778 13.0625 24.2292L8.0069 29.2917C7.1944 30.1111 6.28468 30.4722 5.29163 30.4722Z" fill="#000F8E"/>
<path d="M27.7916 30.4722C26.7986 30.4722 25.8055 30.1111 25.0833 29.2917L20.0208 24.2292C18.4861 22.6875 18.4861 20.25 20.0208 18.7986C21.5625 17.2639 24 17.2639 25.4444 18.7986L30.5069 23.8681C32.0416 25.4028 32.0416 27.8472 30.5069 29.2917C29.7847 30.1111 28.7916 30.4722 27.7916 30.4722Z" fill="#000F8E"/>
</svg>