{
  "iisSettings": {
    "windowsAuthentication": false,
    "anonymousAuthentication": true,
    "iisExpress": {
      "applicationUrl": "http://localhost:53168",
      "sslPort": 44327
    }
  },
  "$schema": "http://json.schemastore.org/launchsettings.json",
  "profiles": {
    "IIS Express": {
      "commandName": "IISExpress",
      "launchBrowser": true,
      "launchUrl": "ui",
      "environmentVariables": {
        "SOURCE": "file",
        "ASPNETCORE_ENVIRONMENT": "Development"
      }
    },
    "Kestrel file": {
      "commandName": "Project",
      "launchBrowser": true,
      "launchUrl": "ui",
      "environmentVariables": {
        "SOURCE": "file",
        "ASPNETCORE_ENVIRONMENT": "Development"
      },
      "applicationUrl": "https://localhost:5001;http://localhost:5000"
    },
    "Kestrel SQL": {
      "commandName": "Project",
      "launchBrowser": true,
      "launchUrl": "ui",
      "environmentVariables": {
        "SOURCE": "sql",
        "ASPNETCORE_ENVIRONMENT": "Development"
      },
      "applicationUrl": "https://localhost:5001;http://localhost:5000"
    },
    "Kestrel Firebase": {
      "commandName": "Project",
      "launchBrowser": true,
      "launchUrl": "ui",
      "environmentVariables": {
        "SOURCE": "fb",
        "ASPNETCORE_ENVIRONMENT": "Development"
      },
      "applicationUrl": "https://localhost:5001;http://localhost:5000"
    }
  }
}