<svg version="1.1" id="Layer_1" xmlns="http://www.w3.org/2000/svg" xmlns:xlink="http://www.w3.org/1999/xlink" x="0px" y="0px"
	 viewBox="0 0 512 512" style="enable-background:new 0 0 512 512;" xml:space="preserve">
<g fill="blue">
	<path d="M384,28.4v28.4c15.7,0,28.4,12.8,28.4,28.4c0,15.7-12.8,28.4-28.4,28.4c-15.7,0-28.4-12.8-28.4-28.4 c0-15.7,12.8-28.4,28.4-28.4V28.4V0c-47.1,0-85.3,38.2-85.3,85.3c0,47.1,38.2,85.3,85.3,85.3c47.1,0,85.3-38.2,85.3-85.3 C469.3,38.2,431.1,0,384,0V28.4z"/>
</g>
<g fill="red">
	<path d="M99.6,369.8v28.4c15.7,0,28.4,12.8,28.4,28.4c0,15.7-12.8,28.4-28.4,28.4c-15.7,0-28.4-12.8-28.4-28.4 c0-15.7,12.8-28.4,28.4-28.4V369.8v-28.4c-47.1,0-85.3,38.2-85.3,85.3c0,47.1,38.2,85.3,85.3,85.3c47.1,0,85.3-38.2,85.3-85.3 c0-47.1-38.2-85.3-85.3-85.3V369.8z"/>
	<path d="M99.6,28.4v28.4c15.7,0,28.4,12.8,28.4,28.4c0,15.7-12.8,28.4-28.4,28.4c-15.7,0-28.4-12.8-28.4-28.4 c0-15.7,12.8-28.4,28.4-28.4V28.4V0C52.4,0,14.2,38.2,14.2,85.3c0,47.1,38.2,85.3,85.3,85.3c47.1,0,85.3-38.2,85.3-85.3 C184.9,38.2,146.7,0,99.6,0V28.4z"/>
	<path d="M71.1,142.2v227.6c0,15.7,12.7,28.4,28.4,28.4s28.4-12.7,28.4-28.4V142.2c0-15.7-12.7-28.4-28.4-28.4 S71.1,126.5,71.1,142.2"/>
	<path d="M156.4,455.1h170.7c47.1,0,85.3-38.2,85.3-85.3V227.6c0-15.7-12.7-28.4-28.4-28.4c-15.7,0-28.4,12.7-28.4,28.4v142.2 c0,15.7-12.8,28.4-28.4,28.4H156.4c-15.7,0-28.4,12.7-28.4,28.4C128,442.4,140.7,455.1,157.4,455.1L156.4,455.1z"/>
</g>
</svg>
