<svg version="1.1" id="Layer_1" xmlns="http://www.w3.org/2000/svg" xmlns:xlink="http://www.w3.org/1999/xlink" x="0px" y="0px"
	 viewBox="0 0 512 512" style="enable-background:new 0 0 512 512;" xml:space="preserve">
<g fill="blue">
	<path d="M384,28.4v28.4c15.7,0,28.4,12.8,28.4,28.4c0,15.7-12.8,28.4-28.4,28.4c-15.7,0-28.4-12.8-28.4-28.4 c0-15.7,12.8-28.4,28.4-28.4V28.4V0c-47.1,0-85.3,38.2-85.3,85.3c0,47.1,38.2,85.3,85.3,85.3c47.1,0,85.3-38.2,85.3-85.3 C469.3,38.2,431.1,0,384,0V28.4z"/>
</g>
<g fill="red">
	<path d="M99.6,369.8v28.4c15.7,0,28.4,12.8,28.4,28.4c0,15.7-12.8,28.4-28.4,28.4c-15.7,0-28.4-12.8-28.4-28.4 c0-15.7,12.8-28.4,28.4-28.4V369.8v-28.4c-47.1,0-85.3,38.2-85.3,85.3c0,47.1,38.2,85.3,85.3,85.3c47.1,0,85.3-38.2,85.3-85.3 c0-47.1-38.2-85.3-85.3-85.3V369.8z"/>
	<path d="M156.4,455.1h170.7c47.1,0,85.3-38.2,85.3-85.3V227.6c0-15.7-12.7-28.4-28.4-28.4c-15.7,0-28.4,12.7-28.4,28.4v142.2 c0,15.7-12.8,28.4-28.4,28.4H156.4c-15.7,0-28.4,12.7-28.4,28.4C128,442.4,140.7,455.1,156.4,455.1L156.4,455.1z"/>
	<path d="M318.8,333l65.2-65.2l65.2,65.2c11.1,11.1,29.1,11.1,40.2,0c11.1-11.1,11.1-29.1,0-40.2l-85.3-85.3 c-11.1-11.1-29.1-11.1-40.2,0l-85.3,85.3c-11.1,11.1-11.1,29.1,0,40.2C289.7,344.1,307.7,344.1,318.8,333L318.8,333z"/>
</g>
</svg>
