[gd_resource type="Resource" load_steps=3 format=2]

[ext_resource path="res://anims/barista.tres" type="SpriteFrames" id=1]
[ext_resource path="res://custom_resource/character.gd" type="Script" id=2]

[resource]
script = ExtResource( 2 )
char_name = "barista"
anim = ExtResource( 1 )
color = Color( 0.631373, 0.239216, 0.231373, 1 )
is_playable = false
