[gd_resource type="Resource" load_steps=3 format=2]

[ext_resource path="res://anims/couple-f.tres" type="SpriteFrames" id=1]
[ext_resource path="res://custom_resource/character.gd" type="Script" id=2]

[resource]
script = ExtResource( 2 )
char_name = "sara"
anim = ExtResource( 1 )
color = Color( 0.890196, 0.823529, 0.270588, 1 )
is_playable = false
