[gd_resource type="Resource" load_steps=3 format=2]

[ext_resource path="res://anims/abdel.tres" type="SpriteFrames" id=1]
[ext_resource path="res://custom_resource/character.gd" type="Script" id=2]

[resource]
script = ExtResource( 2 )
char_name = "abdel"
anim = ExtResource( 1 )
color = Color( 0.541176, 0.560784, 0.768627, 1 )
is_playable = true
