; Engine configuration file.
; It's best edited using the editor UI and not directly,
; since the parameters that go here are not all obvious.
;
; Format:
;   [section] ; section goes between []
;   param=value ; assign values to parameters

config_version=4

_global_script_classes=[ {
"base": "Resource",
"class": "CharacterResource",
"language": "GDScript",
"path": "res://custom_resource/character.gd"
}, {
"base": "Container",
"class": "CharacterSelect",
"language": "GDScript",
"path": "res://character_select.gd"
}, {
"base": "Npc",
"class": "CoffeeBuyer",
"language": "GDScript",
"path": "res://coffee_buyer.gd"
}, {
"base": "Reference",
"class": "Compiler",
"language": "GDScript",
"path": "res://addons/yarnspinner/compiler.gd"
}, {
"base": "Reference",
"class": "Dialogue",
"language": "GDScript",
"path": "res://addons/yarnspinner/dialogue.gd"
}, {
"base": "Node",
"class": "DialogueRunner",
"language": "GDScript",
"path": "res://addons/yarnspinner/dialogue_runner.gd"
}, {
"base": "DialogueUIBehavior",
"class": "DialogueUI",
"language": "GDScript",
"path": "res://dialogue_ui.gd"
}, {
"base": "Node",
"class": "DialogueUIBehavior",
"language": "GDScript",
"path": "res://addons/yarnspinner/dialogue_ui_behavior.gd"
}, {
"base": "StaticEntity",
"class": "Door",
"language": "GDScript",
"path": "res://door.gd"
}, {
"base": "KinematicBody2D",
"class": "Entity",
"language": "GDScript",
"path": "res://entity.gd"
}, {
"base": "AnimatedSprite",
"class": "HeldItem",
"language": "GDScript",
"path": "res://held_item.gd"
}, {
"base": "Area2D",
"class": "InteractableArea",
"language": "GDScript",
"path": "res://interactable_area.gd"
}, {
"base": "Reference",
"class": "Interactions",
"language": "GDScript",
"path": "res://interactions.gd"
}, {
"base": "Resource",
"class": "ItemResource",
"language": "GDScript",
"path": "res://custom_resource/item.gd"
}, {
"base": "Reference",
"class": "Lexer",
"language": "GDScript",
"path": "res://addons/yarnspinner/lexer.gd"
}, {
"base": "Reference",
"class": "Loader",
"language": "GDScript",
"path": "res://addons/yarnspinner/loader.gd"
}, {
"base": "Person",
"class": "Npc",
"language": "GDScript",
"path": "res://npc.gd"
}, {
"base": "Reference",
"class": "Parser",
"language": "GDScript",
"path": "res://addons/yarnspinner/parser.gd"
}, {
"base": "KinematicBody2D",
"class": "Person",
"language": "GDScript",
"path": "res://person.gd"
}, {
"base": "Person",
"class": "Player",
"language": "GDScript",
"path": "res://player.gd"
}, {
"base": "Reference",
"class": "Program",
"language": "GDScript",
"path": "res://addons/yarnspinner/program.gd"
}, {
"base": "AnimatedSprite",
"class": "Seat",
"language": "GDScript",
"path": "res://seat.gd"
}, {
"base": "StaticBody2D",
"class": "StaticEntity",
"language": "GDScript",
"path": "res://static.gd"
}, {
"base": "StaticEntity",
"class": "Table",
"language": "GDScript",
"path": "res://table.gd"
}, {
"base": "Npc",
"class": "TacoBuyer",
"language": "GDScript",
"path": "res://taco_buyer.gd"
}, {
"base": "Reference",
"class": "Value",
"language": "GDScript",
"path": "res://addons/yarnspinner/value.gd"
}, {
"base": "Reference",
"class": "VirtualMachine",
"language": "GDScript",
"path": "res://addons/yarnspinner/virtual_machine.gd"
} ]
_global_script_class_icons={
"CharacterResource": "",
"CharacterSelect": "",
"CoffeeBuyer": "",
"Compiler": "",
"Dialogue": "",
"DialogueRunner": "",
"DialogueUI": "",
"DialogueUIBehavior": "",
"Door": "",
"Entity": "",
"HeldItem": "",
"InteractableArea": "",
"Interactions": "",
"ItemResource": "",
"Lexer": "",
"Loader": "",
"Npc": "",
"Parser": "",
"Person": "",
"Player": "",
"Program": "",
"Seat": "",
"StaticEntity": "",
"Table": "",
"TacoBuyer": "",
"Value": "",
"VirtualMachine": ""
}

[application]

config/name="bloomfield"
run/main_scene="res://main.tscn"
boot_splash/image="res://sprites/character_icon/grocer.png"
config/icon="res://sprites/character_icon/grocer.png"

[autoload]

input="*res://input.gd"
item_table="*res://item_table.gd"
areas="*res://areas.gd"
test="*res://test.gd"

[debug]

gdscript/warnings/unsafe_property_access=true
gdscript/warnings/unsafe_method_access=true
gdscript/warnings/unsafe_cast=true
gdscript/warnings/unsafe_call_argument=true

[display]

window/size/width=256
window/size/height=144
window/size/test_width=1024
window/size/test_height=576
window/stretch/mode="viewport"
window/stretch/aspect="keep"

[importer_defaults]

texture={
"compress/bptc_ldr": 0,
"compress/hdr_mode": 0,
"compress/lossy_quality": 0.7,
"compress/mode": 0,
"compress/normal_map": 0,
"detect_3d": false,
"flags/anisotropic": false,
"flags/filter": false,
"flags/mipmaps": false,
"flags/repeat": 0,
"flags/srgb": 2,
"process/HDR_as_SRGB": false,
"process/fix_alpha_border": true,
"process/invert_color": false,
"process/premult_alpha": false,
"size_limit": 0,
"stream": false,
"svg/scale": 1.0
}

[input]

ui_select={
"deadzone": 0.5,
"events": [ Object(InputEventKey,"resource_local_to_scene":false,"resource_name":"","device":0,"alt":false,"shift":false,"control":false,"meta":false,"command":false,"pressed":false,"scancode":32,"unicode":0,"echo":false,"script":null)
, Object(InputEventJoypadButton,"resource_local_to_scene":false,"resource_name":"","device":0,"button_index":3,"pressure":0.0,"pressed":false,"script":null)
, Object(InputEventKey,"resource_local_to_scene":false,"resource_name":"","device":0,"alt":false,"shift":false,"control":false,"meta":false,"command":false,"pressed":false,"scancode":88,"unicode":0,"echo":false,"script":null)
, Object(InputEventKey,"resource_local_to_scene":false,"resource_name":"","device":0,"alt":false,"shift":false,"control":false,"meta":false,"command":false,"pressed":false,"scancode":16777221,"unicode":0,"echo":false,"script":null)
 ]
}
ui_cancel={
"deadzone": 0.5,
"events": [ Object(InputEventKey,"resource_local_to_scene":false,"resource_name":"","device":0,"alt":false,"shift":false,"control":false,"meta":false,"command":false,"pressed":false,"scancode":16777217,"unicode":0,"echo":false,"script":null)
, Object(InputEventJoypadButton,"resource_local_to_scene":false,"resource_name":"","device":0,"button_index":1,"pressure":0.0,"pressed":false,"script":null)
, Object(InputEventKey,"resource_local_to_scene":false,"resource_name":"","device":0,"alt":false,"shift":false,"control":false,"meta":false,"command":false,"pressed":false,"scancode":90,"unicode":0,"echo":false,"script":null)
 ]
}
ui_left={
"deadzone": 0.5,
"events": [ Object(InputEventJoypadButton,"resource_local_to_scene":false,"resource_name":"","device":0,"button_index":14,"pressure":0.0,"pressed":false,"script":null)
, Object(InputEventKey,"resource_local_to_scene":false,"resource_name":"","device":0,"alt":false,"shift":false,"control":false,"meta":false,"command":false,"pressed":false,"scancode":16777231,"unicode":0,"echo":false,"script":null)
, Object(InputEventKey,"resource_local_to_scene":false,"resource_name":"","device":0,"alt":false,"shift":false,"control":false,"meta":false,"command":false,"pressed":false,"scancode":65,"unicode":0,"echo":false,"script":null)
 ]
}
ui_right={
"deadzone": 0.5,
"events": [ Object(InputEventKey,"resource_local_to_scene":false,"resource_name":"","device":0,"alt":false,"shift":false,"control":false,"meta":false,"command":false,"pressed":false,"scancode":16777233,"unicode":0,"echo":false,"script":null)
, Object(InputEventJoypadButton,"resource_local_to_scene":false,"resource_name":"","device":0,"button_index":15,"pressure":0.0,"pressed":false,"script":null)
, Object(InputEventKey,"resource_local_to_scene":false,"resource_name":"","device":0,"alt":false,"shift":false,"control":false,"meta":false,"command":false,"pressed":false,"scancode":68,"unicode":0,"echo":false,"script":null)
 ]
}
ui_up={
"deadzone": 0.5,
"events": [ Object(InputEventKey,"resource_local_to_scene":false,"resource_name":"","device":0,"alt":false,"shift":false,"control":false,"meta":false,"command":false,"pressed":false,"scancode":16777232,"unicode":0,"echo":false,"script":null)
, Object(InputEventJoypadButton,"resource_local_to_scene":false,"resource_name":"","device":0,"button_index":12,"pressure":0.0,"pressed":false,"script":null)
, Object(InputEventKey,"resource_local_to_scene":false,"resource_name":"","device":0,"alt":false,"shift":false,"control":false,"meta":false,"command":false,"pressed":false,"scancode":87,"unicode":0,"echo":false,"script":null)
 ]
}
ui_down={
"deadzone": 0.5,
"events": [ Object(InputEventJoypadButton,"resource_local_to_scene":false,"resource_name":"","device":0,"button_index":13,"pressure":0.0,"pressed":false,"script":null)
, Object(InputEventKey,"resource_local_to_scene":false,"resource_name":"","device":0,"alt":false,"shift":false,"control":false,"meta":false,"command":false,"pressed":false,"scancode":83,"unicode":0,"echo":false,"script":null)
, Object(InputEventKey,"resource_local_to_scene":false,"resource_name":"","device":0,"alt":false,"shift":false,"control":false,"meta":false,"command":false,"pressed":false,"scancode":16777234,"unicode":0,"echo":false,"script":null)
 ]
}
ui_any={
"deadzone": 0.5,
"events": [ Object(InputEventKey,"resource_local_to_scene":false,"resource_name":"","device":0,"alt":false,"shift":false,"control":false,"meta":false,"command":false,"pressed":false,"scancode":81,"unicode":0,"echo":false,"script":null)
 ]
}

[layer_]

Layer=false

[layer_names]

2d_physics/layer_1="player"
2d_physics/layer_2="npcs"
2d_physics/layer_3="inner_bounds"
2d_physics/layer_4="outer_bounds"

[rendering]

quality/driver/driver_name="GLES2"
quality/2d/use_pixel_snap=true
