{
  "sub": "00u1hzw7f2X6fXBlj357",
  "name": "Flavio Espinoza",
  "locale": "US",
  "email": "flavio@webshield.io",
  "picture": "https://i.imgur.com/Yd8qLyh.jpg",
  "nickname": "Flavio",
  "preferred_username": "flavio@webshield.io",
  "given_name": "Steven",
  "middle_name": "Flavio",
  "family_name": "Espinoza",
  "zoneinfo": "MST",
  "updated_at": 1585033550,
  "email_verified": true,
  "phone_number": "385-216-8969"
}
