# provides relative vectors from eye-point to aircraft lights
# in east/north/up coordinates the renderer uses

var heading_node = props.globals.getNode("/orientation/heading-deg");
var alt_agl_node = props.globals.getNode("/position/altitude-agl-ft");
var x0 = props.globals.getNode("/sim/rendering/als-secondary-lights/lightspot/eyerel-x-m");
var y0 = props.globals.getNode("/sim/rendering/als-secondary-lights/lightspot/eyerel-y-m");
var z0 = props.globals.getNode("/sim/rendering/als-secondary-lights/lightspot/eyerel-z-m");
var dir0 = props.globals.getNode("/sim/rendering/als-secondary-lights/lightspot/dir");
var x1 = props.globals.getNode("/sim/rendering/als-secondary-lights/lightspot/eyerel-x-m[1]");
var y1 = props.globals.getNode("/sim/rendering/als-secondary-lights/lightspot/eyerel-y-m[1]");
var z1 = props.globals.getNode("/sim/rendering/als-secondary-lights/lightspot/eyerel-z-m[1]");
var dir1 = props.globals.getNode("/sim/rendering/als-secondary-lights/lightspot/dir[1]");

var light_manager = {

    lat_to_m: 110952.0,
    lon_to_m: 0.0,

    light1_xpos: 0.0,
    light1_ypos: 0.0,
    light1_zpos: 0.0,
    light1_r: 0.0,
    light1_g: 0.0,
    light1_b: 0.0,
    light1_size: 0.0,
    light1_stretch: 0.0,

    light2_xpos: 0.0,
    light2_ypos: 0.0,
    light2_zpos: 0.0,
    light2_r: 0.0,
    light2_g: 0.0,
    light2_b: 0.0,
    light2_size: 0.0,
    light2_stretch: 0.0,

    #light3_xpos: 0.0,
    #light3_ypos: 0.0,
    #light3_zpos: 0.0,
    #light3_r: 0.0,
    #light3_g: 0.0,
    #light3_b: 0.0,
    #light3_size: 0.0,

    #light4_xpos: 0.0,
    #light4_ypos: 0.0,
    #light4_zpos: 0.0,
    #light4_r: 0.0,
    #light4_g: 0.0,
    #light4_b: 0.0,
    #light4_size: 0.0,

    #light5_xpos: 0.0,
    #light5_ypos: 0.0,
    #light5_zpos: 0.0,
    #light5_r: 0.0,
    #light5_g: 0.0,
    #light5_b: 0.0,
    #light5_size: 0.0,

    init: func {
        # define your lights here

        # light 1 ########
        # offsets to aircraft center
        me.light1_xpos =  110.0;
        me.light1_ypos =  0.0;
        me.light1_zpos =  0.0;

        # color values
        me.light1_r = 1.0;
        me.light1_g = 0.839;
        me.light1_b = 0.667;

        # spot size
        me.light1_size = 17.5;
        me.light1_stretch = 5.0;

        # light 2 ########
        # offsets to aircraft center
        me.light2_xpos =  60.0;
        me.light2_ypos =  0.0;
        me.light2_zpos =  0.0;

        # color values
        me.light2_r = 0.25;
        me.light2_g = 0.21;
        me.light2_b = 0.177;

        # spot size
        me.light2_size = 30.0;
        me.light2_stretch = 1.0;

        # light 3 ########
        # offsets to aircraft center
        #me.light3_xpos = 1.5;
        #me.light3_ypos = -6.0;
        #me.light3_zpos = 2.0;

        # color values
        #me.light3_r = 0.0;
        #me.light3_g = 0.05;
        #me.light3_b = 0.0;

        # spot size
        #me.light3_size = 5.0;

        # light 4 ########
        # offsets to aircraft center
        #me.light4_xpos = 1.5;
        #me.light4_ypos = 6.0;
        #me.light4_zpos = 2.0;

        # color values
        #me.light4_r = 0.05;
        #me.light4_g = 0.0;
        #me.light4_b = 0.0;

        # spot size
        #me.light4_size = 5.0;

        # light 5 ######## star
        # offsets to aircraft center
        #me.light5_xpos = 0.7;
        #me.light5_ypos = 0;
        #me.light5_zpos = 2.0;

        # color values
        #me.light5_r = 0.3;
        #me.light5_g = 0.3;
        #me.light5_b = 0.3;

        # spot size
        #me.light5_size = 20.0;

        setprop("/sim/rendering/als-secondary-lights/num-lightspots", 2);

        setprop("/sim/rendering/als-secondary-lights/lightspot/size", me.light1_size);
        setprop("/sim/rendering/als-secondary-lights/lightspot/size[1]", me.light2_size);
        #setprop("/sim/rendering/als-secondary-lights/lightspot/size[2]", me.light3_size);
        #setprop("/sim/rendering/als-secondary-lights/lightspot/size[3]", me.light4_size);
        #setprop("/sim/rendering/als-secondary-lights/lightspot/size[4]", me.light4_size);

        setprop("/sim/rendering/als-secondary-lights/lightspot/stretch", me.light1_stretch);
        setprop("/sim/rendering/als-secondary-lights/lightspot/stretch[1]", me.light2_stretch);


        me.light_manager_timer = maketimer(0.0, func{me.update()});

        #me.start();
    },

    start: func {
        me.light_manager_timer.start();
        light_manager.enable_or_disable(getprop("/sim/multiplay/generic/bool[2]"), 0);
        light_manager.enable_or_disable(getprop("/sim/multiplay/generic/bool[3]"), 1);
    },

    stop: func {
        light_manager.enable_or_disable(0, 0);
        light_manager.enable_or_disable(0, 1);
        me.light_manager_timer.stop();
    },

    update: func {

        var apos = geo.aircraft_position();
        var vpos = geo.viewer_position();

        me.lon_to_m = math.cos(apos.lat()*math.pi/180.0) * me.lat_to_m;

        var heading = heading_node.getValue() * math.pi/180.0;

        var lat = apos.lat();
        var lon = apos.lon();
        var alt = apos.alt();

        var sh = math.sin(heading);
        var ch = math.cos(heading);

        var alt_agl = alt_agl_node.getValue();

        var proj_x = alt_agl;
        var proj_z = alt_agl/10.0;

        # light 1 position
        apos.set_lat(lat + ((me.light1_xpos + proj_x) * ch + me.light1_ypos * sh) / me.lat_to_m);
        apos.set_lon(lon + ((me.light1_xpos + proj_x)* sh - me.light1_ypos * ch) / me.lon_to_m);

        var delta_x = (apos.lat() - vpos.lat()) * me.lat_to_m;
        var delta_y = -(apos.lon() - vpos.lon()) * me.lon_to_m;
        var delta_z = apos.alt()- proj_z - vpos.alt();

        x0.setValue(delta_x);
        y0.setValue(delta_y);
        z0.setValue(delta_z);
        dir0.setValue(heading);

        # light 2 position
        apos.set_lat(lat + ((me.light2_xpos + proj_x) * ch + me.light2_ypos * sh) / me.lat_to_m);
        apos.set_lon(lon + ((me.light2_xpos + proj_x)* sh - me.light2_ypos * ch) / me.lon_to_m);

        var delta_x = (apos.lat() - vpos.lat()) * me.lat_to_m;
        var delta_y = -(apos.lon() - vpos.lon()) * me.lon_to_m;
        var delta_z = apos.alt()- proj_z - vpos.alt();

        x1.setValue(delta_x);
        y1.setValue(delta_y);
        z1.setValue(delta_z);
        dir1.setValue(heading);

        # light 3 position
        #apos.set_lat(lat + (me.light3_xpos * ch + me.light3_ypos * sh) / me.lat_to_m);
        #apos.set_lon(lon + (me.light3_xpos * sh - me.light3_ypos * ch) / me.lon_to_m);

        #delta_x = (apos.lat() - vpos.lat()) * me.lat_to_m;
        #delta_y = -(apos.lon() - vpos.lon()) * me.lon_to_m;
        #delta_z = apos.alt() - vpos.alt();

        #setprop("/sim/rendering/als-secondary-lights/lightspot/eyerel-x-m[2]", delta_x);
        #setprop("/sim/rendering/als-secondary-lights/lightspot/eyerel-y-m[2]", delta_y);
        #setprop("/sim/rendering/als-secondary-lights/lightspot/eyerel-z-m[2]", delta_z);

        # light 4 position
        #apos.set_lat(lat + (me.light4_xpos * ch + me.light4_ypos * sh) / me.lat_to_m);
        #apos.set_lon(lon + (me.light4_xpos * sh - me.light4_ypos * ch) / me.lon_to_m);

        #delta_x = (apos.lat() - vpos.lat()) * me.lat_to_m;
        #delta_y = -(apos.lon() - vpos.lon()) * me.lon_to_m;
        #delta_z = apos.alt() - vpos.alt();

        #setprop("/sim/rendering/als-secondary-lights/lightspot/eyerel-x-m[3]", delta_x);
        #setprop("/sim/rendering/als-secondary-lights/lightspot/eyerel-y-m[3]", delta_y);
        #setprop("/sim/rendering/als-secondary-lights/lightspot/eyerel-z-m[3]", delta_z);

        # light 5 position
        #apos.set_lat(lat + (me.light5_xpos * ch + me.light5_ypos * sh) / me.lat_to_m);
        #apos.set_lon(lon + (me.light5_xpos * sh - me.light5_ypos * ch) / me.lon_to_m);

        #delta_x = (apos.lat() - vpos.lat()) * me.lat_to_m;
        #delta_y = -(apos.lon() - vpos.lon()) * me.lon_to_m;
        #delta_z = apos.alt() - vpos.alt();

        #setprop("/sim/rendering/als-secondary-lights/lightspot/eyerel-x-m[4]", delta_x);
        #setprop("/sim/rendering/als-secondary-lights/lightspot/eyerel-y-m[4]", delta_y);
        #setprop("/sim/rendering/als-secondary-lights/lightspot/eyerel-z-m[4]", delta_z);

    },

    switch_position: func(light, lightr, lightg, lightb) {
        setprop("/sim/rendering/als-secondary-lights/lightspot/lightspot-r["~light~"]", lightr);
        setprop("/sim/rendering/als-secondary-lights/lightspot/lightspot-g["~light~"]", lightg);
        setprop("/sim/rendering/als-secondary-lights/lightspot/lightspot-b["~light~"]", lightb);
    },

    enable_or_disable: func (enable, light_num) {
        if (enable and me.light_manager_timer.isRunning) {
            if (light_num == 0)
                me.switch_position(light_num, me.light1_r, me.light1_g, me.light1_b);
            if (light_num == 1)
                me.switch_position(light_num, me.light2_r, me.light2_g, me.light2_b);
            #if (light_num == 2)
            #    me.switch_position(light_num, me.light3_r, me.light3_g, me.light3_b);
            #if (light_num == 3)
            #    me.switch_position(light_num, me.light4_r, me.light4_g, me.light4_b);
            #if (light_num == 4)
            #    me.switch_position(light_num, me.light5_r, me.light5_g, me.light5_b);
        } else {
            me.switch_position(light_num, 0.0, 0.0, 0.0);
        }
    },

};

light_manager.init();

var compositor_enabled_node = props.globals.getNode("/fdm/jsbsim/systems/lighting/lightsrc_noauto/compositor_enabled", 1);

var switch_calc = func () {
    version = split(".", getprop("/sim/version/flightgear"));
    version_req = 0;
    if (num(version[0]) > 2020) version_req = 1;
    if (num(version[0]) == 2020 and num(version[1]) > 4) version_req = 1;
    if (num(version[0]) == 2020 and num(version[1]) == 4 and num(version[2]) >= 0) version_req = 1;

    if (
        # If ALS is enabled and at least one supporting shader is at enough level to show the light
        getprop("/sim/rendering/shaders/skydome") and getprop("/sim/rendering/shaders/landmass") > 3 and
        # and FG 2020.4.x Compositor lights are disabled
        (version_req != 1 or getprop("/sim/rendering/dynamic-lighting/enabled") != 1)
    ) {
        light_manager.start();
        compositor_enabled_node.setValue(0.0);
    }
    else {
        light_manager.stop();
        compositor_enabled_node.setValue(1.0);
    }
}
switch_calc();
setlistener("/sim/rendering/dynamic-lighting/enabled", switch_calc);
setlistener("/sim/rendering/shaders/skydome", switch_calc);
setlistener("/sim/rendering/shaders/landmass", switch_calc);


# Beacons implementation
# FIXME: due to some problems with lightmaps on the engine pod upper beacon lightmap should have its own prop
var collision_node = props.globals.getNode("fdm/jsbsim/systems/lighting/lightsrc_noauto/collision", 1);

var beacon_upper_node = props.globals.getNode("fdm/jsbsim/systems/lighting/lightsrc_noauto/beacon_upper", 1);
var beacon_upper_lm_node = props.globals.getNode("fdm/jsbsim/systems/lighting/lightsrc_noauto/beacon_upper_lm", 1);
var beacon_upper_func_off = func() {
  beacon_upper_node.setValue(0.0);
  beacon_upper_lm_node.setValue(0.0);
}
var timer_beacon_upper_off = maketimer(0.0625, beacon_upper_func_off);
timer_beacon_upper_off.simulatedTime = 1;
timer_beacon_upper_off.singleShot = 1;
var beacon_upper_func_on = func() {
  if (collision_node.getValue()) {
    beacon_upper_node.setValue(1.0);
    if (compositor_enabled_node.getValue()) beacon_upper_lm_node.setValue(1.0);
  }
  timer_beacon_upper_off.start();
}
var timer_beacon_upper_on = maketimer(2.05, beacon_upper_func_on);
timer_beacon_upper_on.simulatedTime = 1;

var beacon_lower_node = props.globals.getNode("fdm/jsbsim/systems/lighting/lightsrc_noauto/beacon_lower", 1);
var beacon_lower_func_off = func() {
  beacon_lower_node.setValue(0.0);
}
var timer_beacon_lower_off = maketimer(0.0625, beacon_lower_func_off);
timer_beacon_lower_off.simulatedTime = 1;
timer_beacon_lower_off.singleShot = 1;
var beacon_lower_func_on = func() {
  if (collision_node.getValue()) beacon_lower_node.setValue(1.0);
  timer_beacon_lower_off.start();
}
var timer_beacon_lower_on = maketimer(1.96, beacon_lower_func_on);
timer_beacon_lower_on.simulatedTime = 1;

# Landing light lightmap imlementation
var landing_node = props.globals.getNode("fdm/jsbsim/systems/lighting/lightsrc_noauto/landing", 1);
var taxi_node = props.globals.getNode("fdm/jsbsim/systems/lighting/lightsrc_noauto/taxi", 1);
var headlight_lm_node = props.globals.getNode("fdm/jsbsim/systems/lighting/lightsrc_noauto/headlight_lm", 1);
var headlight_func = func() {
  if (landing_node.getValue()) headlight_lm_node.setValue(1.0);
  else if (taxi_node.getValue()) headlight_lm_node.setValue(0.5);
  else headlight_lm_node.setValue(0.0);
}


setlistener("/sim/multiplay/generic/bool[2]", func (node) {
    light_manager.enable_or_disable(node.getValue(), 0);
}, 1, 0);
setlistener("/sim/multiplay/generic/bool[3]", func (node) {
    light_manager.enable_or_disable(node.getValue(), 1);
}, 1, 0);


setlistener("/sim/signals/fdm-initialized", func() {
    var ls1 = setlistener("/sim/rendering/dynamic-lighting/enabled", switch_calc, 0, 0);
    var ls2 = setlistener("/sim/rendering/shaders/skydome", switch_calc, 0, 0);
    var ls3 = setlistener("/sim/rendering/shaders/landmass", switch_calc, 0, 0);
    timer_beacon_upper_on.start();
    timer_beacon_lower_on.start();
    headlight_func();
    var ls4 = setlistener("fdm/jsbsim/systems/lighting/lightsrc_noauto/landing", headlight_func, 0, 0);
    var ls5 = setlistener("fdm/jsbsim/systems/lighting/lightsrc_noauto/taxi", headlight_func, 0, 0);
  });
