<?xml version="1.0" standalone="no"?>
<!DOCTYPE svg PUBLIC "-//W3C//DTD SVG 20010904//EN"
 "http://www.w3.org/TR/2001/REC-SVG-20010904/DTD/svg10.dtd">
<svg version="1.0" xmlns="http://www.w3.org/2000/svg"
 width="120.000000pt" height="120.000000pt" viewBox="0 0 120.000000 120.000000"
 preserveAspectRatio="xMidYMid meet">
<metadata>
Created by potrace 1.15, written by Peter Selinger 2001-2017
</metadata>
<g transform="translate(0.000000,120.000000) scale(0.100000,-0.100000)"
fill="#000000" stroke="none">
<path d="M537 1139 c-101 -61 -263 -96 -404 -85 -45 3 -89 9 -99 13 -16 6 -17
-2 -11 -113 21 -405 218 -757 509 -909 51 -27 60 -28 89 -18 68 26 146 81 230
163 198 194 297 435 325 793 l7 88 -44 -8 c-24 -4 -94 -7 -155 -7 -129 2 -220
24 -322 80 -34 19 -66 34 -70 33 -4 0 -28 -14 -55 -30z m126 -120 c82 -38 228
-69 330 -69 89 0 84 9 63 -120 -48 -297 -199 -548 -401 -669 l-57 -35 -45 24
c-61 32 -184 149 -239 226 -85 118 -160 316 -179 469 -3 28 -8 62 -11 76 l-5
26 108 5 c116 6 238 34 313 72 25 13 48 24 51 25 4 0 36 -13 72 -30z"/>
<path d="M543 973 c-73 -33 -196 -63 -289 -70 l-81 -6 14 -76 c50 -276 189
-504 378 -621 l34 -21 43 29 c197 136 329 367 372 650 l6 42 -44 0 c-76 0
-218 30 -302 63 l-80 33 -51 -23z m103 -59 c58 -25 171 -53 243 -60 l63 -7 -5
-37 c-3 -27 -17 -48 -53 -83 -43 -41 -54 -47 -94 -47 -43 0 -50 -4 -110 -65
-63 -64 -64 -65 -45 -85 l19 -21 60 60 c59 57 63 60 119 63 31 2 57 1 57 -1 0
-2 -18 -39 -39 -82 -47 -93 -112 -180 -178 -239 -78 -69 -84 -70 -147 -21 -89
69 -180 192 -230 312 l-15 36 57 -5 c52 -4 62 -9 115 -58 62 -57 77 -63 97
-38 11 13 4 24 -51 80 -60 60 -66 64 -109 64 -40 0 -51 5 -85 40 -21 22 -44
40 -51 40 -10 0 -24 42 -24 75 0 8 23 15 64 19 74 7 208 41 245 61 34 19 51
18 97 -1z"/>
</g>
</svg>
