{

  "_links": {
    "self": {
      "href": "/api/v2/tasks",
      "method": "post"
    }
  },
  "_embedded": {
    "items": [
      {
        "id": 346257,
        "_links": {
          "self": {
            "href": "/api/v2/tasks?id=346257",
            "method": "get"
          }
        }
      }
    ]
  }

}