{

  "_links": {
    "self": {
      "href": "/api/v2/leads",
      "method": "post"
    }
  },
  "_embedded": {
    "items": [
      {
        "id": 1712943,
        "updated_at": 1572369660,
        "_links": {
          "self": {
            "href": "/api/v2/leads?id=1712943",
            "method": "get"
          }
        }
      }
    ]
  }

}