{
  "_links": {
    "self": {
      "href": "/api/v2/customers?limit_rows=500&limit_offset=0&entity=customers",
      "method": "get"
    }
  },
  "_embedded": {
    "items": [
      {
        "id": 141043,
        "name": "ампи",
        "created_by": 3621055,
        "created_at": 1571901386,
        "updated_at": 1571901386,
        "account_id": 28664698,
        "status_id": 3622429,
        "updated_by": 3621055,
        "is_deleted": false,
        "main_contact": {},
        "tags": {},
        "custom_fields": {},
        "responsible_user_id": 3621055,
        "next_price": 0,
        "closest_task_at": 0,
        "periodicity": 0,
        "period_id": 3622429,
        "next_date": 0,
        "ltv": 0,
        "purchases_count": 0,
        "average_check": 0,
        "contacts": {},
        "company": {},
        "_links": {
          "self": {
            "href": "/api/v2/customers?id=141043",
            "method": "get"
          }
        }
      },
      {
        "id": 141041,
        "name": "свмап",
        "created_by": 3621055,
        "created_at": 1571901376,
        "updated_at": 1571901376,
        "account_id": 28664698,
        "status_id": 3622429,
        "updated_by": 3621055,
        "is_deleted": false,
        "main_contact": {},
        "tags": {},
        "custom_fields": {},
        "responsible_user_id": 3621055,
        "next_price": 0,
        "closest_task_at": 0,
        "periodicity": 0,
        "period_id": 3622429,
        "next_date": 0,
        "ltv": 0,
        "purchases_count": 0,
        "average_check": 0,
        "contacts": {},
        "company": {},
        "_links": {
          "self": {
            "href": "/api/v2/customers?id=141041",
            "method": "get"
          }
        }
      }
    ]
  }
}