{
  "_links": {
    "self": {
      "href": "/api/v2/notes?type=lead",
      "method": "get"
    }
  },
  "_embedded": {
    "items": [
      {
        "id": 3555663,
        "responsible_user_id": 3621055,
        "created_by": 3621055,
        "created_at": 1571317654,
        "updated_at": 1571317654,
        "account_id": 28664698,
        "group_id": 0,
        "is_editable": false,
        "element_id": 515493,
        "element_type": 2,
        "attachment": null,
        "note_type": 1,
        "text": "Добавлен новый объект",
        "_links": {
          "self": {
            "href": "/api/v2/notes?id=3555663&type=lead",
            "method": "get"
          }
        }
      },
      {
        "id": 3999601,
        "responsible_user_id": 3621055,
        "created_by": 3621055,
        "created_at": 1571418124,
        "updated_at": 1571418123,
        "account_id": 28664698,
        "group_id": 0,
        "is_editable": false,
        "element_id": 574685,
        "element_type": 2,
        "attachment": null,
        "note_type": 1,
        "text": "Добавлен новый объект",
        "_links": {
          "self": {
            "href": "/api/v2/notes?id=3999601&type=lead",
            "method": "get"
          }
        }
      }
    ]
  }
}