{
  "_links": {
    "self": {
      "href": "/api/v2/companies?limit_rows=500&limit_offset=0&entity=companies",
      "method": "get"
    }
  },
  "_embedded": {
    "items": [
      {
        "id": 2128105,
        "name": "df",
        "responsible_user_id": 3621055,
        "created_by": 3621055,
        "created_at": 1571399842,
        "updated_at": 1571404492,
        "account_id": 28664698,
        "updated_by": 3621055,
        "group_id": 0,
        "leads": {},
        "closest_task_at": 0,
        "tags": {},
        "custom_fields": {},
        "contacts": {
          "id": [
            2149341,
            2149347,
            2288777
          ],
          "_links": {
            "self": {
              "href": "/api/v2/contacts?id=2149341,2149347,2288777",
              "method": "get"
            }
          }
        },
        "customers": {},
        "_links": {
          "self": {
            "href": "/api/v2/companies?id=2128105",
            "method": "get"
          }
        }
      },
      {
        "id": 2286000,
        "name": "COM",
        "responsible_user_id": 3621055,
        "created_by": 3621055,
        "created_at": 1571493109,
        "updated_at": 1571493109,
        "account_id": 28664698,
        "updated_by": 3621055,
        "group_id": 0,
        "leads": {
          "id": [
            575853
          ],
          "_links": {
            "self": {
              "href": "/api/v2/leads?id=575853",
              "method": "get"
            }
          }
        },
        "closest_task_at": 0,
        "tags": {},
        "custom_fields": [
          {
            "id": 88015,
            "name": "Адрес",
            "code": "ADDRESS",
            "values": [
              {
                "value": "987654321"
              }
            ],
            "is_system": true
          }
        ],
        "contacts": {
          "id": [
            2286002,
            2286204
          ],
          "_links": {
            "self": {
              "href": "/api/v2/contacts?id=2286002,2286204",
              "method": "get"
            }
          }
        },
        "customers": {},
        "_links": {
          "self": {
            "href": "/api/v2/companies?id=2286000",
            "method": "get"
          }
        }
      },
      {
        "id": 2545177,
        "name": "aquabox",
        "responsible_user_id": 3621055,
        "created_by": 3621055,
        "created_at": 1571651722,
        "updated_at": 1571655520,
        "account_id": 28664698,
        "updated_by": 3621055,
        "group_id": 0,
        "leads": {
          "id": [
            600989,
            600997
          ],
          "_links": {
            "self": {
              "href": "/api/v2/leads?id=600989,600997",
              "method": "get"
            }
          }
        },
        "closest_task_at": 0,
        "tags": {},
        "custom_fields": [
          {
            "id": 88009,
            "name": "Телефон",
            "code": "PHONE",
            "values": [
              {
                "value": "987",
                "enum": 132325
              },
              {
                "value": "999",
                "enum": 132331
              }
            ],
            "is_system": true
          },
          {
            "id": 88011,
            "name": "Email",
            "code": "EMAIL",
            "values": [
              {
                "value": "testa@",
                "enum": 132337
              },
              {
                "value": "testa2@d",
                "enum": 132339
              }
            ],
            "is_system": true
          },
          {
            "id": 88015,
            "name": "Адрес",
            "code": "ADDRESS",
            "values": [
              {
                "value": "987 <|> 999"
              }
            ],
            "is_system": true
          }
        ],
        "contacts": {
          "id": [
            2300595,
            2563689
          ],
          "_links": {
            "self": {
              "href": "/api/v2/contacts?id=2300595,2563689",
              "method": "get"
            }
          }
        },
        "customers": {},
        "_links": {
          "self": {
            "href": "/api/v2/companies?id=2545177",
            "method": "get"
          }
        }
      }
    ]
  }
}