(footprint "ESP32-WROOM-DA" (version 20211014) (generator pcbnew)
  (layer "F.Cu")
  (tedit 626BC01F)
  (descr "ESP32-WROOM-32E and ESP32-WROOM-32UE: https://www.espressif.com/sites/default/files/documentation/esp32-wroom-32e_esp32-wroom-32ue_datasheet_en.pdf")
  (tags "ESP32")
  (property "Sheetfile" "Barduino4.0.kicad_sch")
  (property "Sheetname" "")
  (attr smd)
  (fp_text reference "U1" (at 0 -15.8) (layer "F.SilkS")
    (effects (font (size 1 1) (thickness 0.15)))
    (tstamp 17356853-924b-48db-9c77-d76122b22f55)
  )
  (fp_text value "ESP32-WROOM-DA" (at 0 13.4) (layer "F.Fab")
    (effects (font (size 1 1) (thickness 0.15)))
    (tstamp 633ce999-ba38-44a1-855d-e81a4d0a30e5)
  )
  (fp_text user "Antenna Area" (at 0 -11.5) (layer "F.SilkS")
    (effects (font (size 1 1) (thickness 0.15)))
    (tstamp 1fc2e105-32e8-46b2-8212-5f7f4b1673d1)
  )
  (fp_text user "Antenna Area" (at 0 -11.5) (layer "Eco2.User")
    (effects (font (size 1 1) (thickness 0.15)))
    (tstamp 10537525-ece5-4765-b7c3-d2b00a4321d0)
  )
  (fp_text user "REF**" (at 0 0) (layer "F.Fab")
    (effects (font (size 1 1) (thickness 0.15)))
    (tstamp 81cc0426-61e3-4759-a043-125b128fbb12)
  )
  (fp_line (start -9.053882 -7.729597) (end -9.053882 10.970403) (layer "F.SilkS") (width 0.2) (tstamp 030f4c5e-96cd-4d89-b77c-2a56cc824b4d))
  (fp_line (start -9.054173 -7.746668) (end -9.053882 -7.729597) (layer "F.SilkS") (width 0.2) (tstamp 0aa3a5d3-f151-4783-b7c4-178f39baae3d))
  (fp_line (start 9.34439 -8.219139) (end 9.361163 -8.222327) (layer "F.SilkS") (width 0.2) (tstamp 0d01249e-adc1-4135-ab21-c001448e2718))
  (fp_line (start -9.118052 -7.974652) (end -9.109939 -7.95963) (layer "F.SilkS") (width 0.2) (tstamp 0e6a7f35-4c0c-4b26-8e63-c21e5b0cbbd6))
  (fp_line (start -9.265542 -8.138082) (end -9.251764 -8.128) (layer "F.SilkS") (width 0.2) (tstamp 1216cc42-22fe-4da1-98d3-ba4b123d47e9))
  (fp_line (start 9.157778 -8.138082) (end 9.171892 -8.147688) (layer "F.SilkS") (width 0.2) (tstamp 13da1453-fbe8-4b5d-bf46-eb521d885b8c))
  (fp_line (start 8.956576 -7.831325) (end 8.960334 -7.847979) (layer "F.SilkS") (width 0.2) (tstamp 17a434de-92a3-40f2-8b3f-1014eba67a6c))
  (fp_line (start -9.072423 -7.864495) (end -9.068098 -7.847979) (layer "F.SilkS") (width 0.2) (tstamp 1972de23-9a00-4c93-925c-7be4cf056043))
  (fp_line (start 8.946118 -7.729597) (end 8.946409 -7.746668) (layer "F.SilkS") (width 0.2) (tstamp 19944ab4-0810-4c50-8b80-75305ca77602))
  (fp_line (start -9.4355 -8.215381) (end -9.418984 -8.211056) (layer "F.SilkS") (width 0.2) (tstamp 1b032fe7-595e-47b8-9525-b31301c151e8))
  (fp_line (start -9.22528 -8.106454) (end -9.212605 -8.095015) (layer "F.SilkS") (width 0.2) (tstamp 1c081302-925f-4eca-bb9c-e093eb792ba7))
  (fp_line (start 13.546118 -8.229597) (end 17.746118 -12.429597) (layer "F.SilkS") (width 0.2) (tstamp 1d847b75-9f7f-4113-a308-b79c030b5bb3))
  (fp_line (start -9.06434 -7.831325) (end -9.061152 -7.814552) (layer "F.SilkS") (width 0.2) (tstamp 1dad9e6c-2b23-4660-b115-f687349d913b))
  (fp_line (start -9.166026 -8.045141) (end -9.155479 -8.031715) (layer "F.SilkS") (width 0.2) (tstamp 1ebec6d9-ad62-41da-8794-08501e0ae0f6))
  (fp_line (start -9.354681 -8.188203) (end -9.33914 -8.181134) (layer "F.SilkS") (width 0.2) (tstamp 1f747722-86a5-4607-829f-83642de65055))
  (fp_line (start 9.278678 -8.200727) (end 9.294861 -8.206169) (layer "F.SilkS") (width 0.2) (tstamp 22c4d372-1529-451d-84ec-f3d54d373001))
  (fp_line (start 8.946118 10.970403) (end 8.946118 -7.729597) (layer "F.SilkS") (width 0.2) (tstamp 2408f4a2-d1a8-4ff3-a3f7-39b2a51f47ff))
  (fp_line (start -9.402625 -8.206169) (end -9.386442 -8.200727) (layer "F.SilkS") (width 0.2) (tstamp 2620f7e9-8367-427e-8b47-8d0f18783017))
  (fp_line (start 8.994581 -7.944339) (end 9.002175 -7.95963) (layer "F.SilkS") (width 0.2) (tstamp 27ec3fec-5680-42ea-b004-174da515c006))
  (fp_line (start -9.251764 -8.128) (end -9.238338 -8.117453) (layer "F.SilkS") (width 0.2) (tstamp 2e465097-f04d-4c52-a473-39d9917a512f))
  (fp_line (start -9.135791 -8.003823) (end -9.126672 -7.989389) (layer "F.SilkS") (width 0.2) (tstamp 2e66f5eb-a5ed-42f0-9e62-c326988835d5))
  (fp_line (start -9.238338 -8.117453) (end -9.22528 -8.106454) (layer "F.SilkS") (width 0.2) (tstamp 2f8046e6-ca02-4654-8fc6-d1bdf5eab2ae))
  (fp_line (start 8.987512 -7.928798) (end 8.994581 -7.944339) (layer "F.SilkS") (width 0.2) (tstamp 300824bd-edb2-4c9f-b7e4-97992ec16c51))
  (fp_line (start -13.653882 -8.229597) (end -9.553882 -8.229597) (layer "F.SilkS") (width 0.2) (tstamp 32539d66-4761-4a99-bd9e-61834c887e7d))
  (fp_line (start -9 10.25) (end -9 11) (layer "F.SilkS") (width 0.12) (tstamp 348ae7f3-fd71-4b6a-8a11-ef62d7e34b72))
  (fp_line (start -0.053882 -23.429597) (end -6.853882 -23.429597) (layer "F.SilkS") (width 0.2) (tstamp 35707209-90d5-43df-9f47-cd3876624eff))
  (fp_line (start 9 10.25) (end 9 11) (layer "F.SilkS") (width 0.12) (tstamp 3570789e-976d-4855-833c-804b54e44065))
  (fp_line (start 9.069261 -8.058199) (end 9.0807 -8.070874) (layer "F.SilkS") (width 0.2) (tstamp 3726e725-40ae-43fb-9ced-e56b45884fda))
  (fp_line (start 9.262691 -8.194736) (end 9.278678 -8.200727) (layer "F.SilkS") (width 0.2) (tstamp 3d94dbe0-f0b8-48df-9b44-ee99494515f8))
  (fp_line (start -9.29409 -8.156807) (end -9.279656 -8.147688) (layer "F.SilkS") (width 0.2) (tstamp 40224bd8-e95d-4eaa-ad6c-b23c9d1ec5d9))
  (fp_line (start 9.028027 -8.003823) (end 9.037633 -8.017937) (layer "F.SilkS") (width 0.2) (tstamp 4120ac91-61b8-4af2-9901-e7ea4d5594a0))
  (fp_line (start -9.519761 -8.228431) (end -9.50275 -8.226976) (layer "F.SilkS") (width 0.2) (tstamp 44d1369b-ff30-433b-b1f9-04202baff19e))
  (fp_line (start 6.746118 -23.429597) (end -0.053882 -23.429597) (layer "F.SilkS") (width 0.2) (tstamp 4617656f-9df1-49a6-a941-121681c3ff42))
  (fp_line (start 9.018908 -7.989389) (end 9.028027 -8.003823) (layer "F.SilkS") (width 0.2) (tstamp 46c26d6c-3bb4-493b-8f80-be6cc27486f1))
  (fp_line (start 9.130574 -8.117453) (end 9.144 -8.128) (layer "F.SilkS") (width 0.2) (tstamp 4f28a17f-dc6a-46eb-8911-6bb8a4c37782))
  (fp_line (start 8.969546 -7.880854) (end 8.974988 -7.897037) (layer "F.SilkS") (width 0.2) (tstamp 4f6234e2-da81-4cd2-9936-e66cb86ced90))
  (fp_line (start -9.058539 -7.79768) (end -9.056503 -7.780729) (layer "F.SilkS") (width 0.2) (tstamp 4fc89bbf-91ad-4dde-bee7-78bfa7cb5a8d))
  (fp_line (start 9.047715 -8.031715) (end 9.058262 -8.045141) (layer "F.SilkS") (width 0.2) (tstamp 521a39ba-c9fe-4a47-a1c6-9e54b8372969))
  (fp_line (start -9.061152 -7.814552) (end -9.058539 -7.79768) (layer "F.SilkS") (width 0.2) (tstamp 5489ed45-1388-44ac-84d9-f17a73d22e08))
  (fp_line (start -9.095276 -7.928798) (end -9.088743 -7.913024) (layer "F.SilkS") (width 0.2) (tstamp 5bbeff7b-0733-4940-9563-792cf1c060d3))
  (fp_line (start 9.429047 -8.229306) (end 9.446118 -8.229597) (layer "F.SilkS") (width 0.2) (tstamp 5d5dfa23-b15f-40fc-852c-cb28ee4b44f5))
  (fp_line (start -9.200329 -8.08315) (end -9.188464 -8.070874) (layer "F.SilkS") (width 0.2) (tstamp 606220fc-a5cf-464b-9413-75be631a46ef))
  (fp_line (start -9.155479 -8.031715) (end -9.145397 -8.017937) (layer "F.SilkS") (width 0.2) (tstamp 642699f9-fdc0-4057-99ae-2ba87c3540fe))
  (fp_line (start -9.308827 -8.165427) (end -9.29409 -8.156807) (layer "F.SilkS") (width 0.2) (tstamp 653e8cde-d449-467c-a09d-a0e305d2f60a))
  (fp_line (start 9.246917 -8.188203) (end 9.262691 -8.194736) (layer "F.SilkS") (width 0.2) (tstamp 6a860258-0fd5-4f0b-a59b-f5237dbdd64d))
  (fp_line (start -9.485799 -8.22494) (end -9.468927 -8.222327) (layer "F.SilkS") (width 0.2) (tstamp 6b43ebf0-6048-43bf-af4d-eaedd77f00d7))
  (fp_line (start 9.117516 -8.106454) (end 9.130574 -8.117453) (layer "F.SilkS") (width 0.2) (tstamp 72041312-e756-4773-b2ed-dd56706f29b3))
  (fp_line (start 8.950775 -7.79768) (end 8.953388 -7.814552) (layer "F.SilkS") (width 0.2) (tstamp 723fc93f-2639-429e-b053-b4d615893263))
  (fp_line (start -9.323849 -8.17354) (end -9.308827 -8.165427) (layer "F.SilkS") (width 0.2) (tstamp 78cfe085-5603-4ea2-b027-b65c3f2de70a))
  (fp_line (start -9.088743 -7.913024) (end -9.082752 -7.897037) (layer "F.SilkS") (width 0.2) (tstamp 796f88b1-8896-4914-9f1b-48ae194458ec))
  (fp_line (start -9.145397 -8.017937) (end -9.135791 -8.003823) (layer "F.SilkS") (width 0.2) (tstamp 7bf1b6c2-41c9-46a9-8c85-2324c7238b5b))
  (fp_line (start -9.102345 -7.944339) (end -9.095276 -7.928798) (layer "F.SilkS") (width 0.2) (tstamp 7c91d386-449e-4252-8a30-6c267eefbe43))
  (fp_line (start -17.853882 -12.429597) (end -13.653882 -8.229597) (layer "F.SilkS") (width 0.2) (tstamp 8625fd93-2f3d-42d1-9c11-dca35211b0d2))
  (fp_line (start -9.370455 -8.194736) (end -9.354681 -8.188203) (layer "F.SilkS") (width 0.2) (tstamp 877c3792-7777-4a07-a93e-68a8e6292f40))
  (fp_line (start -9.536811 -8.229306) (end -9.519761 -8.228431) (layer "F.SilkS") (width 0.2) (tstamp 87c463f2-808c-41e6-95e1-59762b09ae40))
  (fp_line (start -6.853882 -23.429597) (end -17.853882 -12.429597) (layer "F.SilkS") (width 0.2) (tstamp 898021d0-a95d-428e-af42-b41d159f0145))
  (fp_line (start -9.279656 -8.147688) (end -9.265542 -8.138082) (layer "F.SilkS") (width 0.2) (tstamp 8a04dd42-e18c-4c81-855c-d656a3c3e0f4))
  (fp_line (start -9.553882 -8.229597) (end -9.536811 -8.229306) (layer "F.SilkS") (width 0.2) (tstamp 8a8db1f4-6677-4e00-8a07-892cfaa6504e))
  (fp_line (start 9.231376 -8.181134) (end 9.246917 -8.188203) (layer "F.SilkS") (width 0.2) (tstamp 8aacb5ea-c390-4bad-8d5e-5eb90888648d))
  (fp_line (start 9.201063 -8.165427) (end 9.216085 -8.17354) (layer "F.SilkS") (width 0.2) (tstamp 8c0ff8ed-a4cc-484c-8f4e-7e20abe45549))
  (fp_line (start -9.386442 -8.200727) (end -9.370455 -8.194736) (layer "F.SilkS") (width 0.2) (tstamp 9208fdff-3417-4b04-bde1-30c63d17c88d))
  (fp_line (start -9.212605 -8.095015) (end -9.200329 -8.08315) (layer "F.SilkS") (width 0.2) (tstamp 991bae65-284b-4791-bfed-40b14e65b667))
  (fp_line (start -9.07731 -7.880854) (end -9.072423 -7.864495) (layer "F.SilkS") (width 0.2) (tstamp 9bc4cf35-f0a6-43d5-a93b-3abd70afc919))
  (fp_line (start -9.50275 -8.226976) (end -9.485799 -8.22494) (layer "F.SilkS") (width 0.2) (tstamp 9fef5965-b7aa-4b4d-a159-8090be74543e))
  (fp_line (start 9.144 -8.128) (end 9.157778 -8.138082) (layer "F.SilkS") (width 0.2) (tstamp a1dc84fc-699e-4b55-b22b-7d8c39287f0e))
  (fp_line (start -9.055048 -7.763718) (end -9.054173 -7.746668) (layer "F.SilkS") (width 0.2) (tstamp a33f8a62-8d66-4063-a069-eaebf0091c43))
  (fp_line (start -9.468927 -8.222327) (end -9.452154 -8.219139) (layer "F.SilkS") (width 0.2) (tstamp a44cb5b3-3476-4901-ba2a-c4ec44d3bb27))
  (fp_line (start -9.068098 -7.847979) (end -9.06434 -7.831325) (layer "F.SilkS") (width 0.2) (tstamp a45ddad3-3d00-4d1a-93ee-11302dd0f1e2))
  (fp_line (start -9.418984 -8.211056) (end -9.402625 -8.206169) (layer "F.SilkS") (width 0.2) (tstamp a89659ba-55ba-4453-9411-44f16a31e368))
  (fp_line (start 9.058262 -8.045141) (end 9.069261 -8.058199) (layer "F.SilkS") (width 0.2) (tstamp b48e3e74-9ab0-4bab-90ce-1e052c0e1751))
  (fp_line (start 9.378035 -8.22494) (end 9.394986 -8.226976) (layer "F.SilkS") (width 0.2) (tstamp b5f5ca0f-ba6c-4f87-91bf-2c62b2f72ad8))
  (fp_line (start 9.0807 -8.070874) (end 9.092565 -8.08315) (layer "F.SilkS") (width 0.2) (tstamp b612a9bb-8ef9-4ac7-bdef-154fb5696f26))
  (fp_line (start 8.960334 -7.847979) (end 8.964659 -7.864495) (layer "F.SilkS") (width 0.2) (tstamp b86e954c-15bb-4764-841c-aee2a6e33c4d))
  (fp_line (start 8.964659 -7.864495) (end 8.969546 -7.880854) (layer "F.SilkS") (width 0.2) (tstamp ba1e3240-d96a-471a-9c36-2e26ced040eb))
  (fp_line (start 8.980979 -7.913024) (end 8.987512 -7.928798) (layer "F.SilkS") (width 0.2) (tstamp bbbb8997-498b-477e-84b6-dae5d05b687d))
  (fp_line (start 9.394986 -8.226976) (end 9.411997 -8.228431) (layer "F.SilkS") (width 0.2) (tstamp bde93177-3cb8-4c67-a07c-8836a8eb3090))
  (fp_line (start 9.216085 -8.17354) (end 9.231376 -8.181134) (layer "F.SilkS") (width 0.2) (tstamp c14d6737-9f34-437b-af11-bbd559ee90a2))
  (fp_line (start -9.188464 -8.070874) (end -9.177025 -8.058199) (layer "F.SilkS") (width 0.2) (tstamp c30ded11-9476-4b0c-95d5-7f69d6497500))
  (fp_line (start 8.947284 -7.763718) (end 8.948739 -7.780729) (layer "F.SilkS") (width 0.2) (tstamp d2314c6c-f244-4e4c-83e8-d9fea1fd7dda))
  (fp_line (start 9.294861 -8.206169) (end 9.31122 -8.211056) (layer "F.SilkS") (width 0.2) (tstamp d399a752-bf2a-4e62-bc4b-991e9fa67a79))
  (fp_line (start -9.109939 -7.95963) (end -9.102345 -7.944339) (layer "F.SilkS") (width 0.2) (tstamp d3d9a187-fff2-40bb-b407-91244bd345f8))
  (fp_line (start 9.31122 -8.211056) (end 9.327736 -8.215381) (layer "F.SilkS") (width 0.2) (tstamp d48c7373-3667-477b-8c55-89cb2c2aa0d2))
  (fp_line (start 9.361163 -8.222327) (end 9.378035 -8.22494) (layer "F.SilkS") (width 0.2) (tstamp d4cfd8ba-adab-43bc-bfb1-72789e6b3419))
  (fp_line (start 8.953388 -7.814552) (end 8.956576 -7.831325) (layer "F.SilkS") (width 0.2) (tstamp d89f07f7-cb60-4c46-b2d9-39d5f69f885a))
  (fp_line (start 9.327736 -8.215381) (end 9.34439 -8.219139) (layer "F.SilkS") (width 0.2) (tstamp d8c06567-d698-48a0-ade9-c979d94b9089))
  (fp_line (start -9.056503 -7.780729) (end -9.055048 -7.763718) (layer "F.SilkS") (width 0.2) (tstamp d9fa476f-5469-4706-b70c-8880ced4067d))
  (fp_line (start -9.126672 -7.989389) (end -9.118052 -7.974652) (layer "F.SilkS") (width 0.2) (tstamp db6031c3-98c9-4643-969f-968b28dc7297))
  (fp_line (start -9.177025 -8.058199) (end -9.166026 -8.045141) (layer "F.SilkS") (width 0.2) (tstamp dd09a00b-b4d9-4b1c-8e88-ef48e22b94f6))
  (fp_line (start 9.010288 -7.974652) (end 9.018908 -7.989389) (layer "F.SilkS") (width 0.2) (tstamp e07683ac-db8e-4ff1-a3ed-be8512c751b2))
  (fp_line (start 9.037633 -8.017937) (end 9.047715 -8.031715) (layer "F.SilkS") (width 0.2) (tstamp e2e8f519-9bfa-4fc8-8f77-b2ed20e6b9a6))
  (fp_line (start -9.082752 -7.897037) (end -9.07731 -7.880854) (layer "F.SilkS") (width 0.2) (tstamp e4909948-9cd0-4d5c-bf0c-71bf9e7c4eec))
  (fp_line (start 9.411997 -8.228431) (end 9.429047 -8.229306) (layer "F.SilkS") (width 0.2) (tstamp e60a709e-de59-4540-bcac-bce77d0673dc))
  (fp_line (start 8.946409 -7.746668) (end 8.947284 -7.763718) (layer "F.SilkS") (width 0.2) (tstamp e6756ca1-c84b-49d5-8af7-562f2beb1c07))
  (fp_line (start 9.171892 -8.147688) (end 9.186326 -8.156807) (layer "F.SilkS") (width 0.2) (tstamp e913c330-9d36-4c4b-93be-090a73c08599))
  (fp_line (start 17.746118 -12.429597) (end 6.746118 -23.429597) (layer "F.SilkS") (width 0.2) (tstamp ead10d7d-c198-4936-99c4-2c620253daf3))
  (fp_line (start 9.446118 -8.229597) (end 13.546118 -8.229597) (layer "F.SilkS") (width 0.2) (tstamp eaf1d61c-66a8-4050-8ffc-42b920a69483))
  (fp_line (start 8.974988 -7.897037) (end 8.980979 -7.913024) (layer "F.SilkS") (width 0.2) (tstamp ec3c6935-77fb-4ed4-8dec-8c40cf941db9))
  (fp_line (start 9.186326 -8.156807) (end 9.201063 -8.165427) (layer "F.SilkS") (width 0.2) (tstamp ee22dd23-4002-42af-aebb-66b81afa5b37))
  (fp_line (start 8.948739 -7.780729) (end 8.950775 -7.79768) (layer "F.SilkS") (width 0.2) (tstamp eec78b43-eda0-453d-90f6-9253bf1407ca))
  (fp_line (start -9.33914 -8.181134) (end -9.323849 -8.17354) (layer "F.SilkS") (width 0.2) (tstamp ef298677-76c1-4834-94e3-1fa7a4f93eba))
  (fp_line (start -9.452154 -8.219139) (end -9.4355 -8.215381) (layer "F.SilkS") (width 0.2) (tstamp f45631ea-d456-45d5-b399-a6ffe569052d))
  (fp_line (start 9.002175 -7.95963) (end 9.010288 -7.974652) (layer "F.SilkS") (width 0.2) (tstamp f525b0a7-f78a-4871-9335-661d683138b1))
  (fp_line (start 9.104841 -8.095015) (end 9.117516 -8.106454) (layer "F.SilkS") (width 0.2) (tstamp f83cc351-d745-4e70-a853-6e817224f1c3))
  (fp_line (start 9.092565 -8.08315) (end 9.104841 -8.095015) (layer "F.SilkS") (width 0.2) (tstamp fafc48f6-4aad-4c67-a3ee-83c810182f2f))
  (fp_line (start -9.053882 10.970403) (end 8.946118 10.970403) (layer "F.SilkS") (width 0.2) (tstamp fcfaadac-4d53-416f-8f25-07af598e4a00))
  (pad "1" smd rect (at -9.25 -7.01) (size 2 0.8) (layers "F.Cu" "F.Paste" "F.Mask") (tstamp f8f0e56b-25f6-45cf-89b7-7764ba84c8e4))
  (pad "2" smd rect (at -9.25 -5.74) (size 2 0.8) (layers "F.Cu" "F.Paste" "F.Mask") (tstamp 540c5112-0664-47ec-a297-bcd4bd8637db))
  (pad "3" smd rect (at -9.25 -4.47) (size 2 0.8) (layers "F.Cu" "F.Paste" "F.Mask") (tstamp 5c73e386-a18e-4c86-b24e-d70ac80048ac))
  (pad "4" smd rect (at -9.25 -3.2) (size 2 0.8) (layers "F.Cu" "F.Paste" "F.Mask") (tstamp 64e743c8-d881-401d-a97f-409873c2fd57))
  (pad "5" smd rect (at -9.25 -1.93) (size 2 0.8) (layers "F.Cu" "F.Paste" "F.Mask") (tstamp 56fc45c5-87b5-47a4-a8c8-114389e75bdd))
  (pad "6" smd rect (at -9.25 -0.66) (size 2 0.8) (layers "F.Cu" "F.Paste" "F.Mask") (tstamp 66e656bb-9dcb-4923-9421-56b5bd495130))
  (pad "7" smd rect (at -9.25 0.61) (size 2 0.8) (layers "F.Cu" "F.Paste" "F.Mask") (tstamp bf68c9e7-5a73-4488-afed-f6e94897e387))
  (pad "8" smd rect (at -9.25 1.88) (size 2 0.8) (layers "F.Cu" "F.Paste" "F.Mask") (tstamp 762f5f15-d785-405d-91f2-692a59c35e5d))
  (pad "9" smd rect (at -9.25 3.15) (size 2 0.8) (layers "F.Cu" "F.Paste" "F.Mask") (tstamp c4f543a3-c014-451a-952c-9f5dbfa301f5))
  (pad "10" smd rect (at -9.25 4.42) (size 2 0.8) (layers "F.Cu" "F.Paste" "F.Mask") (tstamp 3794e0ef-2e18-4958-907a-d75de1715d08))
  (pad "11" smd rect (at -9.25 5.69) (size 2 0.8) (layers "F.Cu" "F.Paste" "F.Mask") (tstamp 2d9a5620-c633-46a7-88b4-03b1d22914d5))
  (pad "12" smd rect (at -9.25 6.96) (size 2 0.8) (layers "F.Cu" "F.Paste" "F.Mask") (tstamp 5a918dce-f5e8-477e-aa1f-ffe3d4ed257a))
  (pad "13" smd rect (at -9.25 8.23) (size 2 0.8) (layers "F.Cu" "F.Paste" "F.Mask") (tstamp 5cb07085-2755-42f4-876f-7ea10a47846c))
  (pad "14" smd rect (at -9.25 9.5) (size 2 0.8) (layers "F.Cu" "F.Paste" "F.Mask") (tstamp b31a70a9-95f1-42e6-91dc-6e956a8f3962))
  (pad "15" smd rect (at -6.99 11.25 90) (size 2 0.8) (layers "F.Cu" "F.Paste" "F.Mask") (tstamp 8560feb6-a863-474e-a1a9-26ce997434b7))
  (pad "16" smd rect (at -5.72 11.25 90) (size 2 0.8) (layers "F.Cu" "F.Paste" "F.Mask") (tstamp f192042d-950f-434b-80e9-249b5fbee1d9))
  (pad "17" smd rect (at -4.45 11.25 90) (size 2 0.8) (layers "F.Cu" "F.Paste" "F.Mask") (tstamp 3ef3b2dc-1754-4748-8aa8-25bf04655c39))
  (pad "18" smd rect (at -3.18 11.25 90) (size 2 0.8) (layers "F.Cu" "F.Paste" "F.Mask") (tstamp 661ae8c2-aa64-4613-85aa-eb1fdfc159c9))
  (pad "19" smd rect (at -1.91 11.25 90) (size 2 0.8) (layers "F.Cu" "F.Paste" "F.Mask") (tstamp b2be7f53-121f-4ae1-b042-ae3a6d4f445c))
  (pad "20" smd rect (at -0.64 11.25 90) (size 2 0.8) (layers "F.Cu" "F.Paste" "F.Mask") (tstamp 1f5bbc69-0c1c-440f-a4a7-388a50c13482))
  (pad "21" smd rect (at 0.63 11.25 90) (size 2 0.8) (layers "F.Cu" "F.Paste" "F.Mask") (tstamp 21a477dd-3d69-4aea-9512-429594c2f074))
  (pad "22" smd rect (at 1.9 11.25 90) (size 2 0.8) (layers "F.Cu" "F.Paste" "F.Mask") (tstamp c518a3d7-d712-43e7-96aa-98e74c8905d3))
  (pad "23" smd rect (at 3.17 11.25 90) (size 2 0.8) (layers "F.Cu" "F.Paste" "F.Mask") (tstamp 8c8adc43-84a4-41b6-9aff-2f254828769d))
  (pad "24" smd rect (at 4.44 11.25 90) (size 2 0.8) (layers "F.Cu" "F.Paste" "F.Mask") (tstamp 6ab12b12-d4f3-4523-ba6e-c5a85c537c61))
  (pad "25" smd rect (at 5.71 11.25 90) (size 2 0.8) (layers "F.Cu" "F.Paste" "F.Mask") (tstamp 8d9b6b59-4efd-4d46-8cda-88c05fe3b4be))
  (pad "26" smd rect (at 6.99 11.25 90) (size 2 0.8) (layers "F.Cu" "F.Paste" "F.Mask") (tstamp 10c5a7fd-f66f-46fd-88b3-4d1411125e09))
  (pad "27" smd rect (at 9.25 9.5 180) (size 2 0.8) (layers "F.Cu" "F.Paste" "F.Mask") (tstamp cc3b270f-e64f-4e88-af7c-c132f834e9c5))
  (pad "28" smd rect (at 9.25 8.23 180) (size 2 0.8) (layers "F.Cu" "F.Paste" "F.Mask") (tstamp 0c814652-020a-4656-8acc-5dee0541efb1))
  (pad "29" smd rect (at 9.25 6.96 180) (size 2 0.8) (layers "F.Cu" "F.Paste" "F.Mask") (tstamp 0a48296f-bf77-45b2-95ef-8a8d0935757e))
  (pad "30" smd rect (at 9.25 5.69 180) (size 2 0.8) (layers "F.Cu" "F.Paste" "F.Mask") (tstamp e88f43d0-a58e-4ad5-83ec-7e104c26101c))
  (pad "31" smd rect (at 9.25 4.42 180) (size 2 0.8) (layers "F.Cu" "F.Paste" "F.Mask") (tstamp 404e459a-08fb-4f6a-ad4b-6bfea03e5e2f))
  (pad "32" smd rect (at 9.25 3.15 180) (size 2 0.8) (layers "F.Cu" "F.Paste" "F.Mask") (tstamp b9a9ad18-4f2f-410c-87bb-c367dcb7fe21))
  (pad "33" smd rect (at 9.25 1.88 180) (size 2 0.8) (layers "F.Cu" "F.Paste" "F.Mask") (tstamp 5652772f-f962-4252-a31b-053621dce648))
  (pad "34" smd rect (at 9.25 0.61 180) (size 2 0.8) (layers "F.Cu" "F.Paste" "F.Mask") (tstamp 020513af-0e7e-4fde-9ab2-93ce24d42a06))
  (pad "35" smd rect (at 9.25 -0.66 180) (size 2 0.8) (layers "F.Cu" "F.Paste" "F.Mask") (tstamp 2d5b974e-9621-40dc-aaeb-a558ba06dde7))
  (pad "36" smd rect (at 9.25 -1.93 180) (size 2 0.8) (layers "F.Cu" "F.Paste" "F.Mask") (tstamp ef1b8fce-0fb9-46af-8209-67faaaa5861d))
  (pad "37" smd rect (at 9.25 -3.2 180) (size 2 0.8) (layers "F.Cu" "F.Paste" "F.Mask") (tstamp ad33d64b-2ea6-4e7e-8a0c-859bed11f63a))
  (pad "38" smd rect (at 9.25 -4.47 180) (size 2 0.8) (layers "F.Cu" "F.Paste" "F.Mask") (tstamp 6c142213-3a79-45a9-b76b-75bbede207d5))
  (pad "39" smd rect (at 9.25 -5.74 180) (size 2 0.8) (layers "F.Cu" "F.Paste" "F.Mask") (tstamp 4cdcbc47-a728-486b-94a5-579b44391a5c))
  (pad "40" smd rect (at 9.25 -7.01 180) (size 2 0.8) (layers "F.Cu" "F.Paste" "F.Mask") (tstamp f7b60ec1-9ed6-4d0b-8209-89d2a8fa1258))
  (pad "43" smd rect (at 0.845 0.33 180) (size 1.05 1.05) (layers "F.Cu" "F.Paste" "F.Mask") (tstamp 0f713bcc-f4ea-4361-a4a3-aba9955a1ade))
  (pad "43" smd rect (at -2.205 1.855 180) (size 1.05 1.05) (layers "F.Cu" "F.Paste" "F.Mask") (tstamp 2f38ed85-c2eb-42c1-938d-7afa26356cd9))
  (pad "43" smd rect (at -0.68 -1.195 180) (size 1.05 1.05) (layers "F.Cu" "F.Paste" "F.Mask") (tstamp 78a397d7-8920-4505-9c82-79857c575230))
  (pad "43" smd rect (at 0.845 1.855 180) (size 1.05 1.05) (layers "F.Cu" "F.Paste" "F.Mask") (tstamp 7be77ce8-3b9e-41fb-9972-e7590db59b3a))
  (pad "43" smd rect (at -0.68 0.33 180) (size 1.05 1.05) (layers "F.Cu" "F.Paste" "F.Mask") (tstamp b3d26285-af53-489a-a3f5-484f4c07971b))
  (pad "43" smd rect (at -2.205 -1.195 180) (size 1.05 1.05) (layers "F.Cu" "F.Paste" "F.Mask") (tstamp cd93c9ad-8b10-4420-b299-b224c8e4f529))
  (pad "43" smd rect (at -0.68 1.855 180) (size 1.05 1.05) (layers "F.Cu" "F.Paste" "F.Mask") (tstamp e18e2f58-9235-4f41-aeed-baeb18c225ab))
  (pad "43" smd rect (at 0.845 -1.195 180) (size 1.05 1.05) (layers "F.Cu" "F.Paste" "F.Mask") (tstamp f06b4161-4aa9-4ad1-b88e-3bc31cd95a58))
  (pad "43" smd rect (at -2.205 0.33 180) (size 1.05 1.05) (layers "F.Cu" "F.Paste" "F.Mask") (tstamp fa29abe1-c6c6-430f-92f1-6fac7d8b4afb))
  (group "Outline" (id e9155f6b-5bcc-43be-8a65-180e93da3250)
    (members
      030f4c5e-96cd-4d89-b77c-2a56cc824b4d
      0aa3a5d3-f151-4783-b7c4-178f39baae3d
      0d01249e-adc1-4135-ab21-c001448e2718
      0e6a7f35-4c0c-4b26-8e63-c21e5b0cbbd6
      1216cc42-22fe-4da1-98d3-ba4b123d47e9
      13da1453-fbe8-4b5d-bf46-eb521d885b8c
      17a434de-92a3-40f2-8b3f-1014eba67a6c
      1972de23-9a00-4c93-925c-7be4cf056043
      19944ab4-0810-4c50-8b80-75305ca77602
      1b032fe7-595e-47b8-9525-b31301c151e8
      1c081302-925f-4eca-bb9c-e093eb792ba7
      1d847b75-9f7f-4113-a308-b79c030b5bb3
      1dad9e6c-2b23-4660-b115-f687349d913b
      1ebec6d9-ad62-41da-8794-08501e0ae0f6
      1f747722-86a5-4607-829f-83642de65055
      22c4d372-1529-451d-84ec-f3d54d373001
      2408f4a2-d1a8-4ff3-a3f7-39b2a51f47ff
      2620f7e9-8367-427e-8b47-8d0f18783017
      27ec3fec-5680-42ea-b004-174da515c006
      2e465097-f04d-4c52-a473-39d9917a512f
      2e66f5eb-a5ed-42f0-9e62-c326988835d5
      2f8046e6-ca02-4654-8fc6-d1bdf5eab2ae
      300824bd-edb2-4c9f-b7e4-97992ec16c51
      32539d66-4761-4a99-bd9e-61834c887e7d
      35707209-90d5-43df-9f47-cd3876624eff
      3726e725-40ae-43fb-9ced-e56b45884fda
      3d94dbe0-f0b8-48df-9b44-ee99494515f8
      40224bd8-e95d-4eaa-ad6c-b23c9d1ec5d9
      4120ac91-61b8-4af2-9901-e7ea4d5594a0
      44d1369b-ff30-433b-b1f9-04202baff19e
      4617656f-9df1-49a6-a941-121681c3ff42
      46c26d6c-3bb4-493b-8f80-be6cc27486f1
      4f28a17f-dc6a-46eb-8911-6bb8a4c37782
      4f6234e2-da81-4cd2-9936-e66cb86ced90
      4fc89bbf-91ad-4dde-bee7-78bfa7cb5a8d
      521a39ba-c9fe-4a47-a1c6-9e54b8372969
      5489ed45-1388-44ac-84d9-f17a73d22e08
      5bbeff7b-0733-4940-9563-792cf1c060d3
      5d5dfa23-b15f-40fc-852c-cb28ee4b44f5
      606220fc-a5cf-464b-9413-75be631a46ef
      642699f9-fdc0-4057-99ae-2ba87c3540fe
      653e8cde-d449-467c-a09d-a0e305d2f60a
      6a860258-0fd5-4f0b-a59b-f5237dbdd64d
      6b43ebf0-6048-43bf-af4d-eaedd77f00d7
      72041312-e756-4773-b2ed-dd56706f29b3
      723fc93f-2639-429e-b053-b4d615893263
      78cfe085-5603-4ea2-b027-b65c3f2de70a
      796f88b1-8896-4914-9f1b-48ae194458ec
      7bf1b6c2-41c9-46a9-8c85-2324c7238b5b
      7c91d386-449e-4252-8a30-6c267eefbe43
      8625fd93-2f3d-42d1-9c11-dca35211b0d2
      877c3792-7777-4a07-a93e-68a8e6292f40
      87c463f2-808c-41e6-95e1-59762b09ae40
      898021d0-a95d-428e-af42-b41d159f0145
      8a04dd42-e18c-4c81-855c-d656a3c3e0f4
      8a8db1f4-6677-4e00-8a07-892cfaa6504e
      8aacb5ea-c390-4bad-8d5e-5eb90888648d
      8c0ff8ed-a4cc-484c-8f4e-7e20abe45549
      9208fdff-3417-4b04-bde1-30c63d17c88d
      991bae65-284b-4791-bfed-40b14e65b667
      9bc4cf35-f0a6-43d5-a93b-3abd70afc919
      9fef5965-b7aa-4b4d-a159-8090be74543e
      a1dc84fc-699e-4b55-b22b-7d8c39287f0e
      a33f8a62-8d66-4063-a069-eaebf0091c43
      a44cb5b3-3476-4901-ba2a-c4ec44d3bb27
      a45ddad3-3d00-4d1a-93ee-11302dd0f1e2
      a89659ba-55ba-4453-9411-44f16a31e368
      b48e3e74-9ab0-4bab-90ce-1e052c0e1751
      b5f5ca0f-ba6c-4f87-91bf-2c62b2f72ad8
      b612a9bb-8ef9-4ac7-bdef-154fb5696f26
      b86e954c-15bb-4764-841c-aee2a6e33c4d
      ba1e3240-d96a-471a-9c36-2e26ced040eb
      bbbb8997-498b-477e-84b6-dae5d05b687d
      bde93177-3cb8-4c67-a07c-8836a8eb3090
      c14d6737-9f34-437b-af11-bbd559ee90a2
      c30ded11-9476-4b0c-95d5-7f69d6497500
      d2314c6c-f244-4e4c-83e8-d9fea1fd7dda
      d399a752-bf2a-4e62-bc4b-991e9fa67a79
      d3d9a187-fff2-40bb-b407-91244bd345f8
      d48c7373-3667-477b-8c55-89cb2c2aa0d2
      d4cfd8ba-adab-43bc-bfb1-72789e6b3419
      d89f07f7-cb60-4c46-b2d9-39d5f69f885a
      d8c06567-d698-48a0-ade9-c979d94b9089
      d9fa476f-5469-4706-b70c-8880ced4067d
      db6031c3-98c9-4643-969f-968b28dc7297
      dd09a00b-b4d9-4b1c-8e88-ef48e22b94f6
      e07683ac-db8e-4ff1-a3ed-be8512c751b2
      e2e8f519-9bfa-4fc8-8f77-b2ed20e6b9a6
      e4909948-9cd0-4d5c-bf0c-71bf9e7c4eec
      e60a709e-de59-4540-bcac-bce77d0673dc
      e6756ca1-c84b-49d5-8af7-562f2beb1c07
      e913c330-9d36-4c4b-93be-090a73c08599
      ead10d7d-c198-4936-99c4-2c620253daf3
      eaf1d61c-66a8-4050-8ffc-42b920a69483
      ec3c6935-77fb-4ed4-8dec-8c40cf941db9
      ee22dd23-4002-42af-aebb-66b81afa5b37
      eec78b43-eda0-453d-90f6-9253bf1407ca
      ef298677-76c1-4834-94e3-1fa7a4f93eba
      f45631ea-d456-45d5-b399-a6ffe569052d
      f525b0a7-f78a-4871-9335-661d683138b1
      f83cc351-d745-4e70-a853-6e817224f1c3
      fafc48f6-4aad-4c67-a3ee-83c810182f2f
      fcfaadac-4d53-416f-8f25-07af598e4a00
    )
  )
  (model "${ESPRESSIF_3DMODELS}/ESP32-WROOM-32E.STEP"
    (offset (xyz -9.01 -9.6 0))
    (scale (xyz 1 1 1))
    (rotate (xyz 0 0 0))
  )
)
