<?xml version="1.0" encoding="UTF-8"?>
<svg width="21px" height="16px" viewBox="0 0 21 16" version="1.1" xmlns="http://www.w3.org/2000/svg" xmlns:xlink="http://www.w3.org/1999/xlink">
    <!-- Generator: Sketch 46.1 (44463) - http://www.bohemiancoding.com/sketch -->
    <title>Page 1</title>
    <desc>Created with Sketch.</desc>
    <defs></defs>
    <g id="Mockups-" stroke="none" stroke-width="1" fill="none" fill-rule="evenodd">
        <g id="04---Help-Center---V2---Search-results@2x" transform="translate(-501.000000, -1434.000000)" fill="#0D7AC7">
            <g id="Group-5-Copy" transform="translate(0.000000, 1130.000000)">
                <g id="Group-40" transform="translate(281.000000, 76.000000)">
                    <g id="Group-17" transform="translate(0.000000, 105.000000)">
                        <g id="Group-12-Copy" transform="translate(0.000000, 101.000000)">
                            <g id="Group-39" transform="translate(220.000000, 17.000000)">
                                <path d="M19.6875,5 L1.3125,5 C0.957029588,5 0.649415287,5.131944 0.389648438,5.39583467 C0.129881509,5.65972267 0,5.97222133 0,6.33333333 L0,8.58333333 L10.5,12.8333333 L21,8.58333333 L21,6.33333333 C21,5.97222133 20.8701176,5.65972267 20.6103503,5.39583467 C20.3505855,5.131944 20.0429696,5 19.6875,5 L19.6875,5 Z M0,10.75 L0,19.6666667 C0,20.0277795 0.129881509,20.3402765 0.389648438,20.6041667 C0.649415287,20.8680569 0.957029588,21 1.3125,21 L19.6875,21 C20.0429696,21 20.3505855,20.8680569 20.6103503,20.6041667 C20.8701176,20.3402765 21,20.0277795 21,19.6666667 L21,10.75 L10.5,15 L0,10.75 Z" id="Page-1"></path>
                            </g>
                        </g>
                    </g>
                </g>
            </g>
        </g>
    </g>
</svg>