<?xml version="1.0" encoding="UTF-8"?>
<svg width="98px" height="24px" viewBox="0 0 98 24" version="1.1" xmlns="http://www.w3.org/2000/svg" xmlns:xlink="http://www.w3.org/1999/xlink">
    <!-- Generator: Sketch 48.2 (47327) - http://www.bohemiancoding.com/sketch -->
    <title>eyeo</title>
    <desc>Created with Sketch.</desc>
    <defs></defs>
    <g id="Page-1" stroke="none" stroke-width="1" fill="none" fill-rule="evenodd">
        <g id="eyeo" fill="#FFFFFF" fill-rule="nonzero">
            <path d="M36.1276437,10.683907 C36.3149138,9.14539535 37.4926034,7.8987907 39.446408,7.8987907 C41.2664483,7.8987907 42.4441379,9.19869767 42.4976437,10.683907 L36.1276437,10.683907 Z M39.5001954,5.64418605 C35.7795747,5.64418605 33.3439368,8.58837209 33.3439368,12.0365581 C33.3439368,15.5377674 35.7795747,18.4554419 39.5266667,18.4554419 C41.5877644,18.4554419 43.2202529,17.7125581 44.1036609,16.9434419 C44.4784828,16.6253023 44.3711897,16.3864186 44.1571667,16.1213023 L43.4345575,15.0072558 C43.2202529,14.6888372 42.979477,14.7686512 42.7119483,14.9542326 C41.9625862,15.4847442 41.105931,15.9887442 39.6874655,15.9887442 C37.5193563,15.9887442 36.0203506,14.2911628 35.9935977,12.6466047 L44.5319885,12.6466047 C44.7995172,12.6466047 45.0673276,12.4342326 45.0940805,12.116093 C45.1208333,11.904 45.1475862,11.4795349 45.1475862,11.2674419 C45.1475862,8.00483721 42.7119483,5.64418605 39.5001954,5.64418605 Z" id="Shape"></path>
            <path d="M64.1252299,10.683907 C64.3127816,9.14539535 65.4904713,7.8987907 67.4442759,7.8987907 C69.2643161,7.8987907 70.4420057,9.19869767 70.4955115,10.683907 L64.1252299,10.683907 Z M67.4977816,5.64418605 C63.7774425,5.64418605 61.3418046,8.58837209 61.3418046,12.0365581 C61.3418046,15.5377674 63.7774425,18.4554419 67.5245345,18.4554419 C69.5856322,18.4554419 71.2181207,17.7125581 72.1015287,16.9434419 C72.476069,16.6253023 72.3690575,16.3864186 72.1550345,16.1213023 L71.4324253,15.0072558 C71.2181207,14.6888372 70.9773448,14.7686512 70.7098161,14.9542326 C69.9601724,15.4847442 69.1037989,15.9887442 67.6853333,15.9887442 C65.5172241,15.9887442 64.0182184,14.2911628 63.9914655,12.6466047 L72.5298563,12.6466047 C72.7973851,12.6466047 73.0649138,12.4342326 73.0919483,12.116093 C73.1184195,11.904 73.145454,11.4795349 73.145454,11.2674419 C73.145454,8.00483721 70.7098161,5.64418605 67.4977816,5.64418605 Z" id="Shape"></path>
            <path d="M91.702092,15.9357209 C89.6142414,15.9357209 88.0085057,14.2646512 88.0085057,12.0100465 C88.0085057,9.80846512 89.6142414,8.16390698 91.702092,8.16390698 C93.762908,8.16390698 95.3689253,9.80846512 95.3689253,12.0100465 C95.3689253,14.2646512 93.762908,15.9357209 91.702092,15.9357209 Z M91.702092,5.64418605 C88.2225287,5.64418605 85.3853161,8.56186047 85.3853161,12.0100465 C85.3853161,15.5112558 88.2225287,18.4554419 91.702092,18.4554419 C95.1549023,18.4554419 97.9918333,15.5112558 97.9918333,12.0100465 C97.9918333,8.56186047 95.1549023,5.64418605 91.702092,5.64418605 Z" id="Shape"></path>
            <path d="M82,6 C81.4350584,6 81.2767073,6.12996319 81,6 L76,19 C75.9719462,18.8700368 75.9873047,19 76,19 C76.5952881,19 76.7208038,18.9068456 77,19 L82,6 C82.0411882,6.12996319 81.956187,6 82,6" id="Shape"></path>
            <path d="M57.0371264,5.58139535 C56.7431264,5.58139535 56.5029138,5.6344186 56.3961839,5.92548837 L52.9242241,14.3154419 L52.8707184,14.3154419 L50.0132299,5.92548837 C49.9329713,5.71367442 49.6657241,5.58139535 49.4787356,5.58139535 L47.7161437,5.58139535 C47.2354368,5.58139535 47.021977,5.952 47.1822126,6.37534884 L51.4285977,17.3852093 L48.9929598,23.1806512 C48.7795,23.6034419 49.0729368,24 49.5263276,24 L51.2334425,24 C51.4733736,24 51.6333276,23.8149767 51.7400575,23.6299535 L59.2269195,6.37534884 C59.413908,5.952 59.2001667,5.58139535 58.6927069,5.58139535 L57.0371264,5.58139535 Z" id="Shape"></path>
            <path d="M12.059069,16.4715349 C6.14978161,16.4715349 1.3596092,14.491814 1.3596092,12.0496744 C1.3596092,9.60753488 6.14978161,7.62781395 12.059069,7.62781395 C17.9680747,7.62781395 22.7585287,9.60753488 22.7585287,12.0496744 C22.7585287,14.491814 17.9680747,16.4715349 12.059069,16.4715349 Z M12.059069,0.0993488372 C5.39901149,0.0993488372 0,5.44967442 0,12.0496744 C0,18.6496744 5.39901149,24 12.059069,24 C18.7191264,24 24.1181379,18.6496744 24.1181379,12.0496744 C24.1181379,5.44967442 18.7191264,0.0993488372 12.059069,0.0993488372 Z" id="Shape"></path>
            <path d="M8.75917241,10.2767442 L8.15427586,10.2767442 C8.08922414,10.2767442 8.03064943,10.3236279 8.03064943,10.375814 L8.03064943,13.8312558 C8.03064943,13.8837209 8.08922414,13.9306047 8.15427586,13.9306047 L8.75917241,13.9306047 C8.82450575,13.9306047 8.88279885,13.8837209 8.88279885,13.8312558 L8.88279885,10.375814 C8.88279885,10.3236279 8.82450575,10.2767442 8.75917241,10.2767442" id="Shape"></path>
            <path d="M15.6585977,10.2767442 C14.6346667,10.2767442 13.8202529,11.0938605 13.8202529,12.1085581 C13.8202529,13.1235349 14.6346667,13.9306047 15.6585977,13.9306047 C16.683092,13.9306047 17.5022931,13.1235349 17.5022931,12.1085581 C17.5022931,11.0938605 16.683092,10.2767442 15.6585977,10.2767442" id="Shape"></path>
        </g>
    </g>
</svg>