[
  {
    "id": "D72B6F06-52B2-4FED-96A2-1BF59CDD7AEC",
    "type": "privacy",
    "title": "EasyPrivacy",
    "homepage": "https://easylist.to/",
    "url": "https://easylist-downloads.adblockplus.org/v3/full/easyprivacy.txt",
    "mv2_url": "https://easylist-downloads.adblockplus.org/easyprivacy.txt",
    "diff_url": "https://easylist-downloads.adblockplus.org/v3/diff/easyprivacy/467f70e830ddfe205f59cc6e9f8a66c1781b7d62.json",
    "expires": "1 days (update frequency)"
  },
  {
    "id": "0798B6A2-94A4-4ADF-89ED-BEC112FC4C7F",
    "type": "ads",
    "title": "Crumbs Privacy Friendly List",
    "homepage": "https://crumbs.org/",
    "url": "https://filterlist.crumbs.org/crumbs-privacy-friendly.txt",
    "mv2_url": "https://filterlist.crumbs.org/crumbs-privacy-friendly.txt",
    "expires": "1 days"
  },
  {
    "id": "2090F374-29D9-4202-B2CE-139D6492D95E",
    "type": "cookies",
    "title": "EasyList Cookie List",
    "homepage": "https://easylist.to/",
    "url": "https://fanboy.co.nz/fanboy-cookiemonster.txt",
    "mv2_url": "https://fanboy.co.nz/fanboy-cookiemonster.txt",
    "expires": "9 days (update frequency)"
  }
]