{
  "name": {
    "message": "Crumbs"
  },
  "name_devbuild": {
    "description": "Extension name to be shown for development builds. Note: this cannot be longer than 45 characters.",
    "message": "Crumbs development build"
  },
  "name_releasebuild": {
    "description": "Extension name to be shown for release builds. Note: this cannot be longer than 45 characters.",
    "message": "Crumbs - Keep your data safe & block cookies"
  },
  "description": {
    "message": "Crumbs protects your privacy and ensures no one can profile you as an individual. Crumbs Email Relay keeps your email address safe."
  }
}
