<svg xmlns="http://www.w3.org/2000/svg" viewBox="0 0 2162 500">
  <path
    d="M254.61,75.52c74.47,0,136.52,36.66,170.36,99.84l-73.89,50.21c-24.26-40.62-56.41-60.93-97-60.93-59.23,0-101.54,41.75-101.54,104.36,0,31,9.59,55.85,28.21,75,19.18,18.61,43.43,28.2,73.33,28.2,40.62,0,72.77-20.3,97-60.92L425,361.52c-33.84,63.18-95.89,99.84-170.92,99.84C144.61,463.05,51,376.18,53.23,268.44,51.54,161.82,144.05,73.26,254.61,75.52Z"/>
  <path
    d="M661.89,258.29H638.76c-44.57,0-67.13,20.3-67.13,67.69V454.59h-97v-282h88.57v29.9c17.49-22,42.31-34.41,71.08-34.41a86.1,86.1,0,0,1,27.64,4.51Z"/>
  <path
    d="M700.81,172.54h97V331.05c0,24.26,16.92,41.18,41.18,41.18,23.13,0,40.62-16.92,40.62-41.18V172.54h97V323.16c0,82.92-58.1,138.2-137.64,138.2s-138.2-55.28-138.2-138.2Z"/>
  <path
    d="M1486.59,454.59h-97V295c0-26.51-15.79-41.74-40-41.74-23.13,0-38.92,15.23-38.92,41.74V454.59h-97V295c0-26.51-15.79-41.74-40-41.74-23.13,0-38.92,15.23-38.92,41.74V454.59h-97v-282h88.57v22c20.31-19.18,46.25-28.77,77.28-28.77,35,0,62,11.85,81.79,36.11,22.57-22.57,55.85-36.11,92.52-36.11,67.12,0,108.87,45.13,108.87,115.08Z"/>
  <path
    d="M1716.73,461.36c-36.1,0-63.18-11.84-80.67-36.1v29.33H1547.5V31.52h97v160.2c18.61-17.49,42.3-25.95,72.2-25.95,77.85,0,135.39,62.62,135.39,148.36S1795.71,461.36,1716.73,461.36Zm-19.18-207.59c-29.9,0-54.72,22-54.72,60.36s24.82,59.23,54.72,59.23c31,0,55.28-22,55.28-59.79S1727.45,253.77,1697.55,253.77Z"/>
  <path
    d="M1920.93,349.67c24.26,23.13,50.21,35,77.85,35,16.36,0,24.82-3.94,24.82-12.41,0-6.2-4.51-9-16.36-14.1l-31.59-13c-55.85-22.57-81.79-46.26-81.79-90.82,0-55.85,43.43-88.57,109.43-88.57,44.56,0,79.54,13.54,106.05,41.18l-45.69,59.23c-19.18-16.36-38.92-24.25-59.8-24.25-13,0-19.74,3.38-19.74,10.71,0,6.21,5.64,10.16,19.18,15.24l28.21,11.28c56.41,22.56,82.35,44,82.35,88.56,0,28.77-10.71,51.9-32.71,68.82-22,16.36-49.64,24.82-84,24.82-50.21,0-94.77-19.74-121.29-54.15Z"/>
  <circle fill="currentColor" cx="255.15" cy="267.3" r="61.21"/>
</svg>