{
  "bundleName": "Manipulácia parametrov",
  "bundleDescription": "Vedenie parameter je zodpovedný pri spustení aplikácie na prevod parametrov z URL na príslušnej komponenty.",
  "menu": {
    "title": "Link nástroj"
  },
  "widget": {
    "description": "Konfigurácia nástroja Link.",
    "showLink": {
      "title": "Ukázať odkaz",
      "tooltip": "Zobrazí textové pole, ktoré obsahuje parametrizované odkaz na aktuálne zobrazenie mapy."
    },
    "showHTMLSnippet": {
      "title": "Show kód, ktorý môže byť vložený do HTML stránky.",
      "tooltip": "Show kód, ktorý môže byť vložený do HTML stránky."
    },
    "showMailToButton": {
      "title": "Show E-Mail tlačidlo",
      "tooltip": "Ukazuje tlačidlo napísať e-mail obsahujúci odkaz na aktuálne zobrazenie mapy."
    },
    "showRefreshButton": {
      "title": "Zobraziť tlačidlo Aktualizovať",
      "tooltip": "Ukazuje tlačidlo aktualizujte odkazy v dialógovom okne."
    },
    "showQRCode": {
      "title": "Zobraziť QR kód",
      "tooltip": "Ukazuje QR kód obrazu."
    }
  }
}