{
  "bundleName": "Localização configuração de pesquisa",
  "bundleDescription": "Pacote de configuração para o pacote de localização Pesquisa.",
  "menu": {
    "title": "Esri CH Location Finder"
  },
  "widget": {
    "description": "Configuração para o tópico de pesquisa Esri Localização Finder.",
    "enabled": "Pesquisa tópico ativo",
    "enabledTooltip": "Ativa que o tópico de pesquisa para usá-lo na busca Omni.",
    "defaultLabel": "Espaço reservado",
    "defaultLabelTooltip": "Define o texto padrão do campo de entrada de busca (o valor é opcional).",
    "pageSize": "Resultados máximos",
    "pageSizeTooltip": "O número máximo de visitas nos resultados (intervalo: 0-100; 0 é ilimitado).",
    "typingdelay": "Atraso [ms]",
    "typingdelayTooltip": "Pausa entre teclas pressionadas antes da consulta é enviada (faixa 0-1000 milissegundos)",
    "url": "URL do serviço",
    "urlTooltip": "URL do terminal REST serviço de pesquisa."
  },
  "stores": {
    "locationFinder": {
      "placeHolder": "Localização, morada, POI ..."
    }
  }
}