{
  "bundleName": "Przegląd Mapa Konfiguracja",
  "bundleDescription": "Pakiet konfiguracyjny mapie przeglądowej.",
  "menu": {
    "title": "Przegląd map"
  },
  "widget": {
    "description": "Wybierz usługę za mapie przeglądowej. Można również zdefiniować warstwę, jeśli więcej niż jeden jest dostępny.",
    "hint": "Nowe usługi mogą być dodawane w menu \"Usługi zarządzania\".",
    "service": "Mapa serwisu",
    "layers": "Warstwa",
    "transparency": "Przejrzystość prostokąta",
    "color": "Kolor prostokąta",
    "allLayers": "Wszystkie dostępne",
    "expandFactor": "Rozszerzenie / współczynnik powiększenia",
    "errorMessage": "Wybierz co najmniej jedną warstwę!"
  }
}