{
    "bundleName": "ec-wms-layer-selector",
    "bundleDescription": "ec-wms-layer-selector",
    "ui": {
        "windowTitle": "Seleccionar capas",
        "hint": "El servicio WMS elegido contiene ${countToProvideSelection} capas; seleccione todas las que desea visualizar en el mapa.",
        "selectAll": "Seleccionar todo",
        "closeButton":"Ok"
    },
    "tool": {
        "title": "Capas",
        "tooltip": "Capas"
    }
}