{
  "bundleName": "Udskrivning konfiguration",
  "bundleDescription": "Denne pakke konfigurerer udskrivning funktionalitet.",
  "menu": {
    "title": "Print"
  },
  "widget": {
    "description": "Konfiguration til trykning værktøj.",
    "printservletURL": {
      "title": "Print Servlet URL",
      "tooltip": "URL til print Servlet"
    },
    "downloadResponseWithoutShowing": {
      "title": "Direkte link til mappen uden at vise",
      "tooltip": "Den genererede trykning Resultatet kan vises i et vindue, eller direkte kan downloades"
    },
    "format": {
      "title": "Format",
      "tooltip": "Formatet af den genererede print resultat"
    },
    "title": {
      "title": "Titel",
      "tooltip": "En titel til trykning resultatet"
    }
  }
}