{
  "bundleName": "Mätning Verktygskonfiguration",
  "bundleDescription": "Konfigurations bunt för mätverktyget bunt.",
  "menu": {
    "title": "Mätverktyg"
  },
  "widget": {
    "description": "Konfiguration av mätverktyg.",
    "finishWithButton": {
      "title": "Sluta mäta genom att klicka på knappen",
      "tooltip": "Om aktiverad, är en knapp för efterbehandling ritning visas. Annars dubbelklicka avslutar ritningen."
    },
    "showTools": {
      "area": "Visa området mätverktyg",
      "distance": "Visa avståndsmätning verktyg",
      "location": "Visa plats mätverktyg"
    },
    "defaultTool": {
      "title": "Standard aktiverat verktyg",
      "none": "Inget",
      "area": "Område",
      "distance": "Avstånd",
      "location": "Position"
    },
    "defaultAreaUnit": {
      "title": "Standard ytenhet",
      "ACRES": "Acres",
      "SQUARE_MILES": "Kvadrat miles",
      "SQUARE_KILOMETERS": "Kvadratkilometer",
      "HECTARES": "Hektar",
      "SQUARE_YARDS": "Kvadratyard",
      "SQUARE_FEET": "Kvadratfot",
      "SQUARE_METERS": "Kvadratmeter"
    },
    "defaultLengthUnit": {
      "title": "Standard längdenhet",
      "MILES": "Miles",
      "KILOMETERS": "Kilometer",
      "FEET": "Fot",
      "METERS": "Meter",
      "YARDS": "Yard",
      "NAUTICAL_MILES": "Nautisk miles"
    },
    "defaultLocationUnit": {
      "title": "Standardenhet koordinater",
      "DECIMAL_DEGREES": "Grader",
      "DEGREE_MINUTE_SECONDS": "DMS"
    }
  }
}