{
  "bundleName": "Konzola",
  "bundleDescription": "Konzola pomaga upravljati in spremljati nameščen snop. Prav tako navaja, storitve, sestavne dele in dnevniških zapisov.",
  "ui": {
    "windowTitle": "Konzola",
    "bundleTab": "Paketi",
    "bundlesStoreFields": {
      "id": "ID",
      "name": "Ime",
      "description": "Opis",
      "state": "Status",
      "autostartPolicy": "Zagon Policy",
      "symbolicName": "Simbolično ime",
      "version": "Različica",
      "startLevel": "Začetek Raven",
      "vendor": "Ponudnik",
      "location": "Lokacija"
    },
    "servicesTab": "Storitve",
    "servicesStoreFields": {
      "id": "ID",
      "provides": "Vmesniki",
      "bundle": "Snop",
      "component": "Komponenta",
      "properties": "Nepremičnine"
    },
    "componentsTab": "Komponente",
    "componentsStoreFields": {
      "id": "ID",
      "name": "Ime",
      "state": "Status",
      "properties": "Nepremičnine",
      "instances": "Primere",
      "log": "Dnevnik",
      "bundleName": "Snop"
    },
    "messagesTab": "Sporočila",
    "messagesStoreFields": {
      "level": "Raven",
      "time": "Čas",
      "message": "Kratek opis",
      "announcement": "Sporočilo"
    },
    "tools": {
      "bundles": {
        "start": {
          "title": "Začetek Paketi",
          "tooltip": "Začnite Izbrani Svežnji"
        },
        "stop": {
          "title": "Zaustavitev Paketi",
          "tooltip": "Stop Izbrani Svežnji"
        }
      },
      "components": {
        "configure": {
          "title": "Konfiguracijo komponente",
          "tooltip": "Konfigurirati izbrane komponente"
        }
      }
    },
    "dataView": {
      "pager": {
        "backButtonTooltip": "Nazaj",
        "forwardButtonTooltip": "Naprej",
        "firstButtonTooltip": "Prva stran",
        "lastButtonTooltip": "Zadnja stran",
        "pageLabelText": "Stran ${currentPage} od ${endPage}",
        "zeroResultsText": "",
        "pageSizeLabelText": "${pageStartItemNumber} - ${pageEndItemNumber} za ${itemCount}"
      },
      "filter": {
        "menuDefaultLabel": "Vsi",
        "textBoxPlaceHolder": "Iskati ..."
      },
      "DGRID": {
        "noDataMessage": "Ni podatkov.",
        "loadingMessage": "Nalagam podatke ..."
      }
    },
    "dataFormNotInstalled": "DataForm snop ni nameščen. Če želite omogočiti funkcijo konfiguracija komponenta dodajte DataForm snop na vaš app.json datoteko."
  }
}