{
  "bundleName": "Térkép",
  "bundleDescription": "A térkép bundle kezeli a fő térkép és az összes térképet tartalomra vonatkoznak. Az ügyfél absztrakt igénybe vett szolgáltatások egy hierarchikus Térkép modellt, így ezek is megjelenik különböző módokon, hogy a felhasználó.",
  "ui": {
    "nodeUpdateError": {
      "info": "Frissítés a szolgáltatás \"${title} 'nem sikerült! Hiba: ${errorMsg}",
      "detail": "Frissítés a szolgáltatás \"${title} 'nem sikerült! Hiba: ${url} ${errorMsg} - Részlet: ${error}"
    },
    "sliderLabels": {
      "country": "Ország",
      "region": "Vidék",
      "town": "Város"
    }
  },
  "drawTooltips": {
    "addPoint": "Kattintson a térképen",
    "addMultipoint": "Kattintson kezdeni",
    "finishLabel": "Befejez"
  }
}