{
  "bundleName": "Omni-iskanje",
  "bundleDescription": "Ta paket zagotavlja iskalni vmesnik za eno ali več iskalnih temah.",
  "ui": {
    "tooltips": {
      "reset": "Odstrani rezultat",
      "magnifier": "Povečava za posledico",
      "submit": "Predloži poizvedbo",
      "settings": "Izberite temo iskanje"
    },
    "settings": "Nastavitve",
    "settingsWidget": {
      "title": "Razpoložljivi teme iskanje"
    },
    "error": "Napaka pri opravljanju iskanje!"
  },
  "tool": {
    "title": "Iskanje",
    "tooltip": "Odpri okno Iskanje"
  }
}