{
  "bundleName": "Cumraíocht ródú",
  "bundleDescription": "Bundle Cumraíocht don bundle ródú",
  "menu": {
    "title": "Ródú"
  },
  "routing": {
    "menuTitle": "Ghiuirléid ródú",
    "description": "Cumraíocht an bundle ródú.",
    "configSections": {
      "basic": "Cumraíocht Bunúsach",
      "stops": "Stadanna chumraíocht",
      "traffic": "Cumraíocht Tráchta"
    },
    "routeTaskUrl": {
      "title": "URL don tasc bealach",
      "tooltip": "Sonraigh an tseirbhís a úsáidfear chun treoracha a ríomh. Úsáideann an ghiuirléid Treoracha an Anailís Líonra Domhanda mar a úsáidtear an tseirbhís réamhshocraithe treoracha tiomána a ríomh. Is seirbhís síntiús bunaithe ar fáil trí ArcGIS Online. Má tá tú seirbhís Anailís Líonra ArcGIS Server gur mhaith leat a úsáid chun a ríomh treoracha sonrófar na url leis an tseirbhís sin."
    },
    "directionsLengthUnits": {
      "title": "Aonaid Fad",
      "tooltip": "Aonaid Fad. Tá réamhshocraithe ciliméadar.",
      "units": {
        "esriMillimeters": "mm",
        "esriCentimeters": "cm",
        "esriDecimeters": "dm",
        "esriMeters": "m",
        "esriKilometers": "km",
        "esriFeet": "ft",
        "esriInches": "i",
        "esriMiles": "mi",
        "esriNauticalMiles": "nm",
        "esriUnknownUnits": "anaithnid"
      }
    },
    "dragging": {
      "title": "Ceadaigh tarraingt ar Stadanna",
      "tooltip": "Cumasaigh an dragging suímh stad ar an léarscáil. Nuair is féidir stadanna fíor a dragged chuig suíomh nua agus beidh an bealach a athríomh. Is é an luach réamhshocraithe fíor."
    },
    "showPrintPage": {
      "title": "Taispeáin cnaipe bealach cló",
      "tooltip": "Roghnaigh a phriontáil taispeáint cnaipe treoracha routing."
    },
    "showMilesKilometersOption": {
      "title": "Taispeáin míle-ciliméadar scoránaigh",
      "tooltip": "Nuair a sheiceáil, an grúpa cnaipe scoránaigh ligean úsáideoir a roghnú idir Miles agus Ciliméadar léirithe"
    },
    "showTravelModesOption": {
      "title": "Taispeáin 'nascleanúint a roghnú modh' a",
      "tooltip": "Nuair a sheiceáil, tá an grúpa cnaipe scoránaigh ligean úsáideoir a roghnú modhanna taistil a thaispeántar"
    },
    "showClearButton": {
      "title": "seó 'athshocrú ródú \" cnaipe",
      "tooltip": "Roghnaigh a thaispeáint ar an gcnaipe athshocrú ródú."
    },
    "canModifyStops": {
      "title": "Ceadaigh cur stadanna",
      "tooltip": "Taispeáin an cnaipe 'Cuir Ceann Scríbe'. Ceadaíonn an cnaipe úsáideoirí a chur ar stadanna breise."
    },
    "minStops": {
      "title": "Stadanna Íosta",
      "tooltip": "An líon íosta stadanna."
    },
    "maxStops": {
      "title": "Stadanna uasta",
      "tooltip": "Líon uasta stadanna."
    },
    "returnToStart": {
      "title": "Fill ar ais go tús a chur",
      "tooltip": "Nuair a bheidh fíor, beidh an bealach ar ais pointe a thosú."
    },
    "showReturnToStartOption": {
      "title": "Taispeáin ais rogha chun tús a",
      "tooltip": "Nuair a bheidh fíor, tá an Tuairisceán an rogha chun tús a thaispeántar."
    },
    "traffic": {
      "title": "Bain úsáid as na sonraí tráchta",
      "tooltip": "Má úsáidtear sonraí tráchta fíor-ama nuair a bheidh an bealach a ríomh?"
    },
    "showTrafficOption": {
      "title": "Rogha Taispeáin tráchta",
      "tooltip": "Taispeáin na sonraí tráchta rogha a úsáid."
    }
  },
  "template": {
    "description": "Cumraíocht an teimpléad printout ródú.",
    "menuTitle": "Teimpléad cló ródú",
    "titleText": {
      "title": "Teideal téacs",
      "tooltip": "Socraigh teideal gur dealraitheach ar bharr an printout ródú.",
      "defaultText": "Mo bealach"
    },
    "logoImageUrl": {
      "title": "URL Íomhá",
      "tooltip": "URL íomhá do lógó ar an asphrionta mbealach."
    },
    "customStyleSheet": {
      "title": "URL do stílbhileog féin",
      "tooltip": "URL le stílbhileog saincheaptha a chuirtear i bhfeidhm ar an asphrionta ródú."
    },
    "showMap": {
      "title": "Taispeáin Léarscáil",
      "tooltip": "Tá léarscáil breise leis an mbealach a ríomhtar leis an printout."
    },
    "showSummary": {
      "title": "Taispeáin achoimre ródú",
      "tooltip": "Beidh an achoimre a thaispeáint ar an achar agus am an mbealach a ríomhtar."
    },
    "showNotes": {
      "title": "Nótaí Taispeáin úsáideora",
      "tooltip": "Ceadaigh úsáideoir a nótaí a chur le routing asphrionta."
    },
    "footerText": {
      "title": "Buntásc",
      "tooltip": "Cuir téacs saincheaptha a thaispeáint ag bun an leathanaigh printout ródú.",
      "defaultText": "Treoracha ar fáil chun críocha pleanála amháin agus tá siad faoi réir <a href='http://www.esri.com/legal/software-license' target='_blank'>théarmaí ESRI úsáide</a> . Is féidir le coinníollacha bóthair Dinimiciúla ann go cruinneas deara difriúil ó do treoracha agus ní mór a chur san áireamh chomh maith le comharthaí agus srianta dlí. Glacadh tú gach riosca a úsáid."
    }
  }
}