{
  "bundleName": "ESRI Locator Service",
  "bundleDescription": "Tämä paketti tarjoaa myymälän Esri Locator Service.",
  "stores": {
    "locator": {
      "name": "ESRI Maailman Geocoding Service",
      "description": "Plugin ESRI Maailman Geocoding Service (GeocodeServer).",
      "placeHolder": "Osoite tai sijainti ..."
    }
  }
}