{
  "bundleName": "Вижте плана",
  "bundleDescription": "--CORE ФУНКЦИОНАЛНОСТ--  The оформление шаблон изпълнява подреждането на всички елементи от потребителския интерфейс на базата на предварително дефинирани шаблони."
}