{
  "bundleName": "Window Manager",
  "bundleDescription": "--CORE FUNCTIONALITY-- The Window Manager is responsible to manage all floating windows.",
  "ui": {
    "defaultWindowTitle": "Window",
    "closeBtn": {
      "title": "Close"
    },
    "minimizeBtn": {
      "title": "Minimize"
    },
    "maximizeBtn": {
      "title": "Maximize"
    },
    "restoreBtn": {
      "title": "Restore"
    },
    "opacityBtn": {
      "title": "Change transparency"
    },
    "collapseBtn": {
      "title": "Hide content"
    },
    "loading": {
      "title": "Please wait!",
      "message": "Loading..."
    },
    "okcancel": {
      "title": "Question",
      "okButton": "Ok",
      "cancelButton": "Cancel"
    }
  }
}