{
  "bundleName": "Konfigurácia tlače",
  "bundleDescription": "Tento balík nastaví funkcie tlače.",
  "menu": {
    "title": "Tlač"
  },
  "widget": {
    "description": "Konfigurácia pre tlačiarenský nástroj.",
    "printservletURL": {
      "title": "Tlač Servlet URL",
      "tooltip": "URL k tlačovej Servlet"
    },
    "downloadResponseWithoutShowing": {
      "title": "Priame sťahovanie bez zobrazenia",
      "tooltip": "Vygenerovaný Výsledok tlače môžu byť zobrazené v okne, alebo ich je možné priamo stiahnuť"
    },
    "format": {
      "title": "Formát",
      "tooltip": "Formát generovaného výsledok tlače"
    },
    "title": {
      "title": "Názov",
      "tooltip": "Titul pre výsledok tlače"
    }
  }
}