{
  "bundleName": "App áttekintés",
  "bundleDescription": "Megjelenik egy párbeszédpanel, amely felsorolja az összes rendelkezésre álló apps.",
  "dataViewCommon": {
    "noDataMessage": "Nincs alkalmazás érhető el.",
    "filter": {
      "menuDefaultLabel": "Minden",
      "textBoxPlaceHolder": ""
    },
    "pager": {
      "backButtonTooltip": "Előző oldal",
      "forwardButtonTooltip": "Következő oldal",
      "firstButtonTooltip": "Első oldal",
      "lastButtonTooltip": "Utolsó oldal",
      "pageLabeltext": "Oldal:",
      "pageSizeLabelText": "Eredmények ${pageStartItemNumber}-${pageEndItemNumber} a ${itemCount}",
      "pageLabelText": "Oldal:"
    }
  },
  "appsTool": {
    "title": "Apps",
    "desc": "List of Apps"
  },
  "appsView": {
    "id": "Név",
    "title": "Cím",
    "desc": "Leírás",
    "filename": "Akta",
    "modifiedBy": "Módosítva",
    "modifiedAt": "Módosítható"
  }
}