{
  "bundleName": "Manipulace parametrů",
  "bundleDescription": "Parametr manažer je odpovědný přenést parametry z URL, aby se podle složek na startu.",
  "ui": {
    "encoderBtn": "Link nástroj",
    "encoderBtnTooltip": "Link nástroj",
    "sendMail": "E-mail",
    "refresh": "Osvěžit",
    "linkBoxTitle": "Link URL",
    "size": "Velikost (v pixelech)",
    "codeBoxTitle": "Kód vložit do HTML",
    "qrCode": "QRCode",
    "mailBody": "${url}",
    "mailSubject": "Podívejte se občas tuto kartu!",
    "options": {
      "small": "malý (480 x 320)",
      "medium": "medium (640 x 480)",
      "large": "velké (1280 x 1024)",
      "custom": "uživatelsky definované"
    }
  }
}