{
  "bundleName": "Geonames - Kokoonpano",
  "bundleDescription": "Kokoonpano nippu Geonames nippu.",
  "menu": {
    "geonames": {
      "title": "Geonames",
      "description": "Valitse Geonames myymälä"
    },
    "wikipedia": {
      "title": "Wikipedia"
    },
    "poi": {
      "title": "Nähtävyydet"
    },
    "postalcodes": {
      "title": "Postinumerot"
    }
  },
  "common": {
    "enabled": "Etsi aihe aktiivinen",
    "enabledTooltip": "Mahdollistaa hakuaihe käyttää sitä Omni hakuun.",
    "defaultLabel": "Placeholder",
    "defaultLabelTooltip": "Määrittää oletuksena tekstin haku syöttökenttään (arvo on valinnainen).",
    "pageSize": "Suurin tulokset",
    "pageSizeTooltip": "Suurin määrä hittejä tulokset (alue: 0-100; 0 on rajaton).",
    "typingdelay": "Viive [ms]",
    "typingdelayTooltip": "Tauko painallusten väliin ennen kysely on toimitettu (vaihteluväli 0-1000 millisekuntia)",
    "languageAware": "Kieli tietoinen tulokset",
    "languageAwareTooltip": "Käytetty kieli map.apps käytetään hakea paikallisia tuloksia.",
    "url": "URL palvelun",
    "urlTooltip": "URL hakupalvelu REST päätepiste.",
    "username": "Geonames käyttäjätunnus",
    "usernameTooltip": "Nimi henkilökohtainen Geonames tilin."
  },
  "wikipediaWidget": {
    "description": "Konfigurointi Wikipedia hakuaihe."
  },
  "poiWidget": {
    "description": "Kokoonpano POI haku myymälä."
  },
  "postalcodesWidget": {
    "description": "Konfigurointi postinumerohaun aihe.",
    "countries": "Maa suodatin",
    "countriesTooltip": "Maakoodi suodattaa tuloksia, esimerkiksi. \"DE\" (arvo on valinnainen)."
  },
  "stores": {
    "postalcodes": {
      "placeHolder": "Anna postinumero tai paikannimi ..."
    },
    "wikipedia": {
      "placeHolder": "Anna hakusana ..."
    },
    "poi": {
      "placeHolder": "Kiinnostava ..."
    }
  }
}