{
  "bundleName": "konfiguracija garnituro",
  "bundleDescription": "Snop konfiguracija za toolsets.",
  "menu": {
    "title": "konfiguracija garnituro"
  },
  "widget": {
    "rootLabel": "Garnituro",
    "addToolsetLabel": "Dodaj novo garnituro",
    "saveToolsetLabel": "Shrani garnituro",
    "deleteToolsetLabel": "Izbriši garnituro",
    "defaultToolsetTitle": "Neimenovani garnituro",
    "unassignedToolsetTitle": "Slobodna orodja",
    "selectToolsetHint": "Izberite garnituro s seznama na levi, da nastavite",
    "saveDeleteQuery": "Ali ste prepričani, da želite izbrisati garnituro '{title}'?",
    "deleteEntryLabel": "Zbriši vpis",
    "saveDeleteEntryQuery": "Ali ste prepričani, da želite izbrisati vnos \"{title} '?",
    "defaultEntryTitle": "Neimenovan vnos",
    "toolset": {
      "title": "Naslov",
      "tooltip": "Tooltip",
      "windowType": "Tip okno",
      "fixed": "fiksna",
      "floating": "pomična",
      "css_positioned": "CSS položaja",
      "leftCollapsed": "levo propadel",
      "rightCollapsed": "Pravica propadel",
      "topCollapsed": "top propadel",
      "bottomCollapsed": "Dno propadel",
      "dropdown": "dropdown",
      "menu": "meni",
      "menubar": "menijsko",
      "menuitem": "Menijska",
      "menubaritem": "Meni vnos bar",
      "position": "Položaj",
      "top": "top",
      "bottom": "dno",
      "left": "levo",
      "right": "Pravica",
      "styleClass": "Style razred",
      "closable": "Zapirljiv",
      "maxHorizontal": "Maksimalno število orodij zapored",
      "notitle": "Skrij naslov",
      "description": "<br /> Zgornjih možnosti vam omogočajo, da določite Medsebojno lego in videz toolset. <br /><br /> <b>Vrste oken:</b> <br /> Toolsets lahko da kot sledi: fiksni, plavajoče ali zgrudil na enem od robov zaslona. <br /><br /> <b>Položaj:</b> <br /> Medsebojno lego lahko definiramo glede na levo ali desno, kot tudi na zgornji ali spodnji strani zaslona. Razdalje so opredeljene kot piksel. Toolsets s tipom \"fiksno\" ali \"plavajoči\" se lahko namesti kjer koli na zemljevidu. Razstavljeni garnituro lahko namesti le vzdolž robu zaslona. <br /><br /> <b>Style razred:</b> <br /> Če se naslovna vrstica iz garnituro z vrsto \"fiksno\" skrito, izberite \"Skrij naziva\"."
    }
  }
}