{
  "bundleName": "Report Werkzeug",
  "bundleDescription": "Ein Werkzeug, das das Erstellen von Reports erlaubt.",
  "ui": {
    "tool": {
      "title": "Einen Bericht für die ausgewählte(n) Eintrag/Einträge erzeugen"
    },
    "reportingToolController": {
      "reportRequestedError": "Bericht konnte nicht generiert werden!",
      "reportRequestedWarning": "Es muss mindestens ein Eintrag selektiert sein.",
      "reportDatasourceUnavailable": "Die Datenquelle für den Bericht konnte nicht bestimmt werden."
    },
    "reportingService": {
      "reportRequestedError": "Bericht konnte nicht generiert werden!",
      "reportRequestedErrorReeportId": "Der zu erzeugende Bericht konnte nicht bestimmt werden. Ist eine Zuordnung definiert?",
      "reportRequestedOpen": "Bericht wird generiert...",
      "reportRequestedDownload": "Bericht wird heruntergeladen...",
      "window": {
        "title": "Bericht"
      }
    }
  }
}