{
  "bundleName": "La gestione dei parametri",
  "bundleDescription": "Il parametro Manager è responsabile di delegare i parametri dall'URL ai componenti in base all'avvio.",
  "ui": {
    "encoderBtn": "Strumento Link",
    "encoderBtnTooltip": "Strumento Link",
    "sendMail": "E-mail",
    "refresh": "Rinfrescare",
    "linkBoxTitle": "Link URL",
    "size": "Dimensioni (Pixel)",
    "codeBoxTitle": "Codice da incorporare in HTML",
    "qrCode": "QRCode",
    "mailBody": "${url}",
    "mailSubject": "Guardate a volte questa carta!",
    "options": {
      "small": "piccolo (480 x 320)",
      "medium": "medio (640 x 480)",
      "large": "grande (1280 x 1024)",
      "custom": "definita dall'utente"
    }
  }
}