{
  "bundleName": "Tegne",
  "bundleDescription": "Tegning Bundle giver brugeren tegne- og redigeringsværktøjer.",
  "commonDelete": {
    "saveQuery": "Vil du virkelig ønsker at slette {number} vare (r)?",
    "error": "Sletning af elementer '{items} misbrugt!",
    "partialSuccess": "Nogle elementer kan ikke slettes!",
    "errorFinish": "Ingen elementer er blevet slettet!",
    "success": "Den sletningen fuldført!"
  },
  "ui": {
    "tools": {
      "moveScaleRotateVertices": {
        "title": "Rediger grafik",
        "tooltip": "Ændre en grafisk (klik på et grafisk for at skifte tilstand)"
      },
      "moveScaleRotate": {
        "title": "Flyt, skalere, rotere,",
        "tooltip": "Flyt, skalere eller rotere et grafisk"
      },
      "editVertices": {
        "title": "Rediger node",
        "tooltip": "Rediger knudepunkter af en grafisk"
      },
      "deleteGraphic": {
        "title": "Slet grafisk",
        "tooltip": "Slet grafisk"
      }
    },
    "styleProperties": {
      "tool": {
        "title": "Karakter egenskaber",
        "tooltip": "Karakter egenskaber"
      },
      "presets": {
        "title": "Skabeloner",
        "deletePresetTool": "Sletning af en skabelon",
        "editPresetTool": "Rediger skabelon",
        "addPresetWidget": {
          "textboxPlaceHolder": "Gem skabelon ...",
          "buttonTooltip": "Gem skabelon ..."
        },
        "overwriteExistingItemMessageTitle": "Skabelon eksisterer allerede",
        "overwriteExistingItemMessage": "En skabelon med navnet '{itemName}' findes allerede. Hvis du vil have skabelonen at overskrive den?",
        "overwritePreConfiguredItemTitle": "Fejl",
        "overwritePreConfiguredItemMessage": "Du kan ikke overskrive en pre konfigureret skabelon!",
        "dataview": {
          "pager": {
            "backButtonTooltip": "Tilbage",
            "forwardButtonTooltip": "Fremad",
            "firstButtonTooltip": "Første",
            "lastButtonTooltip": "Sidste",
            "pageLabelText": "Side ${currentPage} på ${endPage}",
            "zeroResultsText": "",
            "pageSizeLabelText": "${pageStartItemNumber} - ${pageEndItemNumber} på ${itemCount}"
          },
          "filter": {
            "menuDefaultLabel": "Alle",
            "textBoxPlaceHolder": "Look For ..."
          },
          "DGRID": {
            "noDataMessage": "Ingen lagrede skabeloner til rådighed.",
            "loadingMessage": "Indlæser data ...",
            "error": "Fejl:"
          }
        },
        "presetStoreColumns": {
          "id": "Navn",
          "style": "Type",
          "preconfigured": "Konfigureret"
        },
        "notifier": {
          "saveSuccess": "Skabelon '{itemName}' er blevet gemt.",
          "saveError": "Skabelon '{itemName}' kunne ikke gemmes. {error}",
          "applySuccess": "Skabelon '{itemName}' er blevet anvendt med succes.",
          "applyError": "Skabelon '{itemName}' kunne ikke anvendes. {error}"
        },
        "groups": {
          "font": "Tekst",
          "stroke": "Linje",
          "fill": "Udfylde",
          "symbol": "Ikon",
          "marker": "Marker"
        }
      },
      "text": {
        "title": "Tekst",
        "fontFamily": "Skrifttype",
        "fontSize": "Skriftstørrelse",
        "fontColor": "Farve",
        "fontStyle": {
          "title": "Stil",
          "bold": "Fat",
          "italic": "Kursiv",
          "underlined": "Understreg"
        },
        "fontTransparency": "Gennemsigtighed"
      },
      "symbol": {
        "title": "Streg / Udfylde",
        "stroke": {
          "title": "Linje",
          "color": "Farve",
          "style": "Stil",
          "width": "Bredde",
          "transparency": "Gennemsigtighed",
          "strokeval": {
            "none": "Ingen"
          }
        },
        "fill": {
          "title": "Udfylde",
          "color": "Farve",
          "pattern": "Mønster",
          "transparency": "Gennemsigtighed",
          "patternval": {
            "none": "Ingen",
            "solid": "Solid",
            "vertical": "Sort lodret",
            "horizontal": "Sort Vandret",
            "backwarddiagonal": "Sort højre diagonal",
            "forwarddiagonal": "Sort Venstre Diagonal",
            "cross": "Sort Kontrolleret",
            "diagonalcross": "Sort Krydset"
          }
        }
      },
      "marker": {
        "title": "Marker",
        "style": "Stil",
        "size": "Størrelse",
        "styleval": {
          "circle": "Circle",
          "square": "Square",
          "cross": "Plus",
          "diamond": "Diamant",
          "x": "Cross"
        }
      },
      "symbols": {
        "title": "Symboler"
      }
    },
    "edit": {
      "activation": {
        "warn": "Den valgte grafik kan ikke redigeres med det aktuelle værktøj.",
        "info": "Graphic valgt."
      }
    },
    "drawpointtool": "punkt: Tegner et punkt",
    "drawmultipointtool": "Antal point: henleder flere punkter",
    "drawlinetool": "Linje: Tegn en lige linje",
    "drawpolylinetool": "Polylinje: Tegner flere linjer",
    "drawfreehandpolylinetool": "Frihånd polylinje: Tegner en brugerdefineret spor",
    "drawpolygontool": "Polygon: Tegner en polygon",
    "drawfreehandpolygontool": "Frihånd Polygon: Tegner en polygon frit definerbar",
    "drawextenttool": "Frihånd rektangel: Tegner et rektangel frit definerbar",
    "drawcircletool": "Cirkel: Tegner en cirkel",
    "drawellipsetool": "Ellipse: Tegner en ellipse",
    "drawrectangletool": "Rektangel: Tegn et rektangel",
    "drawarrowtool": "Pil: Tegn en pil i enhver retning",
    "drawleftarrowtool": "Venstre pil: Tegn en pil venstre tast",
    "drawrightarrowtool": "Højre pil: Tegn en pil, der peger mod højre",
    "drawuparrowtool": "Pil op: Tegn en opadgående pil domstole",
    "drawdownarrowtool": "Pil ned: Tegn en pil, der peger nedad",
    "drawtriangletool": "Trekant: Tegner en trekant",
    "drawerasealltool": "Rydde alle tegninger",
    "exportTool": "Eksport grafik",
    "defaultInfoTemplate": {
      "title": "Tegning værktøjssæt",
      "template": "<div> <span>ID: ${id}</span> <br/> <span>Geometritype: ${geometryType}</span> </div>"
    },
    "texteditor": {
      "tool": {
        "title": "Text Editor",
        "tooltip": "Skriv nogen tekst på kortet."
      }
    },
    "drawsymbol": {
      "tool": {
        "title": "Ikon galleri",
        "tooltip": "Tegn et symbol fra symbol galleri."
      },
      "store": {
        "fields": {
          "title": "Titel",
          "description": "Beskrivelse"
        }
      },
      "dataview": {
        "pager": {
          "backButtonTooltip": "Tilbage",
          "forwardButtonTooltip": "Fremad",
          "firstButtonTooltip": "Første",
          "lastButtonTooltip": "Sidste",
          "pageLabelText": "Side ${currentPage} på ${endPage}",
          "zeroResultsText": "",
          "pageSizeLabelText": "${pageStartItemNumber} - ${pageEndItemNumber} på ${itemCount}"
        },
        "filter": {
          "menuDefaultLabel": "Alle",
          "textBoxPlaceHolder": "Look For ..."
        },
        "ICON": {
          "noDataMessage": "Ingen symboler!",
          "loadingMessage": "Indlæser symboler ..."
        }
      }
    }
  }
}