{
  "bundleName": "Esri Locator Υπηρεσία",
  "bundleDescription": "Αυτό το πακέτο παρέχει ένα κατάστημα για την Esri Locator Υπηρεσία.",
  "stores": {
    "locator": {
      "name": "Υπηρεσία ESRI World Γεοκωδικοποίηση",
      "description": "Plugin για ESRI World Γεοκωδικοποίηση Υπηρεσία (GeocodeServer).",
      "placeHolder": "Διεύθυνση ή τοποθεσία ..."
    }
  }
}