{
  "bundleName": "AgolmapFinder-Config",
  "bundleDescription": "Deze bundel bevat de configuratie van componenten voor de AgolmapFinder bundel.",
  "menu": {
    "title": "ArcGIS Online Webmaps Finder"
  },
  "widget": {
    "description": "Configuratie van ArcGIS Online Webmap Finder inhoud.",
    "maxNumberOfResults": {
      "title": "Maximum aantal resultaten",
      "tooltip": "Definieert het maximum aantal resultaten."
    },
    "webmapsID": {
      "title": "Webmaps",
      "tooltip": "Schrijf de Webmap ID."
    },
    "bingMapsKey": {
      "title": "Bing webmaps",
      "tooltip": "Om bingmaps laden, moet u een bingmaps sleutel voor uw applicaiton definiëren."
    },
    "sortField": {
      "style": {
        "label": "Sorteer veld Opties",
        "tooltip": "Kies een soort veld"
      },
      "type": {
        "title": "Titel",
        "created": "Gemaakt op",
        "type": "Type",
        "owner": "Eigenaar",
        "avgRating": "Overall Rating",
        "numRatings": "Aantal beoordelingen",
        "numComments": "Aantal reacties",
        "numViews": "Aantal keer Bekeken",
        "tooltip": "Toont gebaseerd op SortField"
      }
    },
    "sortOrder": {
      "style": {
        "label": "Sorteer Methode",
        "tooltip": "Kies een sorteer methode"
      },
      "type": {
        "asc": "ASC",
        "desc": "DESC"
      }
    }
  }
}