{
  "bundleName": "ArcGIS for Server Search",
  "bundleDescription": "Saišķa nodrošina iespēju izmantot ArcGIS servera pakalpojumu slāni, Web datu avots",
  "defaults": {
    "name": "Iezīme",
    "description": "Pārlūkot spraudni, lai objektu ar ArcGIS Server Layer",
    "placeHolder": "Iezīme nosaukums ..."
  }
}