{
    "bundleName": "ec-wms-layer-selector",
    "bundleDescription": "ec-wms-layer-selector",
    "ui": {
        "windowTitle": "Seleziona livelli",
        "hint": "Il servizio WMS selezionato contiene ${countToProvideSelection} livelli, si prega di selezionare tutti i livelli da mostrare sulla cartina.",
        "selectAll": "Seleziona tutto",
        "closeButton":"Ok"
    },
    "tool": {
        "title": "Livelli",
        "tooltip": "Livelli"
    }
}