{
  "bundleName": "teme konfiguracijo",
  "bundleDescription": "Konfiguracija snop za predloge svežnju.",
  "menu": {
    "title": "Predloge postavitev"
  },
  "widget": {
    "description": "Izberite predlogo postavitve app. Postavitev določa strukturo aplikacije in položaj UI elementov. To bo postavitev, ki ga uporabljajo aplikacije privzeto.",
    "selectedTemplate": {
      "title": "Izbrano predlogo postavitve:",
      "tooltip": "Izbira postavitve predloge v app."
    }
  }
}