{
  "bundleName": "Parameter hantering",
  "bundleDescription": "Parametern Ledningen ansvarar samband med lanseringen av ansökan om överföring av parametrarna från URL till motsvarande komponenter.",
  "menu": {
    "title": "Länkverktyg"
  },
  "widget": {
    "description": "Konfigurera Länka verktyget.",
    "showLink": {
      "title": "Visa länk",
      "tooltip": "Visar en textruta som innehåller parameter länk till den aktuella kartvyn."
    },
    "showHTMLSnippet": {
      "title": "Visa kod som kan bäddas in i HTML-sidan.",
      "tooltip": "Visa kod som kan bäddas in i HTML-sidan."
    },
    "showMailToButton": {
      "title": "Visa E-Mail-knapp",
      "tooltip": "Visar en knapp för att skriva ett e-postmeddelande med länken till den aktuella kartvyn."
    },
    "showRefreshButton": {
      "title": "Visa knappen Uppdatera",
      "tooltip": "Visar en knapp för att uppdatera länkarna i dialogrutan."
    },
    "showQRCode": {
      "title": "Visa QR-kod",
      "tooltip": "Visar en QR-kod bild."
    }
  }
}