{
  "bundleName": "Carte de débit",
  "bundleDescription": "La carte de débit est utilisée pour basculer entre les groupes de calques qui se concentrent sur certains thèmes. Ce est un élément de l'interface utilisateur de couverture sur la base, en se référant à l'Apple Cover Flow.",
  "tool": {
    "title": "Carte contenu",
    "tooltip": "Carte contenu"
  },
  "ui": {
    "transparency": "Transparence",
    "transparencyTooltip": "Changer la transparence",
    "zoomToTooltip": "Zoom sur l'étendue de cette catégorie",
    "showDetailsTooltip": "Afficher les informations sur le détail",
    "rotatorTooltip": "Back to front",
    "deleteTooltip": "Effacer",
    "deleteQuestion": "Voulez-vous vraiment supprimer cet objet?"
  }
}