{
  "bundleName": "Hae Omni-kokoonpano",
  "bundleDescription": "Kokoonpano nippu omnisearch nippu.",
  "menu": {
    "title": "Haku Omni"
  },
  "widget": {
    "description": "Tässä valikossa konfigurointiin vain pintaa Omni haku. Aktivoitu haku aiheita ehkä määrittää erikseen.",
    "hint": "Haku on näkyvissä vain, jos vähintään yksi haku aihe on käytössä.",
    "displayLoadingIcon": "Näytä lastaus-kuvake",
    "ignoreCase": "Ohita tapauksessa",
    "autoComplete": "Ota automaattinen täydennys",
    "autoSelect": "Valitse korostetun osion pudotusvalikosta",
    "selectFirstResultOnEnter": "Valitse ensimmäinen tulos, kun painat <ENTER>"
  }
}