{
  "bundleName": "Bookmarks espaciais",
  "bundleDescription": "O pacote de bookmarks permite armazenar a extensão do mapa, como vários marcadores.",
  "ui": {
    "toolTitle": "Bookmarks espaciais",
    "clearButton": "Remova todos os marcadores",
    "deleteMessage": "Você realmente quer apagar todos os favoritos?",
    "deleteTitle": "Você tem certeza?",
    "deleteWarning": "Isso não pode ser desfeita!"
  }
}