{
  "bundleName": "Coördinaat zoeken",
  "bundleDescription": "Deze tool helpt de gebruiker om locaties door de inbreng van de geografische coördinaten te vinden.",
  "ui": {
    "invalidMessage": "Ongeldige coördineren formaat!",
    "invalidDegreeCoordinates": "Ongeldige coördineren formaat! <br /> <b>Volgorde:</b> <br /> Lengte Breedte <br /> <b>Formaat Voorbeelden:</b> <br /> 7.628694 51.962944 <br /> 7 ° 38'1 \"51 ° 58'1\"",
    "invalidMetricCoordinates": "Ongeldige coördineren formaat! <br /> <b>Volgorde:</b> <br /> Easting Northing <br /> <b>Formaat Voorbeeld:</b> <br /> 848860 6793187",
    "submitBtnTxt": "Ok",
    "toolTitle": "Vind coördinaten"
  }
}