{
  "bundleName": "App Overzicht",
  "bundleDescription": "Geeft een dialoogvenster dat alle beschikbare apps lijsten.",
  "dataViewCommon": {
    "noDataMessage": "Geen applicaties beschikbaar.",
    "filter": {
      "menuDefaultLabel": "Alle",
      "textBoxPlaceHolder": ""
    },
    "pager": {
      "backButtonTooltip": "Vorige pagina",
      "forwardButtonTooltip": "Komende pagina",
      "firstButtonTooltip": "Eerste pagina",
      "lastButtonTooltip": "Laatste pagina",
      "pageLabeltext": "Pagina:",
      "pageSizeLabelText": "Resultaten ${pageStartItemNumber}-${pageEndItemNumber} van ${itemCount}",
      "pageLabelText": "Pagina:"
    }
  },
  "appsTool": {
    "title": "Applicaties",
    "desc": "Lijst van Apps"
  },
  "appsView": {
    "id": "Naam",
    "title": "Titel",
    "desc": "Beschrijving",
    "filename": "Bestand",
    "modifiedBy": "Gewijzigd door",
    "modifiedAt": "Gewijzigd op"
  }
}