{
  "bundleName": "Strumento di segnalazione",
  "bundleDescription": "Uno strumento che consente di creare report.",
  "ui": {
    "tool": {
      "title": "Crea rapporto per l'elemento selezionato (s)"
    },
    "reportingToolController": {
      "reportRequestedError": "Rapporto non potrebbe essere generato!",
      "reportRequestedWarning": "Deve essere selezionata almeno una voce.",
      "reportDatasourceUnavailable": "Impossibile determinare origine dati per il rapporto."
    },
    "reportingService": {
      "reportRequestedError": "Rapporto non potrebbe essere generato!",
      "reportRequestedErrorReeportId": "Il rapporto deve essere generato, non è stato possibile determinare. È una mappatura definita?",
      "reportRequestedOpen": "Relazione è generato ...",
      "reportRequestedDownload": "Rapporto viene scaricato ...",
      "window": {
        "title": "Relazione"
      }
    }
  }
}