{
  "bundleName": "Għodda ta 'rappurtar",
  "bundleDescription": "A għodda li tippermetti li inti toħloq ir-rapporti.",
  "title": "Rappurtar",
  "description": "Poġġi iffissar għal ġenerazzjoni ta 'rapporti.",
  "widgets": {
    "reportTool": {
      "menuTitle": "Għodda ta 'rappurtar",
      "description": "Aġġusta l-imġieba tar-rapport għodda jinsab fiċ-ċentru riżultat.",
      "hint": "Twaqqif tal-fajl isem huwa utli meta l-għażla tniżżil dirett hi ċċekkjata.",
      "dataform": {
        "directDownload": {
          "title": "Tniżżil dirett",
          "tooltip": "Iċċekkja dan, meta r-rapport iġġenerat għandhom jitniżżlu direttament. Inkella se jintwerew fil-app."
        },
        "fileName": {
          "title": "Isem File",
          "tooltip": "L-isem tal-fajl li se jiġi ġġenerat u jitniżżel."
        }
      }
    },
    "reportTask": {
      "menuTitle": "Rapport Mappings",
      "description": "Aġġusta mappings li jiddefinixxu liema rapport se jintużaw għal liema tip ta 'suġġett għażla.",
      "hint": "Jekk l-ebda mapping huwa definit, ser tintuża r-rapport default.",
      "addReportMapping": {
        "title": "Żid assenjazzjoni ġdida",
        "tooltip": "Żid assenjazzjoni ġdida",
        "error": "Invalid konfigurazzjoni rapport ġie skopert u jridu jiġu skartati. Rapport:"
      },
      "removeReportMapping": {
        "title": "Ħassar immappjar Magħżula (i)",
        "tooltip": "Ħassar immappjar Magħżula (i)"
      },
      "grid": {
        "store": {
          "reportid": "Rapport",
          "storeId": "Aħżen",
          "title": "Isem"
        },
        "dataView": {
          "noDataFound": "L-ebda rapport assenjazzjonijiet disponibbli.",
          "DGRID": {
            "noDataMessage": "Nru assenjazzjonijiet rapport (i) misjuba ..."
          },
          "pager": {
            "pageSizeLabelText": "Mappings Rapport ${pageStartItemNumber} - ${pageEndItemNumber} ta '${itemCount}"
          }
        }
      },
      "widget": {
        "window": {
          "title": "Oħloq assenjazzjoni rapport"
        },
        "addButtonTitle": "Żid",
        "labelReportId": "Rapport",
        "labelMapmodelId": "Tema Għażla"
      }
    }
  }
}