{
  "bundleName": "Redigering konfiguration",
  "bundleDescription": "Konfiguration bundle for redigering bundt.",
  "title": "Redigering",
  "description": "Angiv indstillingerne omkring redigering af geo-genstande.",
  "hint": "Hvis du vil bruge redigeringsmuligheder mindst én funktion tjenesteydelser skal markeret som redigeres.",
  "widget": {
    "snapping": {
      "menuTitle": "Snapping",
      "description": "Indstil capture egenskaber.",
      "hint": "Når du har ændret egenskaber er det nødvendigt at genaktivere de aktuelt aktive redigeringsværktøjer.",
      "componentEnabled": {
        "title": "Aktiver Snapping",
        "tooltip": "Helt aktivere / deaktivere snapping."
      },
      "alwaysSnap": {
        "title": "Start altid",
        "tooltip": "Når det er aktiveret snapping er altid aktiv. Ellers anvendes den snapper nøgle."
      },
      "tolerance": {
        "title": "Tolerance [px]",
        "tooltip": "Tolerancen for snapper i pixels."
      }
    },
    "tools": {
      "menuTitle": "Redigeringsværktøjer",
      "description": "Vælg de tilgængelige redigeringsværktøjer.",
      "DefaultCreateFeatureTool": {
        "title": "Opret nye geo-genstande",
        "tooltip": "Aktiver / Deaktiver redskab til at skabe nye funktioner."
      },
      "DeleteFeatureTool": {
        "title": "Slet geo-genstande",
        "tooltip": "Aktiver / Deaktiver værktøj til at slette funktioner."
      },
      "DefaultEditFeatureTool": {
        "title": "Rediger geo-genstande",
        "tooltip": "Aktiver / Deaktiver værktøj til redigeringsfunktioner."
      }
    },
    "editmodes": {
      "menuTitle": "Redigering geo-genstande",
      "description": "Redigerbare egenskaber af geo-genstande.",
      "editAttributes": {
        "title": "Attributter kan redigeres",
        "tooltip": "Tænd / sluk for at tillade redigering af attributter geoobjects / forbud."
      },
      "editGeometry": {
        "title": "Geometrier kan redigeres",
        "tooltip": "Aktiver / Deaktiver for at tillade / forbyde redigering af en funktion geometri."
      }
    },
    "createmodes": {
      "menuTitle": "Oprettelse geo-genstande",
      "description": "Procedure for udarbejdelse af geo-genstande.",
      "persistAfterFeatureDrawn": {
        "title": "Spar geo-genstande umiddelbart efter tegning",
        "tooltip": "Når den er aktiveret, er en underskrevet geo-genstande lagret umiddelbart efter afslutningen af ​​tegningen processen, ellers når du har klikket på Gem."
      },
      "disableDrawToolAfterCreation": {
        "title": "Deaktiver tegning værktøj efter oprettelsen",
        "tooltip": "Når kontrolleret værktøj til at skabe funktioner deaktiveres efter at gemme funktionen. Ellers forbliver aktiv."
      }
    },
    "attachments": {
      "menuTitle": "Vedhæftede filer",
      "description": "Konfigurer understøttelse af vedhæftede filer.",
      "hint": "Vedhæftede filer er kun tilgængelig, hvis konfigureret i funktion server! <br/> Når du har ændret egenskaber er det nødvendigt at genaktivere de aktuelt aktive redigeringsværktøjer.",
      "enable": {
        "title": "Tillad vedhæftede filer",
        "tooltip": "Når det er aktiveret, er det muligt at uploade vedhæftede filer for eksisterende geo-genstande. Dette er kun muligt, hvis funktion i funktionen er konfigureret."
      }
    }
  }
}