{
  "bundleName": "Συντονισμός διαμόρφωση εμφάνισης",
  "bundleDescription": "Διαμόρφωση της οθόνης συντεταγμένων",
  "menu": {
    "title": "Συντονισμός οθόνης"
  },
  "widget": {
    "description": "Διαμόρφωση παραμέτρων της οθόνης συντεταγμένων.",
    "showScale": "Εμφάνιση κλίμακας",
    "showCoordinates": "Εμφάνιση συντεταγμένες",
    "degreeFormat": "Εμφάνιση συντεταγμένες σε μοίρες",
    "degreeFormatTooltip": "Η μορφή βαθμός χρησιμοποιείται μόνο εάν το χωρικό σύστημα αναφοράς συντεταγμένων σε γεωγραφικό μήκος και γεωγραφικό πλάτος με βάση",
    "decimalPlaces": "Δεκαδικά ψηφία συντεταγμένων",
    "transformSrs": "Μεταμορφώστε συντεταγμένες",
    "targetSrs": "Στόχος μετατροπή του συστήματος",
    "targetSrsTooltip": "Αυτή η παράμετρος διαμόρφωσης χρησιμοποιείται μόνο εάν είναι ενεργοποιημένη η «Μετασχηματισμός συντεταγμένων."
  }
}