{
  "bundleName": "Street View",
  "bundleDescription": "Is féidir le húsáideoir a roghnú suíomh ar an léarscáil agus a fheiceáil íomhánna Google Street View don suíomh i bhfuinneog scartha.",
  "ui": {
    "tools": {
      "streetViewToggleTool": {
        "title": "Street View",
        "tooltip": "Street View (comhthéacs-íogair do eatramh scála 1: 2,000,000 go 1: 2,000)"
      },
      "streetViewCenterOnMarkerTool": {
        "title": "Léim go marcóir",
        "tooltip": "Léim go marcóir"
      }
    },
    "noStreetViewData": "Níl sonraí Street View ar fáil ag an suíomh seo."
  }
}