{
  "bundleName": "Finder współrzędnych",
  "bundleDescription": "To narzędzie pomaga użytkownikowi znaleźć miejsca przez wejście współrzędnych geograficznych.",
  "ui": {
    "invalidMessage": "Nieprawidłowy format współrzędnych!",
    "invalidDegreeCoordinates": "Nieprawidłowy format współrzędnych! <br /> <b>Kolejność:</b> <br /> Długość Szerokość <br /> <b>Format Przykłady:</b> <br /> 7.628694 51.962944 <br /> 7 ° 38'1 \"51 ° 58'1\"",
    "invalidMetricCoordinates": "Nieprawidłowy format współrzędnych! <br /> <b>Kolejność:</b> <br /> Wsch Przyrost współrzednej X <br /> <b>Format Przykład:</b> <br /> 848860 6793187",
    "submitBtnTxt": "W porządku",
    "toolTitle": "Znajdź współrzędne"
  }
}