{
  "bundleName": "Rutare",
  "bundleDescription": "Acest pachet oferă Instrucțiunile widget din API ArcGIS pentru JavaScript.",
  "tool": {
    "title": "Rutare",
    "tooltip": "Afișare de rutare widget"
  },
  "printTemplate": {
    "printbutton": "Imprimare",
    "closebutton": "Închidere",
    "titleText": "Traseu mea:",
    "notesPlaceholder": "Introduceți note aici",
    "routingSummaryETE": "Timp estimat pe drum:",
    "routingSummaryDistance": "Distanță:",
    "footerText": "Direcții sunt oferite numai în scopuri de planificare și sunt supuse <a href='http://www.esri.com/legal/software-license' target='_blank'>termenilor Esri de utilizare ale lui</a> . Conditiile de drum dinamice pot exista ca motiv precizie să difere de la traseu si trebuie luate în considerare, împreună cu semne și restricții legale. Vă asumați toate riscurile de utilizare."
  },
  "units": {
    "hour": "oră",
    "hours": "ore",
    "minute": "minut",
    "minutes": "Proces-verbal",
    "esriMillimeters": "mm",
    "esriCentimeters": "cm",
    "esriDecimeters": "dm",
    "esriMeters": "m",
    "esriKilometers": "km",
    "esriFeet": "ft",
    "esriInches": "în",
    "esriMiles": "mi",
    "esriNauticalMiles": "nm",
    "esriUnknownUnits": "necunoscut"
  }
}