{
  "bundleName": "AddThis",
  "bundleDescription": "Le AddThis féidir le húsáideoirí a roinnt leis an app map.apps i líonraí sóisialta éagsúla.",
  "ui": {
    "errorOnAPILoad": "AddThis fáil!",
    "addThisAPILoader": {
      "exceptionAnn": "Theip ar luchtú JavaScript-API do AddThis.",
      "exceptionMsg": "Theip ar luchtú JavaScript-API do AddThis."
    }
  }
}