{
  "bundleName": "Sijainti Tiedot",
  "bundleDescription": "Näyttää tietoa tiettyyn paikkaan.",
  "ui": {
    "tools": {
      "mainActivationTool": "Sijainti Tiedot",
      "activationToolExtent": "Sijainti tiedot (suorakaide valinta)"
    },
    "result": {
      "type": "Tyyppi",
      "adapter": "Palvelu",
      "title": "Otsikko",
      "detailsUrl": "Linkki",
      "thumbnailUrl": "Pienoiskuva"
    },
    "content": {
      "image": {
        "title": "Kuva",
        "goToImageButton": "Siirry kotisivulle tämän kuvan",
        "sendByMailButton": "E-mail tämä kuva",
        "detailViewButtonLabel": "Tarkemmat tiedot"
      },
      "wikipedia": {
        "title": "Wikipedia",
        "openLink": "Katso koko artikkeli Wikipediasta"
      }
    },
    "noDataMessage": "Emme ole löytänyt mitään esineitä."
  },
  "requestErrorMessage": "Virhe. Palvelu voi olla tällä hetkellä käytettävissä."
}