{
  "bundleName": "Mobiilne tasandil kontrolli",
  "bundleDescription": "See kimp annab mobiilse tasandil kontroller valmis",
  "tool": {
    "title": "Kaart sisu",
    "tooltip": "Lülita sisse / välja Kaart sisu"
  },
  "ui": {
    "basemaps": "Base kaardid",
    "operationalLayers": "Teemasid taset",
    "switchUI": {
      "noTitle": "pealkiri puudub",
      "leftLabel": "Edasi",
      "rightLabel": "Ära"
    }
  }
}