{
  "bundleName": "Живея меню конфигурация",
  "bundleDescription": "Меню за живо конфигурация на един апартамент.",
  "ui": {
    "title": "Конфигурация на живо",
    "entry": "Влизане",
    "entries": "Записи",
    "noEntries": "В момента няма артикули в тази категория",
    "chooseCategory": "Моля, изберете опция",
    "buttons": {
      "back": "Обратно",
      "apply": "Актуализация Preview",
      "save": "App магазин"
    },
    "dataFormBuilderWidget": {
      "defaultValidationErrorMessage": "Моля, проверете вашия вход (а)!"
    },
    "saveStart": "Спасяването започна!",
    "saveError": "Спестете провали! {message}",
    "saveSuccess": "Успех!",
    "unknownError": "Неизвестна грешка!",
    "notAppliedConfigChanges": "Не се прилагат промени в конфигурацията открити! Те трябва да се прилага?",
    "loadConfigBundles": "<p> Инициализиране на конфигурационни пакети ({pos} / {разчитате}). <br/> Моля, бъдете търпеливи. </p>",
    "configureBtn": "Конфигурация на живо",
    "bundleStart": "На",
    "bundleStartMessage": "Създайте Пакет \"{name} ({symname})\"",
    "bundleStartMessageSuccess": "Започнете пакета \"{name} ({symname})\" успешно!",
    "bundleStartMessageFailure": "Започнете пакета \"{name} ({symname})\" не успя! {error}",
    "bundleStop": "Край",
    "bundleStopMessage": "Stop Bundle \"{name} ({symname})\"",
    "bundleStopMessageSuccess": "Спрете пакета \"{name} ({symname})\" успешно!",
    "bundleStopMessageFailure": "Спрете пакета \"{name} ({symname})\" не успя! {error}",
    "bundleInfo": {
      "components": "Елементи",
      "bundleIdentifier": "идентификатор",
      "bundleName": "Име",
      "bundleDescription": "Описание",
      "bundleVersion": "Версия",
      "bundleLocation": "Url",
      "bundleCopyRight": "Авторско право",
      "bundleState": "Статус",
      "bundleVendor": "Производител",
      "bundleCategory": "Категории",
      "bundleContactAddress": "Адрес за контакти",
      "bundleDocUrl": "Документация",
      "bundleLicense": "Разрешително",
      "bundleLicenseUrl": "Лиценз Url"
    },
    "componentInfo": {
      "component": "Компонент",
      "componentIdentifier": "идентификатор",
      "componentName": "Име",
      "componentState": "Статус",
      "componentInstances": "Случаите",
      "componentLog": "Вход",
      "jsonError": "Невалиден JSON формат: {error}",
      "commonDescription": "Можете да промените конфигурацията на компонент, като се редактира конфигурацията JSON тук. <b>Моля, бъдете внимателни!</b>",
      "factoryCreateHint": "Този компонент е \"Component Factory\"! Определяне на нова конфигурация ще създаде нов елемент!",
      "factoryDeleteHint": "Този компонент е т а \"Component Factory\"! Изчистване на TextField ще изтрие компонента!",
      "notConfigurableHint": "Този компонент не може да бъде конфигуриран."
    }
  },
  "menu": {
    "main": {
      "title": "Конфигурация на живо"
    },
    "content": {
      "title": "Съдържание",
      "description": "Определяне на съдържанието: Услуги, Карта рекламно лице, Карта членка, ..."
    },
    "widgets": {
      "title": "Widgets",
      "description": "Изберете джаджа"
    },
    "search": {
      "title": "Search & Selection",
      "description": "Изберете опция за търсене и подбор"
    },
    "tools": {
      "title": "Инструменти",
      "description": "Определя инструменти, които могат да бъдат използвани в това приложение"
    },
    "design": {
      "title": "Layout & Design",
      "description": "Определя визуален дизайн и проектиране на приложението"
    },
    "bundles": {
      "title": "Разширено конфигуриране (пакети)"
    }
  }
}