{
  "bundleName": "Směrování",
  "bundleDescription": "Tento balíček poskytuje Směry Widget z ArcGIS API pro JavaScript.",
  "tool": {
    "title": "Směrování",
    "tooltip": "Výstava směrování Widget"
  },
  "printTemplate": {
    "printbutton": "Tisk",
    "closebutton": "Zavřít",
    "titleText": "Moje cesta:",
    "notesPlaceholder": "Zde zadejte poznámky",
    "routingSummaryETE": "Předpokládaná doba na cestě:",
    "routingSummaryDistance": "Vzdálenost:",
    "footerText": "Pokyny jsou k dispozici pouze pro účely plánování a vztahují se na <a href='http://www.esri.com/legal/software-license' target='_blank'>podmínky společnosti ESRI pro používání</a> . Dynamické dopravní podmínky mohou existovat, které způsobují přesnost liší od svých stran a je třeba vzít v úvahu, spolu s příznaky a právní omezení. Nesete veškerá rizika použití."
  },
  "units": {
    "hour": "hodina",
    "hours": "hodiny",
    "minute": "minuta",
    "minutes": "zápis",
    "esriMillimeters": "mm",
    "esriCentimeters": "cm",
    "esriDecimeters": "dm",
    "esriMeters": "m",
    "esriKilometers": "km",
    "esriFeet": "ft",
    "esriInches": "v",
    "esriMiles": "mi",
    "esriNauticalMiles": "nm",
    "esriUnknownUnits": "neznámo"
  }
}