{
  "bundleName": "Selecție",
  "bundleDescription": "Oferă instrumente pentru selectarea obiectelor din surse de date",
  "ui": {
    "tools": {
      "mainActivationTool": "Selecta",
      "activationToolExtent": "Selectați prin dreptunghi"
    },
    "noDataMessage": "Nu am gasit nici un obiect."
  }
}