{
  "bundleName": "AddThis",
  "bundleDescription": "Kanssa AddThis käyttäjät voivat jakaa map.apps app eri sosiaalisia verkostoja.",
  "ui": {
    "errorOnAPILoad": "AddThis poissa!",
    "addThisAPILoader": {
      "exceptionAnn": "Lataaminen epäonnistui JavaScript-API tuotetiedot.",
      "exceptionMsg": "Lataaminen epäonnistui JavaScript-API tuotetiedot."
    }
  }
}