{
  "bundleName": "Live-configuratiemenu",
  "bundleDescription": "Menu voor live-configuratie van een app.",
  "ui": {
    "title": "Live-configuratie",
    "entry": "Binnenkomst",
    "entries": "Inzendingen",
    "noEntries": "Momenteel zijn er geen items in deze categorie",
    "chooseCategory": "Kies een optie",
    "buttons": {
      "back": "Terug",
      "apply": "Voorbeeld bijwerken",
      "save": "App opslaan"
    },
    "dataFormBuilderWidget": {
      "defaultValidationErrorMessage": "Controleer uw invoer (s)!"
    },
    "saveStart": "Besparing begonnen!",
    "saveError": "Opslaan mislukt! {message}",
    "saveSuccess": "Opslaan succesvol!",
    "unknownError": "Onbekende fout!",
    "notAppliedConfigChanges": "Niet toegepast configuratiewijzigingen opgespoord! Moeten ze worden toegepast?",
    "loadConfigBundles": "<p> Initialiseren configuratie bundels ({pos} / {count}). <br/> Wees geduldig. </p>",
    "configureBtn": "Live-configuratie",
    "bundleStart": "Op",
    "bundleStartMessage": "Maak Bundel '{name} ({symname})'",
    "bundleStartMessageSuccess": "Start de bundel '{name} ({symname})' met succes!",
    "bundleStartMessageFailure": "Start de bundel '{name} ({symname})' mislukt! {error}",
    "bundleStop": "Af",
    "bundleStopMessage": "Stop Bundle '{name} ({symname})'",
    "bundleStopMessageSuccess": "Stop de bundel '{name} ({symname})' met succes!",
    "bundleStopMessageFailure": "Stop de bundel '{name} ({symname})' mislukt! {error}",
    "bundleInfo": {
      "components": "Onderdelen",
      "bundleIdentifier": "Identificatie",
      "bundleName": "Naam",
      "bundleDescription": "Beschrijving",
      "bundleVersion": "Versie",
      "bundleLocation": "Url",
      "bundleCopyRight": "Auteursrecht",
      "bundleState": "Toestand",
      "bundleVendor": "Fabrikant",
      "bundleCategory": "Categorieën",
      "bundleContactAddress": "Contact Adres",
      "bundleDocUrl": "Documentatie",
      "bundleLicense": "Licentie",
      "bundleLicenseUrl": "Licentie Url"
    },
    "componentInfo": {
      "component": "Bestanddeel",
      "componentIdentifier": "Identificatie",
      "componentName": "Naam",
      "componentState": "Toestand",
      "componentInstances": "Gevallen",
      "componentLog": "Inloggen",
      "jsonError": "Ongeldige JSON formaat: {error}",
      "commonDescription": "U kunt de configuratie van een component wijzigen door de configuratie JSON hier bewerken. <b>Wees voorzichtig!</b>",
      "factoryCreateHint": "Dit component is een 'Component Factory'! Het definiëren van een nieuwe configuratie zal een nieuwe component te maken!",
      "factoryDeleteHint": "Dit component is een 'Component Factory' punt! Wissen van het tekstveld zal de component te verwijderen!",
      "notConfigurableHint": "Deze component kan niet worden geconfigureerd."
    }
  },
  "menu": {
    "main": {
      "title": "Live-configuratie"
    },
    "content": {
      "title": "Inhoud",
      "description": "Inhoud definiëren: Diensten, Kaart Model, Map State, ..."
    },
    "widgets": {
      "title": "Widgets",
      "description": "Kies een widget"
    },
    "search": {
      "title": "Search & Selection",
      "description": "Kies een optie werving en selectie"
    },
    "tools": {
      "title": "Gereedschap",
      "description": "Definieert tools die gebruikt kunnen worden in deze app"
    },
    "design": {
      "title": "Layout & Design",
      "description": "Definieert de visuele lay-out en het ontwerp van de app"
    },
    "bundles": {
      "title": "Geavanceerde configuratie (bundels)"
    }
  }
}