{
  "bundleName": "Bundle Narzędzia",
  "bundleDescription": "Umożliwia zgłaszanie narzędzi do uruchamiania i zatrzymywania modułów.",
  "bundleToggleTool": {
    "title": "Włączyć / wyłączyć moduł"
  }
}