{
  "bundleName": "Aruandluse vahendi",
  "bundleDescription": "Vahend, mis võimaldab teil luua aruandeid.",
  "ui": {
    "tool": {
      "title": "Loo aruanne valitud elemendi (d)"
    },
    "reportingToolController": {
      "reportRequestedError": "Raport ei saa loodud!",
      "reportRequestedWarning": "See peab olema valitud vähemalt üks kirje.",
      "reportDatasourceUnavailable": "Ei saa määrata, andmeallika kohta aruande."
    },
    "reportingService": {
      "reportRequestedError": "Raport ei saa loodud!",
      "reportRequestedErrorReeportId": "Aruanne tuleb koguda ei saa määrata. Kas kaardistamine määratletud?",
      "reportRequestedOpen": "Aruanne on loodud ...",
      "reportRequestedDownload": "Aruanne on alla laaditud ...",
      "window": {
        "title": "Aruanne"
      }
    }
  }
}