{
  "bundleName": "Pažymėti konfigūravimo vedlys Rinkinys",
  "bundleDescription": "Konfigūravimo vedlys ryšulys Žymelių valdikliui",
  "menu": {
    "title": "Erdviniai Žymės"
  },
  "widget": {
    "description": "Konfigūracijos žymų",
    "editable": "Leiskite užsakymą žymes",
    "localStorageKey": "Pavadinimas Vietos saugojimas",
    "predefinedBookmarks": "Built žymes",
    "predefinedBookmarksHint": "Tai yra įmanoma, kad prefine žymų sąrašą. Šios žymelės bus prieinama visiems pagal nutylėjimą vartotojams. Perkelti žemėlapį į norimą kiek ir išsaugokite ją."
  }
}