{
  "bundleName": "App Stores",
  "bundleDescription": "Tartalmazza a boltban megvalósítások hozzáférést apps és app sablonok",
  "editorStateValues": {
    "DRAFT": "Vázlat",
    "EDITED": "Szerkesztett",
    "VERIFIED": "Ellenőrzött",
    "PUBLISHED": "Közzétett",
    "DEPRECATED": "Elavult"
  }
}