{
  "bundleName": "Live configuration menu",
  "bundleDescription": "Menu for live configuration of an app.",
  "ui": {
    "title": "Live Configuration",
    "entry": "entry",
    "entries": "entries",
    "noEntries": "Currently there are no items in this category",
    "chooseCategory": "Please choose an option",
    "buttons": {
      "back": "Back",
      "apply": "Update Preview",
      "save": "Save App"
    },
    "dataFormBuilderWidget": {
      "defaultValidationErrorMessage": "Please check your input(s)!"
    },
    "saveStart": "Saving started!",
    "saveError": "Saving failed! {message}",
    "saveSuccess": "Application saved!",
    "unknownError": "Reason unknown!",
    "notAppliedConfigChanges": "Not applied configuration changes detected! Should they be applied?",
    "loadConfigBundles": "<p>Initializing configuration bundles ({pos}/{count}).<br/>Please be patient.</p>",
    "configureBtn": "Live Configuration",
    "bundleStart": "On",
    "bundleStartMessage": "Start Bundle '{name}({symname})'!",
    "bundleStartMessageSuccess": "Start of Bundle '{name}({symname})' successfull!",
    "bundleStartMessageFailure": "Start of Bundle '{name}({symname})' failed! {error}",
    "bundleStop": "Off",
    "bundleStopMessage": "Stop Bundle '{name}({symname})'",
    "bundleStopMessageSuccess": "Stop of Bundle '{name}({symname})' successfull!",
    "bundleStopMessageFailure": "Stop of Bundle '{name}({symname})' failed! {error}",
    "bundleInfo": {
      "components": "Components",
      "bundleIdentifier": "Identifier",
      "bundleName": "Name",
      "bundleDescription": "Description",
      "bundleVersion": "Version",
      "bundleLocation": "Url",
      "bundleCopyRight": "Copyright",
      "bundleState": "State",
      "bundleVendor": "Vendor",
      "bundleCategory": "Categories",
      "bundleContactAddress": "Contact Address",
      "bundleDocUrl": "Documentation",
      "bundleLicense": "License",
      "bundleLicenseUrl": "LicenseUrl"
    },
    "componentInfo": {
      "component": "Component",
      "componentIdentifier": "Identifier",
      "componentName": "Name",
      "componentState": "State",
      "componentInstances": "Instances",
      "componentLog": "Log",
      "jsonError": "Invalid JSON Format: {error}",
      "commonDescription": "Here you can change the configuration of a Component via json configuration editing. <b>Please be carefull!</b>",
      "factoryCreateHint": "This Component is a 'Component Factory'! Defining a new configuration will create a new component!",
      "factoryDeleteHint": "This Component is a 'Component Factory' item! Clearing the textfield will delete the component!",
      "notConfigurableHint": "This Component cannot be configured."
    }
  },
  "menu": {
    "main": {
      "title": "Live Configuration"
    },
    "content": {
      "title": "Content",
      "description": "Define content: Services, Map Model, Map State, ..."
    },
    "widgets": {
      "title": "Widgets",
      "description": "Choose a widget"
    },
    "search": {
      "title": "Search & Selection",
      "description": "Choose a search and selection option"
    },
    "tools": {
      "title": "Tools",
      "description": "Defines tools that can be used in this app"
    },
    "design": {
      "title": "Layout & Design",
      "description": "Defines the visual layout and design of the app."
    },
    "bundles": {
      "title": "Advanced Configuration (Bundles)"
    }
  }
}