{
  "bundleName": "Mapa resumen",
  "bundleDescription": "El general Mapa da una mejor orientación al usuario, mostrando la extensión actual del mapa en un mapa más pequeña escala dentro de una ventana separada.",
  "tool": {
    "title": "Mapa resumen",
    "tooltip": "Mostrar mapa general"
  }
}