{
  "bundleName": "Hartă",
  "bundleDescription": "Harta pachet gestionează harta principal și toate informațiile hartă conținut. Clientul poate abstract serviciile utilizate într-un model Harta ierarhic, astfel încât acestea pot fi afișate în diferite moduri pentru utilizator.",
  "ui": {
    "nodeUpdateError": {
      "info": "Actualizarea serviciului \"${title} Ocazie! Eroare: ${errorMsg}",
      "detail": "Actualizarea serviciului \"${title} Ocazie! Eroare: ${url} ${errorMsg} - Detalii: ${error}"
    },
    "sliderLabels": {
      "country": "Țară",
      "region": "Regiune",
      "town": "Oraș"
    }
  },
  "drawTooltips": {
    "addPoint": "Faceți clic pe hartă",
    "addMultipoint": "Faceți clic pentru a începe",
    "finishLabel": "Finisaj"
  }
}