{
  "bundleName": "Konzola",
  "bundleDescription": "Konzola pomáha spravovať a monitorovať nainštalovaný balík. To tiež znamená, služby, komponenty a správy protokolu.",
  "ui": {
    "windowTitle": "Konzola",
    "bundleTab": "Zväzky",
    "bundlesStoreFields": {
      "id": "ID",
      "name": "Názov",
      "description": "Popis",
      "state": "Postavenie",
      "autostartPolicy": "Autostart Policy",
      "symbolicName": "Symbolický názov",
      "version": "Verzia",
      "startLevel": "Začiatok Level",
      "vendor": "Poskytovateľ",
      "location": "Umiestnenie"
    },
    "servicesTab": "Služby",
    "servicesStoreFields": {
      "id": "ID",
      "provides": "Rozhranie",
      "bundle": "Balík",
      "component": "Komponent",
      "properties": "Vlastnosti"
    },
    "componentsTab": "Komponenty",
    "componentsStoreFields": {
      "id": "ID",
      "name": "Názov",
      "state": "Postavenie",
      "properties": "Vlastnosti",
      "instances": "Inštancia",
      "log": "Log",
      "bundleName": "Balík"
    },
    "messagesTab": "Správy",
    "messagesStoreFields": {
      "level": "Úroveň",
      "time": "Čas",
      "message": "Stručný opis",
      "announcement": "Správa"
    },
    "tools": {
      "bundles": {
        "start": {
          "title": "Začiatok balíčky",
          "tooltip": "Začať vybrané Zväzky"
        },
        "stop": {
          "title": "Zastaviť balíčky",
          "tooltip": "Zastaviť vybrané Zväzky"
        }
      },
      "components": {
        "configure": {
          "title": "Konfigurácia komponentov",
          "tooltip": "Konfigurácia vybraná komponenta"
        }
      }
    },
    "dataView": {
      "pager": {
        "backButtonTooltip": "Späť",
        "forwardButtonTooltip": "Vpred",
        "firstButtonTooltip": "Prvá strana",
        "lastButtonTooltip": "Posledná strana",
        "pageLabelText": "Strana ${currentPage} z ${endPage}",
        "zeroResultsText": "",
        "pageSizeLabelText": "${pageStartItemNumber} - ${pageEndItemNumber} z ${itemCount}"
      },
      "filter": {
        "menuDefaultLabel": "Všetko",
        "textBoxPlaceHolder": "Pozrite sa na ..."
      },
      "DGRID": {
        "noDataMessage": "Žiadne údaje.",
        "loadingMessage": "Načítanie dát ..."
      }
    },
    "dataFormNotInstalled": "DataForm zväzok nie je nainštalovaná. Ak chcete povoliť funkcie nastavení komponenty pridať DataForm zväzok do vášho app.json súboru."
  }
}