{
  "bundleName": "Forbhreathnú Léarscáil Cumraíocht",
  "bundleDescription": "An bundle chumraíocht an léarscáil forbhreathnú.",
  "menu": {
    "title": "Forbhreathnú léarscáil"
  },
  "widget": {
    "description": "Roghnaigh seirbhís don léarscáil forbhreathnú. Is féidir leat a shainiú freisin sraith más níos mó ná aon fáil.",
    "hint": "Is féidir na seirbhísí nua a chur ar an roghchlár 'Bainistíocht na Seirbhíse'.",
    "service": "Seirbhís Léarscáil",
    "layers": "Sraith",
    "transparency": "Trédhearcacht na dronuilleoige",
    "color": "Dath na dronuilleoige",
    "allLayers": "Léir atá ar fáil",
    "expandFactor": "Leathnú / fachtóir súmáil",
    "errorMessage": "Roghnaigh ciseal amháin ar a laghad le do thoil!"
  }
}