{
  "bundleName": "UndoRedo",
  "bundleDescription": "Modulis piedāvā atpogāt / pārtaisīt sistēmu.",
  "undoTool": {
    "title": "Atpogāt",
    "tooltip": "Atpogāt"
  },
  "redoTool": {
    "title": "Pārtaisīt",
    "tooltip": "Pārtaisīt"
  },
  "messages": {
    "undo": {
      "start": "Atsaukt {operation} sākusies",
      "success": "Atsaukt {operation} pabeigts",
      "failure": "Atsaukt {operation} neizdevās. Kļūda: {error}"
    },
    "redo": {
      "start": "Pārtaisīt {operation} sākusies",
      "success": "Pārtaisīt {operation} pabeigts",
      "failure": "Pārtaisīt {operation} neizdevās. Kļūda: {error}"
    }
  }
}