{
  "bundleName": "Consól",
  "bundleDescription": "Cuidíonn an consól a bhainistiú agus monatóireacht a dhéanamh ar bundle suiteáilte. Léiríonn sé freisin seirbhísí, comhpháirteanna agus teachtaireachtaí loga.",
  "ui": {
    "windowTitle": "Consól",
    "bundleTab": "Bundles",
    "bundlesStoreFields": {
      "id": "ID",
      "name": "An t-ainm",
      "description": "Cur síos",
      "state": "Stádas",
      "autostartPolicy": "Polasaí Tosaithe",
      "symbolicName": "An t-ainm Siombalach",
      "version": "Leagan",
      "startLevel": "Tosaigh Leibhéal",
      "vendor": "Soláthraí",
      "location": "Suíomh"
    },
    "servicesTab": "Seirbhísí",
    "servicesStoreFields": {
      "id": "ID",
      "provides": "Comhéadain",
      "bundle": "Bundle",
      "component": "Comhpháirt",
      "properties": "Airíonna"
    },
    "componentsTab": "Comhpháirteanna",
    "componentsStoreFields": {
      "id": "ID",
      "name": "An t-ainm",
      "state": "Stádas",
      "properties": "Airíonna",
      "instances": "Cásanna",
      "log": "Logáil",
      "bundleName": "Bundle"
    },
    "messagesTab": "Teachtaireachtaí",
    "messagesStoreFields": {
      "level": "Leibhéal",
      "time": "Am",
      "message": "Cur síos",
      "announcement": "Teachtaireacht"
    },
    "tools": {
      "bundles": {
        "start": {
          "title": "Bundles Tosaigh",
          "tooltip": "Tosaigh Bundles Roghnaithe"
        },
        "stop": {
          "title": "Stad Bundles",
          "tooltip": "Múchadh Roghnaithe Bundles"
        }
      },
      "components": {
        "configure": {
          "title": "Comhpháirteanna Cumraigh",
          "tooltip": "Cumraigh Comhpháirt Roghnaithe"
        }
      }
    },
    "dataView": {
      "pager": {
        "backButtonTooltip": "Ar ais",
        "forwardButtonTooltip": "Ar Aghaidh",
        "firstButtonTooltip": "An chéad leathanach",
        "lastButtonTooltip": "Leathanach Last",
        "pageLabelText": "Leathanach ${currentPage} de ${endPage}",
        "zeroResultsText": "",
        "pageSizeLabelText": "${pageStartItemNumber} - ${pageEndItemNumber} de ${itemCount}"
      },
      "filter": {
        "menuDefaultLabel": "Gach",
        "textBoxPlaceHolder": "Féach Do ..."
      },
      "DGRID": {
        "noDataMessage": "Níl sonraí.",
        "loadingMessage": "Luchtú sonraí ..."
      }
    },
    "dataFormNotInstalled": "Níl an bundle dataform suiteáilte. A chur ar chumas an gné chumraíocht chomhpháirt a chur ar an bundle dataform le do chomhad app.json."
  }
}