{
  "bundleName": "Žemėlapis srauto",
  "bundleDescription": "Žemėlapis srautas yra naudojamas perjungti sluoksnio grupėms, kurios dėmesio centre dėl tam tikrų temų. Tai dangtelis pagrindu UI elementas, nuoroda į \"Apple Cover Flow.",
  "tool": {
    "title": "Žemėlapis turinys",
    "tooltip": "Žemėlapis turinys"
  },
  "ui": {
    "transparency": "Skaidrumas",
    "transparencyTooltip": "Pakeisti skaidrumas",
    "zoomToTooltip": "Padidinti į šią kategoriją, kiek",
    "showDetailsTooltip": "Rodyti detali informacija",
    "rotatorTooltip": "Atžagariai",
    "deleteTooltip": "Panaikinti",
    "deleteQuestion": "Ar tikrai norite ištrinti šį elementą?"
  }
}