{
  "bundleName": "App beheer",
  "bundleDescription": "Kapselt UI-elementen voor app beheer",
  "commonDelete": {
    "saveQuery": "Wil je echt wilt '{number}' product (en) wilt verwijderen?",
    "error": "Schrapping van de items '{items}' mislukt!",
    "partialSuccess": "Sommige items kunnen niet worden verwijderd!",
    "errorFinish": "Geen enkel element is verwijderd!",
    "success": "Items met succes verwijderd!"
  },
  "templatesTool": {
    "title": "App templates",
    "desc": "Lijst van de app templates"
  },
  "removeSelectedTemplatesTool": {
    "title": "Verwijderen",
    "desc": "Verwijderen app onderwerping (s)"
  },
  "createTemplateTool": {
    "title": "Creëren",
    "desc": "Maak app onderwerping"
  },
  "dataViewCommon": {
    "filter": {
      "menuDefaultLabel": "Alle",
      "textBoxPlaceHolder": ""
    },
    "pager": {
      "backButtonTooltip": "Vorige pagina",
      "forwardButtonTooltip": "Volgende pagina",
      "firstButtonTooltip": "Eerste pagina",
      "lastButtonTooltip": "Laatste pagina",
      "pageLabeltext": "Pagina:",
      "pageSizeLabelText": "Resultaten ${pageStartItemNumber}-${pageEndItemNumber} van ${itemCount}",
      "pageLabelText": "Pagina:"
    }
  },
  "templatesView": {
    "noDataMessage": "Geen App sjablonen beschikbaar ...",
    "title": "Titel",
    "desc": "Beschrijving",
    "filename": "Bestand",
    "modifiedBy": "Gewijzigd door",
    "modifiedAt": "Gewijzigd op"
  },
  "templatesDetailsView": {
    "windowTitle": "App sjabloon '{title}'",
    "createWindowTitle": "Nieuwe sjabloon App",
    "title": "Titel:",
    "description": "Beschrijving:",
    "createdAt": "Gemaakt op:",
    "createdBy": "Gemaakt door:",
    "modifiedAt": "Gewijzigd op:",
    "modifiedBy": "Aangepast door:",
    "id": "ID:",
    "fileName": "bestand:",
    "upload": "Uploaden",
    "uploaded": "100% - sjabloon geoptimaliseerd",
    "updateError": "Sjabloon '{id}' kan niet worden opgeslagen! {error}",
    "updateSuccess": "Sjabloon '{id}' succesvol opgeslagen!",
    "uploadStart": "Upload de slag!",
    "uploadError": "Upload fout:",
    "uploadFinished": "Uploaden voltooid!",
    "createTemplateInfo": "Voer een naam van uw nieuwe Template App. Na de nieuwe sjabloon is aangemaakt, kunt u de gegevens uploaden naar het.",
    "panelDefaultTitle": "<b>Algemene Informatie</b>",
    "panelFileTitle": "<b>Templates bestand</b>",
    "syncInfo": "<strong>Opmerking:</strong> Elke aanvraag op basis van deze sjabloon en met 'automatische synchronisatie' ingeschakeld worden tijdens het uploaden worden gesynchroniseerd!"
  },
  "appsTool": {
    "title": "Apps",
    "desc": "Lijst van Apps"
  },
  "removeSelectedAppsTool": {
    "title": "Verwijderen",
    "desc": "Verwijderen App(s)"
  },
  "createAppTool": {
    "title": "Maak een nieuwe App",
    "desc": "Maak App"
  },
  "appsView": {
    "noDataMessage": "Geen apps beschikbaar ...",
    "id": "App-ID",
    "title": "Titel",
    "desc": "Beschrijving",
    "filename": "Bestand",
    "modifiedBy": "Gewijzigd door",
    "modifiedAt": "Gewijzigd op",
    "editorState": "Toestand",
    "appTemplateFilterSelect": {
      "placeHolder": "Filteren op app template",
      "tooltip": "Toon alleen apps op basis van een specifieke app template."
    }
  },
  "appColumnExtender": {
    "launchApp": "Lancering",
    "launchAppTooltip": "Lancering App"
  },
  "appDetailsView": {
    "windowTitle": "App '{title}'",
    "createWindowTitle": "Nieuwe App",
    "title": "Titel:",
    "description": "Beschrijving:",
    "createdAt": "Gemaakt op:",
    "createdBy": "Gemaakt door:",
    "modifiedAt": "Gewijzigd op:",
    "modifiedBy": "Aangepast door:",
    "id": "App ID:",
    "templateId": "App sjabloon:",
    "templateModifiedAt": "App sjabloon gewijzigd op:",
    "fileName": "bestand:",
    "editorState": "Toestand",
    "syncAuto": {
      "title": "Automatische synchronisatie:",
      "tooltip": "Maakt automatische synchronisatie van deze app. Op elke update van de onderliggende app sjabloon, zal deze app worden gesynchroniseerd met de geconfigureerde synchronisatie automatisch."
    },
    "syncMode": {
      "title": "Synchronisatie-modus:",
      "tooltip": "<ul><li> <b>Vervang:</b> In deze modus wordt de app zal volledig worden vervangen door de app sjabloon. Alle instellingen van deze app, evenals bewerkt of toegevoegde bestanden zullen verloren gaan. </li><li> <b>Samenvoegen:</b> In deze modus worden alle veranderingen van deze app zal worden samengevoegd met de instellingen van de app sjabloon. Standaard worden alle bestanden veranderingen in de app worden verloren, met uitzondering van toegevoegde bestanden en de app.json bestand. Sjabloon wijzigingen aan de app.json bestanden worden toegepast op een woning niveau per-component. Raadpleeg de <i>Documentatie voor ontwikkelaars</i> voor meer informatie en opties. <br/> <b>Na een succesvolle synchronisatie moet u de wijzigingen in de app te bekijken.</b> </li></ul>"
    },
    "syncedAt": "Gesynchroniseerd op:",
    "editorStateValues": {
      "DRAFT": "Ontwerp",
      "EDITED": "Bewerkt",
      "VERIFIED": "Geverifieerd",
      "PUBLISHED": "Gepubliceerd",
      "DEPRECATED": "Deprecated"
    },
    "syncModeValues": {
      "REPLACE": "Vervangen",
      "MERGE": "Samensmelten"
    },
    "enabled": "Online:",
    "updateError": "App '{id}' kan niet worden opgeslagen! {error}",
    "updateSuccess": "App '{id}' succesvol opgeslagen!",
    "updateStarted": "Het opslaan van App '{id}' begonnen ...",
    "invalidJSONError": "De JSON is ongeldig: {error}",
    "editJsonInfo": "U kunt alle bestanden van de app bewerken handmatig in dit dialoogvenster. <br/> <strong>WAARSCHUWING:</strong> U kunt wijzigingen die een succesvolle opstart van de app kan voorkomen.",
    "choseFileLabel": "Kies een bestand:",
    "createAppInfo": {
      "id": "Vul een ID (zonder spaties) voor uw nieuwe app. <br/> Deze ID moet uniek zijn. Het wordt gebruikt in de URL die naar uw app.",
      "template": "Kies een App sjabloon. Alle initiële configuratie-instellingen worden gekozen uit deze sjabloon. U kunt er ook voor kiezen om een ​​app direct te uploaden.",
      "title": "Voer een titel en een beschrijving voor uw app.",
      "templateId": "App sjabloon:",
      "emptyTemplate": "Uploaden app direct:",
      "uploadInfo": "Upload de app.",
      "upload": "Uploaden App",
      "uploaded": "100% - App is geoptimaliseerd",
      "uploadStart": "Upload de slag!",
      "uploadError": "Upload fout:",
      "uploadFinished": "Uploaden voltooid!"
    },
    "panelDefaultTitle": "<strong>Algemene Informatie</strong>",
    "panelEditorTitle": "<strong>Informatie bewerken</strong>",
    "panelTemplateTitle": "<strong>App Sjabloon Informatie</strong>",
    "panelConfigureTitle": "<strong>Configuratie Acties</strong>",
    "panelShareTitle": "<strong>Delen met:</strong>",
    "panelThumbnailTitle": "<strong>Miniatuur voor Apps Overzicht</strong>",
    "thumbnailUploadTitle": "Uploaden Miniatuur",
    "thumbnailUploadedTitle": "100%",
    "configurePreviewBtn": "Live-configuratie",
    "configureFilesBtn": "Handmatige configuratie",
    "configureOptimizeBtn": "Optimaliseren app",
    "configureExportBtn": "Export App",
    "configureSynchronizeBtn": "Synchroniseer nu",
    "shareWithAnyone": "<strong>Iedereen</strong>",
    "command": {
      "Add": "Maak een bestand",
      "Replace": "Vervang bestand inhoud",
      "Save": "Sla bestand op",
      "Delete": "Bestand verwijderen",
      "Preview": "Voorbeeld applicatie"
    },
    "deleteWarning": "Wil je echt dit bestand wilt verwijderen?",
    "addFileTitle": "Voer de bestandsnaam",
    "fileExistsError": "Het bestand {bestand} bestaat al!",
    "invalidError": "Het bestand is ongeldig!",
    "templateInfo": {
      "requested": "Sjabloon informatie wordt momenteel gevraagd ...",
      "deleted": "De sjabloon bestaat niet meer!",
      "directuploaded": "De sjabloon werd direct geupload tijdens de app creatieve proces!",
      "isNewerAsApp": "<strong>De app sjabloon is gewijzigd sinds de laatste synchronisatie.</strong>"
    },
    "fileUpload": {
      "windowTitle": "Vervang bestand inhoud",
      "warning": "Houd er rekening mee dat de inhoud van het bestaande bestand wordt vervangen zonder verificatie!",
      "upload": "Bestand uploaden",
      "uploaded": "100%"
    }
  },
  "optimizeError": "Optimalisatie mislukt! Fout: {error}",
  "optimizeSuccess": "Optimalisatie succes afgerond!",
  "optimizeInfo": "De optimalisatie kan enige tijd in beslag nemen. Bent u zeker dat u het proces nu beginnen?",
  "optimizeRunningInfo": "Optimalisatie running ...",
  "synchronizeError": "Synchronisatie mislukt! Fout: {error}",
  "synchronizeSuccess": "Synchronisatie met succes afgesloten!",
  "synchronizeInfo": "De synchronisatie proces kan enige tijd duren. <br/> <strong>Niet-opgeslagen wijzigingen zullen verloren gaan!</strong> <br/> Bent u zeker dat u het nu wilt beginnen?",
  "synchronizeRunningInfo": "Synchronisatie lopend ..."
}