{
  "bundleName": "Coordinate Finder",
  "bundleDescription": "This tool helps the user to find locations by the input of geographic coordinates.",
  "ui": {
    "invalidMessage": "Invalid coordinate format!",
    "invalidDegreeCoordinates": "Invalid coordinate format!<br /><b>Order</b>:<br />Longitude Latitude<br /><b>Format examples</b>:<br />7.628694 51.962944<br />7°38′1″ 51°58′1″",
    "invalidMetricCoordinates": "Invalid coordinate format!<br /><b>Order</b>:<br />Easting Northing<br /><b>Format examples</b>:<br />848860 6793187",
    "submitBtnTxt": "Ok",
    "toolTitle": "Find coordinates"
  }
}