{
  "bundleName": "AddThis",
  "bundleDescription": "Con AddThis gli utenti possono condividere l'applicazione map.apps in diverse reti sociali.",
  "ui": {
    "errorOnAPILoad": "AddThis disponibile!",
    "addThisAPILoader": {
      "exceptionAnn": "Impossibile caricare JavaScript API per AddThis.",
      "exceptionMsg": "Impossibile caricare JavaScript API per AddThis."
    }
  }
}