{
  "bundleName": "Omni-Suche-Konfiguration",
  "bundleDescription": "Konfigurationsbundle für das Omni-Suche Bundle.",
  "menu": {
    "title": "Omni Suche"
  },
  "widget": {
    "description": "Dieses Menü dient nur zur Konfiguration der Oberfläche der Omni Suche. Die aktivierten Suchthemen müssen Sie ggf. einzeln konfigurieren.",
    "hint": "Die Suche ist erst sichtbar, wenn mindestens ein Suchthema aktiviert ist.",
    "displayLoadingIcon": "Zeige Ladesymbol",
    "ignoreCase": "Ignoriere Groß- und Kleinschreibung",
    "autoComplete": "Autovervollständigung",
    "autoSelect": "Selektiere den hervorgehobenen Treffer in der Auswahlliste",
    "selectFirstResultOnEnter": "Selektiere ersten Treffer bei <ENTER>"
  }
}