{
  "bundleName": "Manipularea Parametru",
  "bundleDescription": "Conducerea parametru este responsabil la lansarea cererii de transfer a parametrilor de la URL-ul la componentele corespunzătoare.",
  "menu": {
    "title": "Link instrument"
  },
  "widget": {
    "description": "Configurarea instrumentul Link.",
    "showLink": {
      "title": "Vezi link",
      "tooltip": "Afișează o casetă de text care conține link-ul de parametrizate pentru vizualizarea curentă a hărții."
    },
    "showHTMLSnippet": {
      "title": "Afișare cod care poate fi introdus în pagina HTML.",
      "tooltip": "Afișare cod care poate fi introdus în pagina HTML."
    },
    "showMailToButton": {
      "title": "Afișare E-Mail buton",
      "tooltip": "Afișează un buton pentru a scrie un-mail E conține link-ul de la vizualizarea curentă a hărții."
    },
    "showRefreshButton": {
      "title": "Afiseaza butonul Actualizează",
      "tooltip": "Afișează un buton pentru a actualiza link-uri în caseta de dialog."
    },
    "showQRCode": {
      "title": "Arată QR code",
      "tooltip": "Afișează o imagine QR code."
    }
  }
}