{
  "bundleName": "Lokacija Informacije",
  "bundleDescription": "Prikaže informacije o posamezni lokaciji.",
  "ui": {
    "tools": {
      "mainActivationTool": "Lokacija Informacije",
      "activationToolExtent": "Lokacijska informacija (izbor pravokotnik)"
    },
    "result": {
      "type": "Tip",
      "adapter": "Storitev",
      "title": "Naslov",
      "detailsUrl": "Link",
      "thumbnailUrl": "Thumbnail"
    },
    "content": {
      "image": {
        "title": "Slika",
        "goToImageButton": "Pojdite na spletno stran za to sliko",
        "sendByMailButton": "E-mail to sliko",
        "detailViewButtonLabel": "Podrobnosti"
      },
      "wikipedia": {
        "title": "Wikipedia",
        "openLink": "Oglejte si celoten članek na Wikipediji"
      }
    },
    "noDataMessage": "Nismo našli nobenih predmetov."
  },
  "requestErrorMessage": "Prišlo je do napake. Storitev lahko trenutno ni na voljo."
}