{
  "bundleName": "Impresión",
  "bundleDescription": "Este paquete proporciona una herramienta de impresión para imprimir el mapa.",
  "tool": {
    "title": "Impresión",
    "tooltip": "Impresión",
    "back": "Espalda"
  },
  "resultWin": {
    "title": "Impresión"
  }
}