{
  "bundleName": "Ilmoitukset",
  "bundleDescription": "Kaikki tilan, kehityksen tai virheilmoitukset näytetään käyttäjälle pop-up viestin niin, että on selvää, mitä tapahtuu hakemuksen.",
  "ui": {
    "title": "Notifier",
    "tooltips": {
      "close": "Sulje viesti",
      "glue": "Liitä viestiin"
    }
  }
}