{
  "bundleName": "Ülevaade kaart",
  "bundleDescription": "Ülevaade Kaart annab parema orienteerituse, kasutaja näidates praegune ulatus kaart väiksem mõõtkavaga kaardil jooksul eraldatud aknas.",
  "tool": {
    "title": "Ülevaade kaart",
    "tooltip": "Kuva ülevaatlik kaart"
  }
}