{
  "bundleName": "Verktygsuppsättning Konfiguration",
  "bundleDescription": "Konfigurations bunt för verktygslådor.",
  "menu": {
    "title": "Verktygsuppsättning Konfiguration"
  },
  "widget": {
    "rootLabel": "Verktygsuppsättning",
    "addToolsetLabel": "Lägg nytt verktygsuppsättning",
    "saveToolsetLabel": "Spara verktygsuppsättning",
    "deleteToolsetLabel": "Radera verktygsuppsättning",
    "defaultToolsetTitle": "Namnlösa verktygsuppsättning",
    "unassignedToolsetTitle": "Otilldelade verktyg",
    "selectToolsetHint": "Välj en verktygslåda i listan till vänster för att konfigurera",
    "saveDeleteQuery": "Vill du verkligen radera verktygsuppsättning \"{title} '?",
    "deleteEntryLabel": "Radera post",
    "saveDeleteEntryQuery": "Vill du verkligen radera posten \"{title} '?",
    "defaultEntryTitle": "Namnlösa inträde",
    "toolset": {
      "title": "Titel",
      "tooltip": "Tooltip",
      "windowType": "Fönster typ",
      "fixed": "fast",
      "floating": "rörlig",
      "css_positioned": "CSS positionering",
      "leftCollapsed": "vänster kollapsade",
      "rightCollapsed": "höger kollapsade",
      "topCollapsed": "topp kollapsade",
      "bottomCollapsed": "botten kollapsade",
      "dropdown": "dropdown",
      "menu": "meny",
      "menubar": "menyrad",
      "menuitem": "Menyalternativ",
      "menubaritem": "Menyrad posten",
      "position": "Position",
      "top": "topp",
      "bottom": "botten",
      "left": "vänster",
      "right": "höger",
      "styleClass": "Stil klass",
      "closable": "Förslutbara",
      "maxHorizontal": "Maximalt antal verktyg i rad",
      "notitle": "Göm titel",
      "description": "<br /> Alternativen ovan kan du definiera postion och utseendet på en verktygslåda. <br /><br /> <b>Typ Window:</b> <br /> Verktygslådor kan vara ordning som följde: fast, flytande eller kollapsade på en av skärmkanterna. <br /><br /> <b>Position:</b> <br /> Den position kan definieras i förhållande till vänster eller höger, samt till den övre eller nedre skärmen sidan. Avstånden definieras som bildpunkt. Verktygslådor med typ \"fast\" eller \"flytande\" kan placeras var som helst på kartan. En kollapsad verktygsuppsättning kan bara placeras längs en skärmkanten. <br /><br /> <b>Stil Klass:</b> <br /> Om namnlisten i ett verktygsuppsättning med typ \"fast\" skall döljas, välj \"Göm titel\"."
    }
  }
}