{
  "bundleName": "Mobbli kontroll tal-livell",
  "bundleDescription": "Dan sorra jipprovdi kontrollur livell mobbli lest",
  "tool": {
    "title": "Kontenut mappa",
    "tooltip": "Ixgħel / off Kontenut Mappa"
  },
  "ui": {
    "basemaps": "Mapep Bażi",
    "operationalLayers": "Livelli Suġġetti",
    "switchUI": {
      "noTitle": "ebda titolu",
      "leftLabel": "Fuq",
      "rightLabel": "Off"
    }
  }
}