{
  "bundleName": "Τοποθεσία διαμόρφωση αναζήτηση",
  "bundleDescription": "Δέσμη ρυθμίσεων για το πακέτο αναζήτησης τοποθεσίας.",
  "menu": {
    "title": "Esri CH Τοποθεσία Finder"
  },
  "widget": {
    "description": "Ρύθμιση για την αναζήτηση θέμα Esri Τοποθεσία Finder.",
    "enabled": "Αναζήτηση θέμα ενεργός",
    "enabledTooltip": "Ενεργοποιεί το θέμα αναζήτησης για να το χρησιμοποιήσετε στην αναζήτηση Omni.",
    "defaultLabel": "Κράτησης θέσης",
    "defaultLabelTooltip": "Καθορίζει το προεπιλεγμένο κείμενο του πεδίου εισαγωγής αναζήτησης (τιμή είναι προαιρετική).",
    "pageSize": "Μέγιστη Αποτελέσματα",
    "pageSizeTooltip": "Μέγιστος αριθμός των επισκέψεων στα αποτελέσματα (εύρος: 0-100? 0 είναι απεριόριστη).",
    "typingdelay": "Καθυστέρηση [ms]",
    "typingdelayTooltip": "Παύση μεταξύ πατήματα των πλήκτρων πριν από την υποβολή του ερωτήματος (εύρος 0-1000 χιλιοστά του δευτερολέπτου)",
    "url": "URL της υπηρεσίας",
    "urlTooltip": "URL της υπηρεσίας αναζήτησης ΠΕΡΙΦΕΡΕΙΑ τελικό σημείο."
  },
  "stores": {
    "locationFinder": {
      "placeHolder": "Τοποθεσία, διεύθυνση, ένα POI ..."
    }
  }
}