{
  "bundleName": "AgolmapFinder-Config",
  "bundleDescription": "Detta paket tillhandahåller konfigurationskomponenter för AgolmapFinder bunt.",
  "menu": {
    "title": "ArcGIS Online Webmaps Finder"
  },
  "widget": {
    "description": "Konfiguration av ArcGIS Online Webmap Finder innehåll.",
    "maxNumberOfResults": {
      "title": "Maximalt antal resultat",
      "tooltip": "Definierar det maximala antalet resultat."
    },
    "webmapsID": {
      "title": "Webmaps",
      "tooltip": "Skriv det Webmap ID."
    },
    "bingMapsKey": {
      "title": "Bing webmaps",
      "tooltip": "För att ladda bingmaps, måste du definiera en bingmaps nyckel för ditt applicaiton."
    },
    "sortField": {
      "style": {
        "label": "Sortera fältalternativ",
        "tooltip": "Välj ett sorteringsfält"
      },
      "type": {
        "title": "Titel",
        "created": "Skapad den",
        "type": "Typ",
        "owner": "Ägare",
        "avgRating": "Totalbetyg",
        "numRatings": "Antal betyg",
        "numComments": "Antal kommentarer",
        "numViews": "Antal visningar",
        "tooltip": "Visar baserad på sortField"
      }
    },
    "sortOrder": {
      "style": {
        "label": "Sorteringsmetod",
        "tooltip": "Välj en sorteringsmetod"
      },
      "type": {
        "asc": "ASC",
        "desc": "DESC"
      }
    }
  }
}