{
  "bundleName": "AddThis konfigūravimas",
  "bundleDescription": "Leidžia konfigūracija AddThis pluoštus.",
  "menu": {
    "title": "AddThis - Socialiniai tinklai"
  },
  "widget": {
    "description": "Su AddThis lankytojai gali rašyti į jūsų svetainę nuorodą įvairių socialinių tinklų svetaines.",
    "addThisUrl": "URL į AddThis JavaScript API",
    "displayedElements": "Rodomos elementai",
    "compactShareButton": "kompaktiškas dalis mygtuką",
    "compactShareButtonTooltip": "Dalintis mygtukas leidžia vartotojams dalintis nuorodą į jūsų App dėl daugelio socialinių tinklų internete.",
    "bigShareButton": "Didelė dalis mygtukas",
    "bigShareButtonTooltip": "Dalintis mygtukas leidžia vartotojams dalintis nuorodą į jūsų App dėl daugelio socialinių tinklų internete.",
    "youTubeButton": "Sekite \"YouTube\"",
    "youTubeButtonTooltip": "Kai vartotojas paspaudžia šį mygtuką, jis bus perduotas į savo kanalą \"YouTube\". Savo kanalo pavadinimą, galite konfigūruoti žemiau \"vartotojo sąskaitą\".",
    "twitterButton": "Sekite Twitter",
    "twitterButtonTooltip": "Kai vartotojas paspaudžia šį mygtuką, jis bus perduotas į savo kanalą Twitter. Savo kanalo pavadinimą, galite toliau toliau skyrelyje \"Vartotojų abonementai\" configure",
    "linkedInButton": "Sekite LinkedIn",
    "linkedInButtonTooltip": "Kai vartotojas paspaudžia šį mygtuką, jis bus perduotas į savo kanalą \"LinkedIn\". Savo kanalo pavadinimą, galite toliau toliau skyrelyje \"Vartotojų abonementai\" configure",
    "userAccounts": "Vartotojų abonementai",
    "userAccountHints": "Įveskite vardą savo vartotojų sąskaitas su minėtų paslaugų. Kai vartotojas paspaudžia atitinkamą mygtuką, jis bus perduotas į savo kanalą.",
    "youTubeUser": "Pagrindinis \"YouTube\"",
    "twitterUser": "\"Twitter\"",
    "linkedInUser": "\"LinkedIn\""
  }
}