{
  "bundleName": "ArcGIS Server pentru imprimare",
  "bundleDescription": "Acest pachet oferă un instrument ArcGIS Server de imprimare.",
  "ui": {
    "button": {
      "title": "Printeaza harta curentă"
    },
    "window": {
      "title": "Ieșire de imprimare"
    },
    "error": {
      "unknown": "ArcGIS Server de imprimare: o eroare necunoscută a apărut!",
      "code403": "AGS imprimare: configurat URL-ul de serviciu de imprimare trebuie să fie în Proxys tale listă permis!",
      "code404": "AGS imprimare: Serviciul de imprimare nu a putut fi rezolvată pentru URL-ul configurat!"
    },
    "dialog": {
      "title": "Titlu",
      "format": "Format",
      "layout": "Schemă",
      "dpi": "DPI",
      "scale": "Scară Mentenanta",
      "submitBtnLabel": "Imprimare"
    },
    "imgPrintResultWidget": {
      "printBtnText": "Imprimare"
    }
  }
}