{
  "bundleName": "Domači zaslon",
  "bundleDescription": "Začetnem zaslonu se prikaže vrstica napredka, medtem ko je vloga začelo.",
  "loadTitle": "Zaženite aplikacijo \"{appName}\"",
  "loadBundle": "{percent}% - {startedBundles}/{maxBundlesToStart} - Polnjenje {name}"
}