{
  "bundleName": "Información general Mapa Configuración",
  "bundleDescription": "El paquete de configuración para el mapa general.",
  "menu": {
    "title": "Mapa resumen"
  },
  "widget": {
    "description": "Por favor, elija un servicio para el mapa general. También puede definir una capa si hay más de uno disponible.",
    "hint": "Nuevos servicios se pueden añadir en el menú \"Gestión de Servicios '.",
    "service": "Servicio de mapas",
    "layers": "Capa",
    "transparency": "Transparencia del rectángulo",
    "color": "Color del rectángulo",
    "allLayers": "Todos los disponibles",
    "expandFactor": "Expansión / factor de zoom",
    "errorMessage": "Por favor, seleccione al menos una capa!"
  }
}