{
  "bundleName": "Usmerjanje konfiguracija",
  "bundleDescription": "Konfiguracija snop za usmerjanje snopa",
  "menu": {
    "title": "Usmerjanje"
  },
  "routing": {
    "menuTitle": "Usmerjanje widget",
    "description": "Konfiguracija za usmerjanje snopa.",
    "configSections": {
      "basic": "Osnovna konfiguracija",
      "stops": "Ustavi konfiguracijo",
      "traffic": "Promet konfiguracija"
    },
    "routeTaskUrl": {
      "title": "URL za nalogo poti",
      "tooltip": "Določite storitev, ki se bodo uporabili za izračun smeri. Navodila widget uporablja Svetovne analiza omrežij kot privzeti storitev uporablja za izračun smer vožnje. To je storitev, ki temelji naročnina na voljo preko ArcGIS Online. Če imate službo za analizo omrežij ArcGIS Server, ki jo želite uporabiti za izračun smeri določite URL do te storitve."
    },
    "directionsLengthUnits": {
      "title": "Dolžina enote",
      "tooltip": "Dolžina enote. Privzeto je kilometrov.",
      "units": {
        "esriMillimeters": "mm",
        "esriCentimeters": "cm",
        "esriDecimeters": "dm",
        "esriMeters": "m",
        "esriKilometers": "km",
        "esriFeet": "ft",
        "esriInches": "v",
        "esriMiles": "mi",
        "esriNauticalMiles": "nm",
        "esriUnknownUnits": "neznano"
      }
    },
    "dragging": {
      "title": "Dovoli vlečenjem postajališč",
      "tooltip": "Omogoči vlečenje stop lokacije na zemljevidu. Ko se pravi ustavi lahko povlečete na novo lokacijo, in bo pot ponovno izračuna. Privzeta vrednost je true."
    },
    "showPrintPage": {
      "title": "Prikaži gumb natisni pot",
      "tooltip": "Izberite natisniti navodila usmerjevalnih gumb zaslon."
    },
    "showMilesKilometersOption": {
      "title": "Prikaži km kilometri Toggle",
      "tooltip": "Ko se preveri, skupina preklopni gumb omogoča uporabniku, da izbere med miljami in kilometri je prikazan"
    },
    "showTravelModesOption": {
      "title": "Pokaži \"navigacija za izbiro načina delovanja\" na",
      "tooltip": "Ko se preverja, je pokazala, preklopni gumb skupina omogoča uporabniku, da izbere načine potovanja"
    },
    "showClearButton": {
      "title": "Pokaži\"ponastavitev poti\" gumb",
      "tooltip": "Izberite, da se prikaže gumb za ponastavitev poti."
    },
    "canModifyStops": {
      "title": "Dovoli dodajanje postajališč",
      "tooltip": "Prikazati 'Dodaj Destinacijo' gumb. Ta gumb omogoča uporabnikom dodajanje dodatnih postankov."
    },
    "minStops": {
      "title": "Minimalne postajališča",
      "tooltip": "Najmanjše število postankov."
    },
    "maxStops": {
      "title": "Maksimalno ustavi",
      "tooltip": "Maksimalno število postankov."
    },
    "returnToStart": {
      "title": "Vrni se na začetek",
      "tooltip": "Ko je res, bo pot vrne na začetno točko."
    },
    "showReturnToStartOption": {
      "title": "Prikaži vrnitev na začetek možnost",
      "tooltip": "Ko je res, je prikazan Nazaj na začetek možnost."
    },
    "traffic": {
      "title": "Uporabiti podatke o prometu",
      "tooltip": "Če so podatki v realnem času prometne pri izračunu poti se uporablja?"
    },
    "showTrafficOption": {
      "title": "Možnost Prikaži promet",
      "tooltip": "Prikaže podatke o prometu za uporabo možnost."
    }
  },
  "template": {
    "description": "Konfiguracija za predlogo usmerjanje izpisa.",
    "menuTitle": "Usmerjanje predlogo print",
    "titleText": {
      "title": "Naslov besedilo",
      "tooltip": "Nastavite naslov, ki se pojavi na vrhu usmerjevalno izpisa.",
      "defaultText": "Moja pot"
    },
    "logoImageUrl": {
      "title": "URL slike",
      "tooltip": "URL slike za logotip na izpisu poti."
    },
    "customStyleSheet": {
      "title": "URL za lastno slogovne",
      "tooltip": "URL za slogovne po meri, ki se uporablja za usmerjanje izpisa."
    },
    "showMap": {
      "title": "Prikaži zemljevid",
      "tooltip": "Dodatna zemljevidu izračunane poti se doda izpisu."
    },
    "showSummary": {
      "title": "Pokaži usmerjanju povzetek",
      "tooltip": "Povzetek bo pokazal, razdaljo in čas izračunani poti."
    },
    "showNotes": {
      "title": "Prikaži uporabniške opombe",
      "tooltip": "Dovoli uporabniku, da dodate opombe k usmerjanju izpis."
    },
    "footerText": {
      "title": "Noga",
      "tooltip": "Dodaj besedilo po meri, da se prikaže na dnu strani za usmerjanje izpisa.",
      "defaultText": "Navodila so na voljo le za namene načrtovanja in za katere veljajo <a href='http://www.esri.com/legal/software-license' target='_blank'>pogoji za ESRI uporabe</a> . Dinamične razmere na cesti, da lahko obstajajo vzrok natančnost razlikujejo od vaših navodilih in jih je treba upoštevati skupaj z znaki in zakonskimi omejitvami. Prevzeti vsa tveganja uporabe."
    }
  }
}