{
  "bundleName": "Geonames - Konfiguracija",
  "bundleDescription": "Snop konfiguracija geonames svežnju.",
  "menu": {
    "geonames": {
      "title": "Geonames",
      "description": "Izberi trgovino Geonames"
    },
    "wikipedia": {
      "title": "Wikipedia"
    },
    "poi": {
      "title": "Zanimivosti"
    },
    "postalcodes": {
      "title": "Poštna številka"
    }
  },
  "common": {
    "enabled": "Iskanje tema aktivna",
    "enabledTooltip": "Omogoči temo iskanje, da jo uporabljajo pri iskanju Omni.",
    "defaultLabel": "Ograda",
    "defaultLabelTooltip": "Določa privzeto besedilo polja za vnos iskanja (vrednost je opcija).",
    "pageSize": "Najvišji Rezultati",
    "pageSizeTooltip": "Največje število zadetkov v rezultatih (območje: 0-100; 0 je neomejena).",
    "typingdelay": "Zamudo [ms]",
    "typingdelayTooltip": "Premor med ključnimi stiskalnice, preden se predložijo poizvedbe (razpon 0-1000 milisekund)",
    "languageAware": "Jezikovne ozaveščeni rezultati",
    "languageAwareTooltip": "Jezik, uporabljen v map.apps se uporablja za pridobivanje lokalizirane rezultate.",
    "url": "URL storitve",
    "urlTooltip": "URL REST končne iskanje službe.",
    "username": "Geonames uporabniško ime",
    "usernameTooltip": "Ime osebnega geonames račun."
  },
  "wikipediaWidget": {
    "description": "Konfiguriranje iskanja temo Wikipedia."
  },
  "poiWidget": {
    "description": "Konfiguracija za točk iskalni Obresti trgovini."
  },
  "postalcodesWidget": {
    "description": "Konfiguracija poštnega iskalni koda temo.",
    "countries": "Država filter",
    "countriesTooltip": "Koda države filtrirati rezultate, na primer. \"DE\" (vrednost je opcija)."
  },
  "stores": {
    "postalcodes": {
      "placeHolder": "Vnesite poštno številko ali ime kraja ..."
    },
    "wikipedia": {
      "placeHolder": "Vnesite izraz za iskanje ..."
    },
    "poi": {
      "placeHolder": "Točko o interesu ..."
    }
  }
}