{
  "bundleName": "Mjerni alat zatim",
  "bundleDescription": "Konfiguracija paket za mjerenje alata paketu.",
  "menu": {
    "title": "Mjerni alati"
  },
  "widget": {
    "description": "Konfiguracija mjerne alate.",
    "finishWithButton": {
      "title": "Zaustavite mjerenje klikom na gumb",
      "tooltip": "Ako je omogućeno, prikazuje se gumb za dovršavanje crteža. Inače dvostruki klik završi crtež."
    },
    "showTools": {
      "area": "Alat za mjerenje predstava područje",
      "distance": "Pokaži mjerenje udaljenosti alat",
      "location": "Pokaži mjerenje location alat"
    },
    "defaultTool": {
      "title": "Zadana omogućen alat",
      "none": "Nijedan",
      "area": "Područje",
      "distance": "Udaljenost",
      "location": "Položaj"
    },
    "defaultAreaUnit": {
      "title": "Zadana jedinici površine",
      "ACRES": "Acres",
      "SQUARE_MILES": "Četvornih kilometara",
      "SQUARE_KILOMETERS": "Četvornih kilometara",
      "HECTARES": "Ha",
      "SQUARE_YARDS": "Trg dvorište",
      "SQUARE_FEET": "Četvornih metara",
      "SQUARE_METERS": "Četvornom metru"
    },
    "defaultLengthUnit": {
      "title": "Zadana duljina jedinica",
      "MILES": "Milja",
      "KILOMETERS": "Kilometar",
      "FEET": "Noga",
      "METERS": "Metar",
      "YARDS": "Dvorište",
      "NAUTICAL_MILES": "Nautičkih milja"
    },
    "defaultLocationUnit": {
      "title": "Standardna jedinica koordinate",
      "DECIMAL_DEGREES": "Stupnjevi",
      "DEGREE_MINUTE_SECONDS": "DMS"
    }
  }
}