{
  "bundleName": "JoinAddress",
  "bundleDescription": "Ovaj paket pruža provedbe za JoinAddress poslužitelja.",
  "store": {
    "name": "JoinAddress pretraživanje",
    "description": "Spremite za JoinAddress usluge pretraživanja",
    "placeHolder": "Ime grada ili poštanski broj",
    "fields": {
      "ID": "Id",
      "LNGCODE": "Jezik kod",
      "ZIP": "Poštanski broj",
      "CITY": "Grad",
      "ZIPNAME": "Postal ime",
      "ADMCODE": "Upravni ključ",
      "XCOOR": "X",
      "YCOOR": "Y",
      "COQ": "Koordinatni kvalitete",
      "SMLCITY": "Sličnost imena grada",
      "SMLZIPNAME": "Sličnost poštanska ime"
    }
  }
}