{
  "bundleName": "Tło mapy Galeria",
  "bundleDescription": "Użytkownik może wybrać kartę do dalszego wykorzystania jako mapie tle z listy dostępnych map tle.",
  "ui": {
    "title": "Tło mapy Galeria"
  },
  "tool": {
    "title": "Galeria",
    "tooltip": "Galeria"
  }
}