{
  "bundleName": "Locate Me konfiguracijo",
  "bundleDescription": "Konfiguracija snop za LocateMe svežnju.",
  "menu": {
    "title": "LocateMe"
  },
  "widget": {
    "description": "Konfiguracija funkcije lokalizacije.",
    "showPositionLogs": {
      "title": "Omogoči položaja dnevniki",
      "tooltip": "Če je možnost omogočena, boste obveščeni o novih posodobitvah lokacijskih"
    }
  }
}