{
  "bundleName": "Configuration de Content Viewer",
  "bundleDescription": "Cet ensemble fournit des moyens pour configurer le contenu spectateur.",
  "menu": {
    "title": "Content Viewer"
  },
  "widget": {
    "window": {
      "title": "Nom",
      "saveDeleteQuery": "Voulez-vous vraiment supprimer '{number}' article (s)?",
      "editContentDefinitionTitle": "Modifier la définition de contenu",
      "newContentDefinitionTitle": "Créer nouvelle définition contenu"
    },
    "wizard": {
      "storePaneTitle": "Avec une visionneuse de contenu, vous définissez dont le contenu se affiche lorsque vous cliquez sur un résultat de recherche ou un élément sur la carte. Par conséquent, se il vous plaît choisir un Recherche- / sujet de sélection et / ou un noeud carte modèle. <br /><br /> Nouveaux sujets Recherche- / de sélection peuvent être ajoutés sous la rubrique «Search & Selection 'dans le menu principal. Les entrées dans la liste des nœuds carte modèle correspondent aux couches cartographiques simples qui sont utilisés dans cette application (voir «contenu» dans le menu principal). <br /><br /> <b>Attention:</b> Se il vous plaît ne sélectionner qu'une valeur à la fois dans la liste en même temps, si le match des services correspondants.",
      "storeSelect": "Recherche / sujet de sélection",
      "storeSelectTooltip": "Sélectionnez une recherche / sujet de sélection",
      "mapModelNodeSelect": "Carte contenu",
      "mapModelNodeSelectTooltip": "Se il vous plaît sélectionner un contenu de la carte",
      "noStoreLabel": "Pas de recherche / sujet de sélection",
      "noMapModelNodeLabel": "Pas de carte de contenu",
      "typePaneTitle": "Se il vous plaît entrez un nom pour cet affichage info (cela ne est nécessaire pour gérer la fenêtre de configuration utilisé en direct), et sélectionnez si l'information doit avoir un affichage compact et / ou vue détaillée.",
      "typeTitle": "Titre",
      "typeTitleTooltip": "Définir un titre pour ce contenu spectateur.",
      "typeLayoutAttr": "Choisissez la mise en page",
      "typelayoutAttrTooltip": "Sélectionnez la disposition (table ou ajusté)",
      "typeGrid": "Présentation en tableau",
      "typeCustom": "mise en page personnalisée",
      "typeAttachment": "Appendice",
      "typeCompactView": "Compacte spectateur",
      "typeCompactViewTooltip": "Sélectionnez si vous souhaitez utiliser le spectateur compacte",
      "typeFullView": "Voir les détails",
      "typeFullViewTooltip": "Sélectionner pour utiliser la vue de détail",
      "layoutPaneTitle": "Se il vous plaît choisir la mise en page pour le spectateur (s)",
      "layoutDefaultValue": "Valeur par défaut",
      "layoutDefaultValueTooltip": "Cette valeur est utilisée lorsque l'objet sélectionné n'a pas de valeur pour l'attribut souhaité.",
      "layoutSettingsCompactViewer": "<b>Réglages pour le spectateur compacte</b>",
      "layoutCompactWindowTitle": "Titre de la fenêtre",
      "layoutCompactWindowTitleTooltip": "Titre de la fenêtre de la visionneuse compact. Il est possible d'utiliser des espaces réservés pour les champs. Les variables suivantes sont disponibles: ${fields}.",
      "layoutCompactWindowWidth": "Largeur de la fenêtre",
      "layoutCompactWindowWidthTooltip": "Largeur de la fenêtre de la visionneuse compacte [Pixel]",
      "layoutCompactWindowHeight": "Hauteur de la fenêtre",
      "layoutCompactWindowHeightTooltip": "Hauteur de la fenêtre de visualisation compacte [Pixel]",
      "layoutSettingsFullViewer": "<b>Paramètres de la vue de détail</b>",
      "layoutFullWindowTitle": "Titre de la fenêtre",
      "layoutFullWindowTitleTooltip": "Titre de la fenêtre de détail spectateur. Il est possible d'utiliser des espaces réservés pour les champs. Les variables suivantes sont disponibles: ${fields}.",
      "gridPaneTitle": "Réglages pour la disposition de table",
      "gridFieldName": "Domaine",
      "gridAllow": "Spectacle",
      "gridAllowTooltip": "Sélectionnez si ce champ est affiché dans le tableau",
      "attachmentPanel": "Aucun ajustements nécessaires",
      "editor": {
        "plugin": {
          "PlaceHolder": {
            "label": "Ajouter espace réservé"
          }
        }
      },
      "noStores": "Aucun des sujets de recherche / sélection trouvé!",
      "noStore": "Aucun sujet de recherche / sélection trouvé!",
      "fieldsError": "Lors de l'interrogation des métadonnées a été une erreur (message d'erreur: ${msg})!",
      "noErrorSpecified": "Non un message d'erreur détaillé disponible!",
      "noContextQuery": "Ce sujet Recherche- / de sélection ne est pas de définir une requête de contexte. Il doit être modifié manuellement."
    },
    "grid": {
      "removeContentTool": "Retirer définition contenu",
      "addContentTool": "Ajouter nouvelle définition contenu",
      "title": "Titre",
      "dataView": {
        "noDataFound": "Aucune définition de content trouvé ...",
        "pager": {
          "pageSizeLabelText": "Contenu définition ${pageStartItemNumber} - ${pageEndItemNumber} de ${itemCount}",
          "pageLabelText": "Page ${currentPage} de ${endPage}",
          "backButtonTooltip": "Page précédente",
          "forwardButtonTooltip": "Page suivante",
          "firstButtonTooltip": "Première page",
          "lastButtonTooltip": "Dernière page"
        },
        "filter": {
          "menuDefaultLabel": "Tous",
          "textBoxPlaceHolder": ""
        }
      }
    }
  }
}