{
  "bundleName": "Vadība logs",
  "bundleDescription": "--Pagrindinė funkcija-- Logu pārvaldnieks ir atbildīgs par visas dialoglogu.",
  "ui": {
    "defaultWindowTitle": "Logs",
    "closeBtn": {
      "title": "Aizvērt"
    },
    "minimizeBtn": {
      "title": "Minimizēt"
    },
    "maximizeBtn": {
      "title": "Maksimizēt"
    },
    "restoreBtn": {
      "title": "Atjaunot"
    },
    "opacityBtn": {
      "title": "Mainīt pārredzamība"
    },
    "collapseBtn": {
      "title": "Slēpt saturs"
    },
    "loading": {
      "title": "Lūdzu, uzgaidiet!",
      "message": "Iekraušana ..."
    },
    "okcancel": {
      "title": "Jautājums",
      "okButton": "Labi",
      "cancelButton": "Atcelt"
    }
  }
}