{
  "bundleName": "Tool Rules",
  "bundleDescription": "With Tool Rules each tool can be specified as context sensitive. A tool can be shown depending on the current map scale or the activated map service."
}