{
  "bundleName": "Locate Me",
  "bundleDescription": "Un utilizator poate afișa locația lui curentă (analizate prin GPS și / sau adresa IP) în hartă.",
  "ui": {
    "tools": {
      "locatemeTool": {
        "title": "Localiza",
        "tooltip": "Afișează locația curentă pe hartă."
      }
    }
  },
  "infos": {
    "newLoc": {
      "ann": "Poziția nou cu ${acc} ${unit} determină precizie.",
      "msg": "Poziția nou cu ${acc} ${unit} determină precizie."
    }
  },
  "exceptions": {
    "noGeoLoc": {
      "ann": "Nu Locul de amplasare disponibile",
      "msg": "Browser-ul dvs. nu acceptă localizare."
    },
    "posDen": {
      "ann": "Sediu negat",
      "msg": "Sediu negat de browser"
    },
    "posNotAv": {
      "ann": "Poziția nu este disponibil",
      "msg": "Poziția nu este disponibil"
    },
    "timeout": {
      "ann": "Pauză în timpul localizare",
      "msg": "În localizarea timpul a fost depășit."
    },
    "unknown": {
      "ann": "Poziția nu este disponibil",
      "msg": "Poziția nu este disponibil, o eroare necunoscută a apărut"
    },
    "acc": {
      "ann": "Acuratețe Poziția prea mic",
      "msg": "Poziția nu este suficient de precisă pentru a afișa"
    }
  }
}