{
  "bundleName": "Izbor",
  "bundleDescription": "Zagotavlja orodja za izbiro predmetov v podatkovnih virov",
  "ui": {
    "tools": {
      "mainActivationTool": "Izberite",
      "activationToolExtent": "Izberite prek pravokotnik"
    },
    "noDataMessage": "Nismo našli nobenih predmetov."
  }
}