{
  "bundleName": "ArcGIS for Server Printing",
  "bundleDescription": "Este pacote fornece uma ferramenta de impressão ArcGIS Server.",
  "menu": {
    "title": "ArcGIS for Server Printing"
  },
  "widget": {
    "description": "Configuração para a funcionalidade de impressão AGS.",
    "hint": "Esta funcionalidade está disponível apenas com o ArcGIS Server 10.1 ou versão superior, o que proporciona uma Exportação Web Map Task.",
    "url": {
      "title": "URL para ArcGIS Server tarefas de impressão",
      "tooltip": "AGS URL para imprimir serviço."
    },
    "directDownload": {
      "title": "Descargár directamente",
      "tooltip": "Baixa o resultado da impressão diretamente, em vez de abri-lo em uma janela."
    }
  }
}