{
  "bundleName": "Web Map",
  "bundleDescription": "See kimp saadetised Web Map kui selle id lisatakse url parameeter.",
  "errorMessage": "Laadimisel Web Map ID \"${webmapid}\" tõrge. Sõnum: ${errorMsg}"
}