{
  "bundleName": "Mapa Desk",
  "bundleDescription": "El Mapa Desk es un espacio universal de presentar cualquier tipo de objetos que son visibles en la pantalla map.apps (como barras de herramientas y ventanas).",
  "ui": {
    "title": "Mapa Desk"
  }
}