{
  "bundleName": "Tööriistakomplekt",
  "bundleDescription": "Kõik vahendid, mis on kättesaadavad kasutaja on paigutatud Tööriistakomplektid. Konfiguratsiooni iga tööriistakomplekt määratleb, millised vahendid on lisatud."
}