{
  "bundleName": "Configuratie bewerken",
  "bundleDescription": "Configuratie bundel voor het bewerken bundel.",
  "title": "Editing",
  "description": "Geef de instellingen op om de bewerking van geo-objecten.",
  "hint": "Om de bewerkingsmogelijkheden ten minste één kenmerk diensten moeten worden gemarkeerd als bewerkbare gebruiken.",
  "widget": {
    "snapping": {
      "menuTitle": "Snapping",
      "description": "Stel de capture eigenschappen.",
      "hint": "Na het wijzigen van eigenschappen moet de actieve bewerkingsgereedschappen activeren.",
      "componentEnabled": {
        "title": "Mogelijk  Snapping",
        "tooltip": "Volledig aan / uit snapping."
      },
      "alwaysSnap": {
        "title": "Begin altijd",
        "tooltip": "Wanneer ingeschakeld snapping is altijd actief. Anders de snapping sleutel worden gebruikt."
      },
      "tolerance": {
        "title": "Tolerantie [px]",
        "tooltip": "De tolerantie voor snapping in pixels."
      }
    },
    "tools": {
      "menuTitle": "Gereedschappen bewerken",
      "description": "Selecteer de beschikbare editing tools.",
      "DefaultCreateFeatureTool": {
        "title": "Maak een nieuwe geo-objecten",
        "tooltip": "Enable / Disable tool voor het creëren van nieuwe functies."
      },
      "DeleteFeatureTool": {
        "title": "Duidelijke geo-objecten",
        "tooltip": "Enable / Disable tool voor het verwijderen van functies."
      },
      "DefaultEditFeatureTool": {
        "title": "Geo-objecten bewerken",
        "tooltip": "Enable / Disable tool voor bewerkingsfuncties."
      }
    },
    "editmodes": {
      "menuTitle": "Geo-objecten bewerken",
      "description": "Bewerkbare eigenschappen van geo-objecten.",
      "editAttributes": {
        "title": "Attributen zijn bewerkbare",
        "tooltip": "Schakel aan / uit om het bewerken van attributen van geoobjects / verbod toe te staan."
      },
      "editGeometry": {
        "title": "Geometrieën zijn bewerkbaar",
        "tooltip": "Inschakelen / uitschakelen, zodat / verbieden het bewerken van de geometrie van een feature."
      }
    },
    "createmodes": {
      "menuTitle": "Het creëren van geo-objecten",
      "description": "Procedure voor het opstellen van geo-objecten.",
      "persistAfterFeatureDrawn": {
        "title": "Spaar geo-objecten direct na het tekenen",
        "tooltip": "Wanneer ingeschakeld, wordt een ondertekende geo-objecten opgeslagen onmiddellijk na afronding van het tekenproces, anders na het klikken op Opslaan."
      },
      "disableDrawToolAfterCreation": {
        "title": "Uitschakelen tekengereedschap na de schepping",
        "tooltip": "Toen controleerde de tool voor het creëren van functies wordt gedeactiveerd na het opslaan van de functie. Anders blijft actief."
      }
    },
    "attachments": {
      "menuTitle": "Toebehoren",
      "description": "Configureren ondersteuning voor bijlagen.",
      "hint": "Bijlagen zijn alleen beschikbaar als geconfigureerd in functie server! <br/> Na het wijzigen van eigenschappen moet de actieve bewerkingsgereedschappen activeren.",
      "enable": {
        "title": "Bijlagen toestaan",
        "tooltip": "Wanneer ingeschakeld, is het mogelijk om bijlagen voor bestaande geo-objecten te uploaden. Dit is alleen mogelijk als de functie de functie is geconfigureerd."
      }
    }
  }
}