{
  "bundleName": "AGOL Webmap Suche",
  "bundleDescription": "Dieses Bundles sucht nach verfügbaren Online Webmaps in ArcGIS Online.",
  "errorMessage": "Beim Laden der Web Map mit ID '${webmapid}' ist ein Fehler aufgetreten. Nachricht: ${errorMsg}",
  "nodata": "Die Suche ergab keine Ergebnisse.",
  "store": {
    "title": "ArcGIS Online Web Map",
    "description": "Suche in ArcGIS Online Web Maps"
  },
  "tool": {
    "title": "ArcGIS Online Suche",
    "tooltip": "ArcGIS Online Suche"
  },
  "ui": {
    "id": "ID",
    "searchButtonLabel": "Suche starten",
    "title": "Titel",
    "owner": "Verfasser",
    "tags": "Schlagwort",
    "description": "Gruppenbeschreibung",
    "image": "Bild",
    "snippet": "Beschreibung (Auszug)",
    "created": "Erstellt am",
    "from": "Von",
    "to": "Bis",
    "omnisearch": "Nach AGOL Webmaps suchen",
    "dataView": {
      "gridViewBtn": "Tabelle",
      "iconViewBtn": "Symbol",
      "filter": {
        "menuDefaultLabel": "Alle",
        "textBoxPlaceHolder": ""
      },
      "pager": {
        "backButtonText": "<",
        "backButtonTooltip": "Zurück",
        "forwardButtonText": ">",
        "forwardButtonTooltip": "Weiter",
        "firstButtonText": "<<",
        "firstButtonTooltip": "Erste Seite",
        "lastButtonText": ">>",
        "lastButtonTooltip": "Letzte Seite",
        "pageLabelText": "Seite ${currentPage} von ${endPage}",
        "pageSizeLabelText": "Element ${pageStartItemNumber}-${pageEndItemNumber} von ${itemCount}",
        "zeroResultsText": "Keine Elemente"
      }
    }
  }
}