{
  "bundleName": "Carte Assistant de configuration Empaqueter",
  "bundleDescription": "Le Plan paquet gère la carte principale et toutes les informations de carte de contenu. Le client les services utilisés dans un modèle hiérarchique de la carte de sorte qu'ils peuvent être affichées de différentes façons à l'utilisateur peut abstrait.",
  "menu": {
    "mapstate": {
      "title": "Carte étendue"
    },
    "mapmodel": {
      "title": "Carte contenu"
    },
    "mrrbuilder": {
      "title": "Gestionnaire des services"
    },
    "mapoptions": {
      "title": "Options Carte"
    }
  },
  "commonDelete": {
    "saveQuery": "Voulez-vous vraiment supprimer {number} 'article (s)? Se il vous plaît noter: Le système peut devenir incompatible si vous supprimez les services référencés par d'autres composants <b>Actuellement aucun des contrôles cohérents sont effectuées!</b>",
    "error": "Suppression d'éléments '{items}' a échoué!",
    "partialSuccess": "Certains éléments ne peuvent pas être supprimés!",
    "errorFinish": "Aucun élément a été supprimée!",
    "success": "L'opération d'effacement complété avec succès!"
  },
  "serviceDetails": {
    "windowTitle": "Service '{id}'",
    "newServiceId": "Nouveau",
    "url": "URL:",
    "urltooltip": "Se il vous plaît entrer dans la fonction exacte critère url ici! par exemple http://services.arcgisonline.com/ArcGIS/rest/services/World_Topo_Map/MapServer",
    "title": "Titre:",
    "titletooltip": "Se il vous plaît entrez un titre pour le service",
    "description": "Description:",
    "descriptiontooltip": "Se il vous plaît entrer une description pour le service",
    "type": "Type:",
    "typetooltip": "Se il vous plaît choisir le type de service valide",
    "layer": "Couche:",
    "layertooltip": "Ici vous pouvez entrer les métadonnées de la couche du service, structuré comme: <pre> [{\n  \"id\": \"0\",\n  \"title\": \"My Layer\"\n}, ...] </pre>",
    "options": "Options:",
    "optionstooltip": "<p> Ici vous pouvez entrer des options spéciales pour la construction de services, structuré comme: <pre> {\n  \"optionName\": \"optionValue\",\n  ...\n} </pre></p><p> Par exemple, l'opacité d'un service peut être configuré comme suit: <pre> {\n  «opacity»: 0,5\n} </pre></p>",
    "fetchMetadata": "Chercher Métadonnées",
    "fetchMetadatatooltip": "Cliquez dessus pour aller chercher les métadonnées de configuration de l'URL. Se il vous plaît noter que toutes les métadonnées entré sera remplacée par les données fournies par le service!",
    "fetchMetadataDesc": "Cela fonctionne pour de la AGS_DYNAMIC 'services types,' AGS_FEATURE »et« AGS_TILED '. Néanmoins, d'autres types de services peuvent être ajoutés manuellement à ce formulaire.",
    "fetchError": "Connexion au service '{url}' a échoué! {error}",
    "updateError": "Mise à jour du service '{id}' a échoué! {error}",
    "updateSuccess": "Service '{id}' mis à jour avec succès!"
  },
  "mrrBuilderWidget": {
    "createNewTitle": "Crée un nouveau noeud",
    "removeServiceTool": "Supprimer les services",
    "addServiceTool": "Ajouter nouveau service",
    "dataView": {
      "filter": {
        "menuDefaultLabel": "[Tous]",
        "textBoxPlaceHolder": ""
      },
      "noDataFound": "Aucun service disponible ...",
      "pager": {
        "pageLabelText": "Page ${currentPage} de ${endPage}",
        "backButtonTooltip": "Page précédente",
        "forwardButtonTooltip": "Page suivante",
        "firstButtonTooltip": "Première page",
        "lastButtonTooltip": "Dernière page",
        "pageSizeLabelText": "Résultats ${pageStartItemNumber} - ${pageEndItemNumber} de ${itemCount}"
      }
    },
    "categories": {
      "id": "Nom",
      "title": "Titre",
      "serviceUrl": "URL",
      "serviceType": "Type"
    }
  },
  "mapModelBuilderWidget": {
    "description": "Dans cette fenêtre, les cartes ensemble Cette application peut être définis couches thématiques et de fond. Sur le côté gauche de tous les services disponibles sont affichées. Ceux-ci peuvent être glissés et déposés dans les plaines au milieu.",
    "hint": "De nouveaux services peuvent être ajoutés en utilisant le menu \"Gestionnaire des services '.",
    "categoryDescription": "Description:",
    "categoryDescriptionTooltip": "Description du service",
    "categoryTitle": "Titre:",
    "categoryTitleTooltip": "Titre du service",
    "imageUrl": "URL de l'image Map Flow:",
    "imageUrlTooltip": "URL de l'image Map Flow (taille: 267x159 px, formats: jpg, png, gif)",
    "defaultEnabled": "Catégorie activé au démarrage:",
    "defaultEnabledTooltip": "Vérifiez Service Set être activé au démarrage de l'application.",
    "detailsPaneTitle": "Paramètres de service Change <b>'{category.title}'</b>",
    "detailsPaneService": "Basé sur le service <b>'{service}'</b>",
    "transparencySlider": "Transparence:",
    "mapFlowPaneTitle": "<b>Paramètres de la Map Flow</b> <br /> Si vous utilisez une carte de débit, vous pouvez définir les propriétés (description et image) dans la section ci-dessous.",
    "detailsHint": "Sélectionnez noeud pour définir les détails ...",
    "servicesHint": "Faites glisser un service ici ...",
    "servicesTitle": "Services",
    "detailsTitle": "Détails",
    "operationalLayer": "Couche opérationnelle",
    "baseLayer": "Couche de base",
    "chooseLayers": "Choisissez les couches doivent être inclus dans le service et se ils doivent être visibles au départ.",
    "layerHead": "<b>Couche</b>",
    "layerVisibleHead": "<b>Initiale visible</b>",
    "layerVisibleTooltip": "Vérifiez définir état ​​visible initiale de la couche <b>'{title}'.</b>",
    "layerIncludeHead": "<b>Inclure</b>",
    "layerIncludeTooltip": "Cocher pour inclure couche <b>'{title}'.</b>",
    "editable": "Modifiable",
    "editableTooltip": "Vérifiez pour permettre l'édition sur ce service"
  },
  "mapStateWidget": {
    "description": "La carte mesure définit la zone visible d'une carte. Se il vous plaît choisir une méthode pour définir la carte initiale mesure.",
    "checkBoxApplyMainMapState": "Ajustez la carte mesure par déplacement de la carte principale",
    "setExtentManually": "Saisir manuellement les valeurs de la carte mesure",
    "spatialReference": "Système de référence spatiale:",
    "errorMessage": "Se il vous plaît vérifier les coordonnées!"
  },
  "mapOptionsWidget": {
    "description": "Avec les paramètres suivants différentes options de carte peuvent être définis.",
    "slider": {
      "label": "Afficher curseur de zoom",
      "tooltip": "Afficher un curseur de zoom sur la carte"
    },
    "sliderStyle": {
      "label": "Style curseur de zoom",
      "tooltip": "Utiliser une petite ou zoom par défaut curseur",
      "type": {
        "small": "petit",
        "large": "grand"
      }
    },
    "nav": {
      "label": "Afficher flèches de navigation",
      "tooltip": "Définit si les flèches de navigation sont affichées dans les coins de la carte."
    },
    "logo": {
      "label": "Afficher \"powered-by\" logo",
      "tooltip": "Définit, si le \"powered-by\" logo est affiché sur la carte."
    },
    "doubleClickZoom": {
      "label": "Permettre de zoomer sur les double-clic",
      "tooltip": "Définit, si le zoom est possible par un double clic."
    },
    "clickRecenter": {
      "label": "Center en appuyant sur [Maj] + clic",
      "tooltip": "Définit si le recentrage de la carte est autorisé en appuyant sur [Maj] et clic de souris."
    },
    "keyboardNavigation": {
      "label": "Autoriser la navigation au clavier",
      "tooltip": "Définit si la navigation au clavier est autorisé."
    },
    "scrollWheelZoom": {
      "label": "Permettre de zoomer par molette de la souris",
      "tooltip": "Définit, si le zoom par molette de la souris est autorisée."
    },
    "sliderPosition": {
      "label": "Position du curseur de zoom",
      "tooltip": "La position du curseur de zoom (\"en haut à gauche\", \"en haut à droite\", \"en bas à droite\" ou \"en bas à gauche\")",
      "position": {
        "topLeft": "en haut à gauche",
        "topRight": "en haut à droite",
        "bottomLeft": "en bas à gauche",
        "bottomRight": "en bas à droite"
      }
    },
    "displayGraphicsOnPan": {
      "label": "Voir les graphiques tout en panoramique",
      "tooltip": "Lorsqu'elle est activée, les graphiques se affichent lorsque vous déplacez la carte. La désactivation de cette option peut améliorer les performances lorsque Internet Explorer."
    },
    "navigationMode": {
      "label": "Mode Navigation",
      "tooltip": "Indique si la carte utilise transformations CSS3 quand panoramique et de zoom (si supporté par le navigateur).",
      "csstransform": "CSS-transformées",
      "classic": "classique"
    },
    "fadeOnZoom": {
      "label": "Fondu sur zoom",
      "tooltip": "Lorsqu'elle est activée, les couches sont superposées soutenues pendant le zoom. Actuellement, ce est uniquement pris en charge pour la couche carrelage et le mode de navigation doivent être réglés sur «css-transformer» Loi."
    },
    "showAttribution": {
      "label": "Afficher des informations sur le droit d'auteur",
      "tooltip": "Se il est activé, l'information de copyright est affiché sur les couches affichées dans la carte."
    },
    "sliderOrientation": {
      "label": "Orientation du curseur de zoom",
      "tooltip": "Définit l'alignement du curseur de zoom («verticale» ou «horizontale»).",
      "show": "Spectacle",
      "hide": "cacher",
      "orientation": {
        "horizontal": "horizontal",
        "vertical": "vertical"
      }
    },
    "sliderLabels": {
      "label": "Afficher les étiquettes zoom curseur",
      "tooltip": "Définit si les étiquettes sont présentés à côté du curseur de zoom. (Fonctionne uniquement avec les «grands» curseur.)",
      "labels": {
        "country": "Pays",
        "region": "Région",
        "town": "Ville"
      }
    }
  }
}