{
  "bundleName": "Zasady na narzędzia",
  "bundleDescription": "Z regulaminu narzędzi każde narzędzie może być określony jako kontekstu. Narzędzie może być pokazana w zależności od aktualnej skali mapy lub aktywowany usługi lokalizacyjnej."
}