{
  "bundleName": "Bala upravljanje",
  "bundleDescription": "Pruža sučelja za upravljanje bala",
  "commonDelete": {
    "saveQuery": "Da li stvarno želite obrisati '{number}' predmet (e)?",
    "error": "Brisanje stavki '{items}' nije uspjelo!",
    "partialSuccess": "Neki predmeti nisu mogli biti izbrisani!",
    "errorFinish": "Ne predmeti je izbrisan!",
    "success": "Operacija izbrisati uspješno završila!"
  },
  "bundleListTool": {
    "title": "Skupovi",
    "desc": "Popis Skupovi"
  },
  "removeSelectedBundlesTool": {
    "title": "Izbrisati",
    "desc": "Brisanje snop"
  },
  "createBundleTool": {
    "title": "Postavi",
    "desc": "Upload Skupovi"
  },
  "dataViewCommon": {
    "filter": {
      "menuDefaultLabel": "Sve",
      "textBoxPlaceHolder": ""
    },
    "pager": {
      "backButtonTooltip": "Prethodna stranica",
      "forwardButtonTooltip": "Sljedeća stranica",
      "firstButtonTooltip": "Prva stranica",
      "lastButtonTooltip": "Posljednja stranica",
      "pageLabeltext": "Stranica:",
      "pageSizeLabelText": "Rezultati ${pageStartItemNumber}-${pageEndItemNumber} od ${itemCount}",
      "pageLabelText": "Stranica:"
    }
  },
  "bundlesView": {
    "noDataMessage": "Nema dostupnih pakete ...",
    "name": "Naziv",
    "version": "Verzija",
    "title": "Naslov",
    "desc": "Opis",
    "modifiedBy": "Izmijenio",
    "modifiedAt": "Promjena na"
  },
  "bundleDetailsView": {
    "windowTitle": "Bundle '{id}'",
    "createWindowTitle": "Upload Skupovi",
    "name": "Naziv",
    "version": "Verzija",
    "dependencies": "Ovisnosti:",
    "main": "Glavni file:",
    "layer": "Sloj file:",
    "location": "Mjesto:",
    "title": "Naslov:",
    "description": "Opis:",
    "createdAt": "Kreirano:",
    "createdBy": "Izradio:",
    "modifiedAt": "Promjena na",
    "modifiedBy": "Izmijenio",
    "id": "ID:",
    "upload": "Postavi",
    "uploaded": "100% - snopovi su izvađeni i uvozi",
    "updateError": "Snop '{id}' ne može biti spašen! {error}",
    "updateSuccess": "Snop '{id}' uspješno spremljen!",
    "uploadStart": "Postavi rada!",
    "uploadError": "Postavi pogrešku:",
    "uploadFinished": "Prijenos je dovršen!",
    "createBundleInfo": "<strong>Prenesite svoje pakete</strong> <br/><ul><li> Dopušteno su zip ili JAR datoteka </li><li> Datoteka može sadržavati više pakete. </li></ul>",
    "panelDefaultTitle": "<strong>Opće informacije</strong>",
    "panelExtendedTitle": "<strong>Proširena informacije</strong>",
    "panelJsonInfoTitle": "<strong>package.json</strong>"
  }
}