{
  "bundleName": "Karta konfigurationsguide Bunta",
  "bundleDescription": "Kart bunt hanterar huvudkartan och all information kartan innehåll. Kunden kan abstrakta de tjänster som används i en hierarkisk Karta modell så att de kan visas på olika sätt för användaren.",
  "menu": {
    "mapstate": {
      "title": "Kart Omfattning"
    },
    "mapmodel": {
      "title": "Kartinnehåll"
    },
    "mrrbuilder": {
      "title": "Tjänster förvaltning"
    },
    "mapoptions": {
      "title": "Kartalternativ"
    }
  },
  "commonDelete": {
    "saveQuery": "Vill du verkligen ta bort '{number}' post (er)? Observera: Systemet kan bli inkonsekvent om du tar bort tjänster som refereras av andra komponenter <b>närvarande inga konsekventa kontroller utförs!</b>",
    "error": "Radering av poster \"{items} 'misslyckades!",
    "partialSuccess": "Vissa objekt kan inte tas bort!",
    "errorFinish": "Ingen del har blivit borttagen!",
    "success": "Rader Åtgärden utfördes!"
  },
  "serviceDetails": {
    "windowTitle": "Tjänsten '{id} \"",
    "newServiceId": "Ny",
    "url": "URL:",
    "urltooltip": "Ange exakt tjänsten endpoint url här! t.ex. http://services.arcgisonline.com/ArcGIS/rest/services/World_Topo_Map/MapServer",
    "title": "Titel:",
    "titletooltip": "Skriv in en rubrik för tjänsten",
    "description": "Beskrivning:",
    "descriptiontooltip": "Ange en beskrivning för tjänsten",
    "type": "Typ:",
    "typetooltip": "Välj den giltiga typ av tjänst",
    "layer": "Skikt:",
    "layertooltip": "Här kan du skriva in lagret metadata av tjänsten, strukturerat som: <pre> [{\n  \"id\": \"0\",\n  \"title\": \"My Layer\"\n}, ...] </pre>",
    "options": "Alternativ:",
    "optionstooltip": "<p> Här kan du skriva in särskilda alternativ för tjänstekonstruktion, strukturerat som: <pre> {\n  \"optionName\": \"optionValue\",\n  ...\n} </pre></p><p> Exempelvis kan opaciteten för en tjänst vara konfigurerad på följande sätt: <pre> {\n  \"opacity\": 0.5\n} </pre></p>",
    "fetchMetadata": "Hämta metadata",
    "fetchMetadatatooltip": "Klicka här för att hämta konfigurations metadata från url. Observera att alla inmatade metadata skrivs över med de uppgifter som tjänsten!",
    "fetchMetadataDesc": "Detta kommer att fungera för tjänstetyper \"AGS_DYNAMIC ',' AGS_FEATURE\" och \"AGS_TILED\". Ändå kan andra typer tjänster läggas till manuellt med denna form.",
    "fetchError": "Anslutning till tjänsten '{url}' misslyckades! {error}",
    "updateError": "Uppdatering av tjänsten '{id}' misslyckades! {error}",
    "updateSuccess": "Tjänsten '{id} \"har uppdaterats!"
  },
  "mrrBuilderWidget": {
    "createNewTitle": "Skapa ny nod",
    "removeServiceTool": "Avlägsna tjänsten",
    "addServiceTool": "Lägg ny tjänst",
    "dataView": {
      "filter": {
        "menuDefaultLabel": "[Alla]",
        "textBoxPlaceHolder": ""
      },
      "noDataFound": "Inga tjänster tillgängliga ...",
      "pager": {
        "pageLabelText": "Sidan ${currentPage} på ${endPage}",
        "backButtonTooltip": "Föregående sida",
        "forwardButtonTooltip": "Nästa sida",
        "firstButtonTooltip": "Första sidan",
        "lastButtonTooltip": "Sista sidan",
        "pageSizeLabelText": "Resultat ${pageStartItemNumber}-${pageEndItemNumber} på ${itemCount}"
      }
    },
    "categories": {
      "id": "Namn",
      "title": "Titel",
      "serviceUrl": "URL",
      "serviceType": "Typ"
    }
  },
  "mapModelBuilderWidget": {
    "description": "I det här fönstret kan korten ihop denna app definieras tema och bakgrundslager. På vänster sida alla tillgängliga tjänster visas. Dessa kan dras och släppas i slätterna i mitten.",
    "hint": "Nya tjänster kan läggas till med \"Tjänster förvaltning\" menyn.",
    "categoryDescription": "Beskrivning:",
    "categoryDescriptionTooltip": "Beskrivning av tjänsten",
    "categoryTitle": "Titel:",
    "categoryTitleTooltip": "Titel på tjänsten",
    "imageUrl": "URL för Map Flow täcker bild:",
    "imageUrlTooltip": "URL för Map Flow täcker bild (storlek: 267x159 px, format: jpg, png, gif)",
    "defaultEnabled": "Kategori aktiverad vid start:",
    "defaultEnabledTooltip": "Kontrollera att ställa tjänsten ska aktiveras vid start av appen.",
    "detailsPaneTitle": "Ändra inställningarna för tjänsten <b>'{category.title} \"</b>",
    "detailsPaneService": "Baserat på tjänsten <b>'{service} \"</b>",
    "transparencySlider": "Öppenhet:",
    "mapFlowPaneTitle": "<b>Map Flow inställningar</b> <br /> Om du använder Map Flow, kan du definiera egenskaper (beskrivning och bild) i avsnittet nedan.",
    "detailsHint": "Välj nod för att ställa detaljer ...",
    "servicesHint": "Dra en service här ...",
    "servicesTitle": "Tjänster",
    "detailsTitle": "Detaljer",
    "operationalLayer": "Operativ skikt",
    "baseLayer": "Basskiktet",
    "chooseLayers": "Välj vilka lager bör ingå i tjänsten och om de ska vara synlig från början.",
    "layerHead": "<b>Skikt</b>",
    "layerVisibleHead": "<b>Initial synlig</b>",
    "layerVisibleTooltip": "Kontrollera att ställa initial synliga tillstånd lagret <b>\"{title} '.</b>",
    "layerIncludeHead": "<b>Inkludera</b>",
    "layerIncludeTooltip": "Kontrollera att inkludera skikt <b>'{title}'.</b>",
    "editable": "Redigerbar",
    "editableTooltip": "Kontrollera att tillåta redigering på den här tjänsten"
  },
  "mapStateWidget": {
    "description": "Kartan utsträckning definierar det synliga området av en karta. Välj en metod för att ställa den inledande kartan omfattning.",
    "checkBoxApplyMainMapState": "Justera kartan omfattning genom att panorera huvudkartan",
    "setExtentManually": "Manuellt typ i värdena för kartan omfattning",
    "spatialReference": "Rumslig referenssystem:",
    "errorMessage": "Vänligen kontrollera koordinaterna!"
  },
  "mapOptionsWidget": {
    "description": "Med följande inställningar kan definieras olika kartalternativ.",
    "slider": {
      "label": "Visa zoomreglage",
      "tooltip": "Visa ett zoomreglaget på kartan"
    },
    "sliderStyle": {
      "label": "Style of zoomreglage",
      "tooltip": "Använd små eller standardzoomreglaget",
      "type": {
        "small": "liten",
        "large": "stor"
      }
    },
    "nav": {
      "label": "Visa navigeringspilar",
      "tooltip": "Definierar om navigationspilarna visas i hörnen på kartan."
    },
    "logo": {
      "label": "Visa \"powered-by\" logo",
      "tooltip": "Definierar om \"powered-by\" logotypen visas på kartan."
    },
    "doubleClickZoom": {
      "label": "Tillåt zooma på dubbelklick",
      "tooltip": "Definierar om zoomning är möjlig genom ett dubbelklick."
    },
    "clickRecenter": {
      "label": "Tillåt återcentre på [Skift] + klick",
      "tooltip": "Definierar om centre av kartan tillåts genom att trycka [Shift] och musklick."
    },
    "keyboardNavigation": {
      "label": "Tillåt tangentbordsnavigering",
      "tooltip": "Definierar om tangentbordsnavigering är tillåtet."
    },
    "scrollWheelZoom": {
      "label": "Tillåt zoomning genom mushjulet",
      "tooltip": "Definierar om du zoomar med mushjulet är tillåtet."
    },
    "sliderPosition": {
      "label": "Position för zoomreglaget",
      "tooltip": "Placeringen av zoomreglaget (\"övre vänstra\", \"övre högra\", \"nedre högra\" eller \"nedre vänstra\")",
      "position": {
        "topLeft": "övre vänstra",
        "topRight": "övre högra",
        "bottomLeft": "nedre vänstra",
        "bottomRight": "nedre högra"
      }
    },
    "displayGraphicsOnPan": {
      "label": "Visa grafik medan panorering",
      "tooltip": "När den är aktiverad är grafiken visas när du flyttar kartan. Inaktivera det här alternativet kan förbättra prestandan när Internet Explorer."
    },
    "navigationMode": {
      "label": "Navigeringsläge",
      "tooltip": "Anger om kartan använder CSS3 transformationer vid panorering och zoomning (om det stöds av webbläsaren).",
      "csstransform": "css-trans",
      "classic": "klassisk"
    },
    "fadeOnZoom": {
      "label": "Blekna på zoom",
      "tooltip": "När den är aktiverad är lager stöds lagrade under zoomning. För närvarande är denna stöds endast för klinkerlagret och navigeringsläget måste ställas in på \"css-trans\" lagen."
    },
    "showAttribution": {
      "label": "Visa information om upphovsrätt",
      "tooltip": "Om aktiverad, är upphovsrätts information som visas på de visade lagren i kartan."
    },
    "sliderOrientation": {
      "label": "Orientering av zoomreglaget",
      "tooltip": "Definierar anpassningen av zoomreglaget (\"vertikal\" eller \"horisontella\").",
      "show": "Visa",
      "hide": "dölja",
      "orientation": {
        "horizontal": "horisontell",
        "vertical": "vertikal"
      }
    },
    "sliderLabels": {
      "label": "Visa zoomreglage etiketter",
      "tooltip": "Definierar om etiketter visas bredvid zoomreglaget. (Fungerar endast med \"stora\" reglaget.)",
      "labels": {
        "country": "Land",
        "region": "Region",
        "town": "Stad"
      }
    }
  }
}