{
  "bundleName": "Usklajuje konfiguracijo prikaza",
  "bundleDescription": "Konfiguracija koordinatnega zaslona",
  "menu": {
    "title": "Usklajuje zaslon"
  },
  "widget": {
    "description": "Parametre konfiguracije koordinatnega zaslona.",
    "showScale": "Prikaži lestvica",
    "showCoordinates": "Prikaži koordinate",
    "degreeFormat": "Prikaži koordinate v stopinjah",
    "degreeFormatTooltip": "Format stopnja se uporablja samo, če prostorski referenčni sistem koordinat za zemljepisno dolžino in širino, ki temelji",
    "decimalPlaces": "Decimalna mesta koordinat",
    "transformSrs": "Transformacija koordinat",
    "targetSrs": "Sistem preoblikovanje ciljna",
    "targetSrsTooltip": "Ta konfiguracijski parameter se uporablja le, če je omogočen \"transformacijo koordinat\"."
  }
}