{
  "bundleName": "Lupe",
  "bundleDescription": "Die Lupe zeigt einen bestimmten Bereich der Karte in einem größeren Maßstab innerhalb eines extra Fensters. Dadurch kann dieser Bereich näher untersucht werden ohne die aktuelle Kartenansicht zu verlassen.",
  "ui": {
    "tools": {
      "magnifier": {
        "title": "Lupe",
        "tooltip": "Zeige Lupe"
      }
    }
  }
}