{
  "bundleName": "Místo nastavení vyhledávání",
  "bundleDescription": "Konfigurace balík pro umístění vyhledávání svazku.",
  "menu": {
    "title": "Esri CH Místo Finder"
  },
  "widget": {
    "description": "Konfigurace na téma hledání Esri Poloha Finder.",
    "enabled": "Hledání téma aktivní",
    "enabledTooltip": "Umožňuje téma hledání používat v Omni vyhledávání.",
    "defaultLabel": "Zástupný",
    "defaultLabelTooltip": "Definuje výchozí text vyhledávání vstupního pole (hodnota je nepovinný).",
    "pageSize": "Maximální výsledky",
    "pageSizeTooltip": "Maximální počet zásahů ve výsledcích (rozsah: 0 - 100, 0 je neomezená).",
    "typingdelay": "Zpoždění [ms]",
    "typingdelayTooltip": "Pauza mezi stisky kláves, než dotaz předložena (rozmezí 0-1000 milisekund)",
    "url": "URL služby",
    "urlTooltip": "URL REST koncového bodu vyhledávání služeb."
  },
  "stores": {
    "locationFinder": {
      "placeHolder": "Místo, adresu, POI ..."
    }
  }
}