{
  "bundleName": "Priontáil",
  "bundleDescription": "Soláthraíonn an bundle uirlis a phriontáil a phriontáil ar an léarscáil.",
  "tool": {
    "title": "Priontáil",
    "tooltip": "Priontáil",
    "back": "Ar ais"
  },
  "resultWin": {
    "title": "Priontáil"
  }
}