{
  "bundleName": "Ponuka konfigurácia Živé",
  "bundleDescription": "Menu pre živé konfiguráciu app.",
  "ui": {
    "title": "Živé konfiguráciu",
    "entry": "Vstup",
    "entries": "Príspevky",
    "noEntries": "V súčasnej dobe nie sú žiadne položky v tejto kategórii",
    "chooseCategory": "Prosím, vyberte možnosť",
    "buttons": {
      "back": "Späť",
      "apply": "Aktualizovať náhľad",
      "save": "App zachrániť"
    },
    "dataFormBuilderWidget": {
      "defaultValidationErrorMessage": "Skontrolujte prosím svoj vstup (y)!"
    },
    "saveStart": "Ukladanie začal!",
    "saveError": "Ušetrite zlyhalo! {message}",
    "saveSuccess": "Úspech!",
    "unknownError": "Neznáma chyba!",
    "notAppliedConfigChanges": "Nie je určené aplikovanej zmeny konfigurácie! Mali by byť použité?",
    "loadConfigBundles": "<p> Inicializácia zväzky konfigurácia ({pos} / {count}). <br/> Prosím, buďte trpezliví. </p>",
    "configureBtn": "Živé konfiguráciu",
    "bundleStart": "Na",
    "bundleStartMessage": "Vytvoriť balík \"{name} ({symname})\"",
    "bundleStartMessageSuccess": "Spustite balík \"{name} ({symname})\" úspešne!",
    "bundleStartMessageFailure": "Spustite balíček '{name} ({symname}) \"zlyhalo! {error}",
    "bundleStop": "Preč",
    "bundleStopMessage": "Zastaviť Bundle \"{name} ({symname})\"",
    "bundleStopMessageSuccess": "Zastavte ranec \"{name} ({symname})\" úspešne!",
    "bundleStopMessageFailure": "Zastavte balík '{name} ({symname}) \"zlyhalo! {error}",
    "bundleInfo": {
      "components": "Komponenty",
      "bundleIdentifier": "Identifikátora",
      "bundleName": "Názov",
      "bundleDescription": "Popis",
      "bundleVersion": "Verzia",
      "bundleLocation": "URL",
      "bundleCopyRight": "Copyright",
      "bundleState": "Postavenie",
      "bundleVendor": "Výrobca",
      "bundleCategory": "Kategórie",
      "bundleContactAddress": "Kontaktná adresa",
      "bundleDocUrl": "Dokumentácia",
      "bundleLicense": "Licencie",
      "bundleLicenseUrl": "Licenčné URL"
    },
    "componentInfo": {
      "component": "Komponent",
      "componentIdentifier": "Identifikátora",
      "componentName": "Názov",
      "componentState": "Postavenie",
      "componentInstances": "Inštancia",
      "componentLog": "Log",
      "jsonError": "Neplatný formát JSON: {error}",
      "commonDescription": "Môžete zmeniť konfiguráciu komponenty úpravou konfiguračného JSON tu. <b>Prosím, buďte opatrní!</b>",
      "factoryCreateHint": "Tento komponent je \"Component Factory\"! Zadanie novej konfigurácie vytvorí nový komponent!",
      "factoryDeleteHint": "Táto komponenta je ako konštrukčný závodu \"bod! Vymazanie doplníme vymažete priečinok!",
      "notConfigurableHint": "Táto komponenta nedá konfigurovať."
    }
  },
  "menu": {
    "main": {
      "title": "Živé konfiguráciu"
    },
    "content": {
      "title": "Obsah",
      "description": "Definovať obsah: Služby Mapa model, Mapa štát, ..."
    },
    "widgets": {
      "title": "Widgety",
      "description": "Vyberte ovládací prvok"
    },
    "search": {
      "title": "Search & Selection",
      "description": "Vyberte si vyhľadávanie a výber možností"
    },
    "tools": {
      "title": "Nástroje",
      "description": "Definuje nástroje, ktoré môžu byť použité v tejto aplikácii"
    },
    "design": {
      "title": "Layout & Design",
      "description": "Definuje vizuálny vzhľad a dizajn aplikácie"
    },
    "bundles": {
      "title": "Pokročilá konfigurácia (zväzky)"
    }
  }
}