{
  "bundleName": "Street View",
  "bundleDescription": "Käyttäjä voi valita sijainnin kartalta ja katso Google Street View kuvia, että paikalla erotettu ikkunassa.",
  "ui": {
    "tools": {
      "streetViewToggleTool": {
        "title": "Street View",
        "tooltip": "Street View (tilannekohtaisia ​​laajuuteen välein 1: 2000000 1: 2000)"
      },
      "streetViewCenterOnMarkerTool": {
        "title": "Siirry merkki",
        "tooltip": "Siirry merkki"
      }
    },
    "noStreetViewData": "Ei Street View tietoja tässä paikassa."
  }
}