{
  "bundleName": "ArcGIS Server Drukowanie na",
  "bundleDescription": "Ten pakiet zawiera narzędzia ArcGIS Server drukowania.",
  "ui": {
    "button": {
      "title": "Drukuj aktualną mapę"
    },
    "window": {
      "title": "Wyjście Drukowanie"
    },
    "error": {
      "unknown": "ArcGIS Server Drukowanie: nieznany błąd!",
      "code403": "AGS druku: druk usługi URL skonfigurowane ma być w swoim Proxys dozwolone lista!",
      "code404": "AGS Druk: Usługa drukowania nie może zostać rozwiązany dla skonfigurowanego adresu!"
    },
    "dialog": {
      "title": "Tytuł",
      "format": "Format",
      "layout": "Układ",
      "dpi": "DPI",
      "scale": "Utrzymuje skalę",
      "submitBtnLabel": "Druk"
    },
    "imgPrintResultWidget": {
      "printBtnText": "Druk"
    }
  }
}