{
  "bundleName": "Configuração Cisualizador de Conteúdo",
  "bundleDescription": "Este pacote fornece meios para configurar o visualizador de conteúdo.",
  "menu": {
    "title": "Cisualizador de Conteúdo"
  },
  "widget": {
    "window": {
      "title": "Nome",
      "saveDeleteQuery": "Você realmente quer apagar '{number}' item (s)?",
      "editContentDefinitionTitle": "Definição editar conteúdo",
      "newContentDefinitionTitle": "Criar uma nova definição de conteúdo"
    },
    "wizard": {
      "storePaneTitle": "Com um visualizador de conteúdo, é possível definir qual o conteúdo é mostrado ao clicar em um resultado de pesquisa ou um elemento no mapa. Portanto, por favor, escolha um tema Procurar- / seleção e / ou um nó do modelo de mapa. <br /><br /> Novos tópicos Procurar- / seleção podem ser adicionados sob \"Search & Selection 'no menu principal. As entradas na lista de nós mapa modelo coincidir com as camadas de mapas individuais que são usados ​​neste aplicativo (ver \"conteúdo\" no menu principal). <br /><br /> <b>Atenção:</b> Por favor, apenas selecionar um valor na lista ambos ao mesmo tempo, se o jogo serviços correspondentes.",
      "storeSelect": "Pesquisa tópico / seleção",
      "storeSelectTooltip": "Selecione um tópico de pesquisa / seleção",
      "mapModelNodeSelect": "Mapa de conteúdo",
      "mapModelNodeSelectTooltip": "Por favor seleccione um conteúdo do cartão",
      "noStoreLabel": "Nenhuma busca tópico / seleção",
      "noMapModelNodeLabel": "No conteúdo do mapa",
      "typePaneTitle": "Digite um nome para esta informação display (isso só é necessário para gerenciar a janela de configuração ao vivo usado), e selecione se a informação deve ter um display compacto e / ou visualização de detalhes.",
      "typeTitle": "Título",
      "typeTitleTooltip": "Defina um título para este visualizador de conteúdo.",
      "typeLayoutAttr": "Escolha o traçado",
      "typelayoutAttrTooltip": "Selecione o traçado (mesa ou ajustado)",
      "typeGrid": "Disposição da tabela",
      "typeCustom": "Disposição personalizado",
      "typeAttachment": "Apêndice",
      "typeCompactView": "Telespectador compacto",
      "typeCompactViewTooltip": "Selecione se você quiser usar o visualizador compacto",
      "typeFullView": "Ver detalhes",
      "typeFullViewTooltip": "Selecione para usar a visualização de detalhes",
      "layoutPaneTitle": "Por favor, escolha o layout para o espectador (s)",
      "layoutDefaultValue": "O valor padrão",
      "layoutDefaultValueTooltip": "Este valor é utilizado quando o objeto selecionado não tem valor para o atributo desejado.",
      "layoutSettingsCompactViewer": "<b>Definições para o espectador compacto</b>",
      "layoutCompactWindowTitle": "Título da janela",
      "layoutCompactWindowTitleTooltip": "Título da janela de visualização compacta. É possível utilizar espaços reservados para os campos. Os seguintes códigos estão disponíveis: ${fields}.",
      "layoutCompactWindowWidth": "Largura da janela",
      "layoutCompactWindowWidthTooltip": "Largura da janela de visualização compacta [pixéis]",
      "layoutCompactWindowHeight": "Altura da janela",
      "layoutCompactWindowHeightTooltip": "Altura da janela de visualização compacta [pixéis]",
      "layoutSettingsFullViewer": "<b>Configurações da visualização de detalhes</b>",
      "layoutFullWindowTitle": "Título da janela",
      "layoutFullWindowTitleTooltip": "Título da janela de pormenor espectador. É possível utilizar espaços reservados para os campos. Os seguintes códigos estão disponíveis: ${fields}.",
      "gridPaneTitle": "As definições para o layout da tabela",
      "gridFieldName": "Campo",
      "gridAllow": "Espetáculo",
      "gridAllowTooltip": "Selecione se este campo é exibido na tabela",
      "attachmentPanel": "Sem ajustes necessários",
      "editor": {
        "plugin": {
          "PlaceHolder": {
            "label": "Adicionar espaço reservado"
          }
        }
      },
      "noStores": "Não há tópicos de pesquisa / seleção encontrado!",
      "noStore": "No tópico de pesquisa / seleção encontrado!",
      "fieldsError": "Ao consultar os metadados tem sido um erro (mensagem de erro: ${msg})!",
      "noErrorSpecified": "Não mensagem de erro detalhada disponível!",
      "noContextQuery": "Este tópico Procurar / seleção não definir uma consulta contexto. Tem de ser editado manualmente."
    },
    "grid": {
      "removeContentTool": "Remover definição de conteúdo",
      "addContentTool": "Adicionar nova definição de conteúdo",
      "title": "Título",
      "dataView": {
        "noDataFound": "Sem definição conteúdo encontrado ...",
        "pager": {
          "pageSizeLabelText": "Definição conteúdo ${pageStartItemNumber} - ${pageEndItemNumber} de ${itemCount}",
          "pageLabelText": "Página ${currentPage} de ${endPage}",
          "backButtonTooltip": "Página anterior",
          "forwardButtonTooltip": "Próxima página",
          "firstButtonTooltip": "Primeira página",
          "lastButtonTooltip": "Última página"
        },
        "filter": {
          "menuDefaultLabel": "Tudo",
          "textBoxPlaceHolder": ""
        }
      }
    }
  }
}