{
  "bundleName": "Samordna display konfiguration",
  "bundleDescription": "Konfiguration av koordinat displayen",
  "menu": {
    "title": "Koordinat display"
  },
  "widget": {
    "description": "Konfigurationsparametrar koordinatfönstret.",
    "showScale": "Visa skala",
    "showCoordinates": "Visa koordinater",
    "degreeFormat": "Visa koordinater i examen",
    "degreeFormatTooltip": "Graden formatet används endast om den rumsliga referenskoordinatsystemet till longitud och latitud baserad",
    "decimalPlaces": "Decimaler av koordinater",
    "transformSrs": "Omvandla koordinater",
    "targetSrs": "Mål-systemet omvandling",
    "targetSrsTooltip": "Denna konfiguration parameter används endast om \"Trans koordinater\" är aktiverat."
  }
}