{
  "bundleName": "Scáileán sa bhaile",
  "bundleDescription": "Taispeánann an scáileán sa bhaile barra dul chun cinn cé go bhfuil an feidhmchlár ag.",
  "loadTitle": "Tosaigh iarratas '{appName}'",
  "loadBundle": "{percent}% - {startedBundles}/{maxBundlesToStart} - Muirir {ainm}"
}