{
  "bundleName": "Locate Me",
  "bundleDescription": "Lietotājs var parādīt savu pašreizējo atrašanās vietu (analizēja GPS un / vai IP adrese), kas kartē.",
  "ui": {
    "tools": {
      "locatemeTool": {
        "title": "Izvietot",
        "tooltip": "Parāda savu pašreizējo atrašanās vietu kartē."
      }
    }
  },
  "infos": {
    "newLoc": {
      "ann": "Jaunais amats ar ${acc} ${unit} nosaka precizitāti.",
      "msg": "Jaunais amats ar ${acc} ${unit} nosaka precizitāti."
    }
  },
  "exceptions": {
    "noGeoLoc": {
      "ann": "Nē location pieejami",
      "msg": "Jūsu pārlūkprogramma neatbalsta lokalizāciju."
    },
    "posDen": {
      "ann": "Lokalizācija liegta",
      "msg": "Lokalizācijas noliedza pārlūks"
    },
    "posNotAv": {
      "ann": "Amats nav pieejams",
      "msg": "Pozīcija nav pieejams"
    },
    "timeout": {
      "ann": "Noildze lokalizācijas laikā",
      "msg": "Atrast laiku ir pārsniegts."
    },
    "unknown": {
      "ann": "Amats nav pieejams",
      "msg": "Amats nav pieejams, ir notikusi nezināma kļūda"
    },
    "acc": {
      "ann": "Pozīcijas precizitāte pārāk zems",
      "msg": "Amats nav pietiekami precīzs, lai parādītu"
    }
  }
}