{
  "bundleName": "Gestione fascio",
  "bundleDescription": "Fornisce interfacce per la gestione fascio",
  "commonDelete": {
    "saveQuery": "Sei sicuro di voler cancellare '{number}' item (s)?",
    "error": "Soppressione di voci \"{items}'non riuscita!",
    "partialSuccess": "Alcune voci non possono essere cancellati!",
    "errorFinish": "Nessun elemento è stato cancellato!",
    "success": "L'operazione di cancellazione conclusa con successo!"
  },
  "bundleListTool": {
    "title": "Bundles",
    "desc": "Elenco dei Bundles"
  },
  "removeSelectedBundlesTool": {
    "title": "Cancellare",
    "desc": "Elimina fascio"
  },
  "createBundleTool": {
    "title": "Carica",
    "desc": "Carica Bundles"
  },
  "dataViewCommon": {
    "filter": {
      "menuDefaultLabel": "Tutto",
      "textBoxPlaceHolder": ""
    },
    "pager": {
      "backButtonTooltip": "Pagina precedente",
      "forwardButtonTooltip": "Pagina successiva",
      "firstButtonTooltip": "Prima pagina",
      "lastButtonTooltip": "Ultima pagina",
      "pageLabeltext": "Pagina:",
      "pageSizeLabelText": "Risultati ${pageStartItemNumber}-${pageEndItemNumber} di ${itemCount}",
      "pageLabelText": "Pagina:"
    }
  },
  "bundlesView": {
    "noDataMessage": "Non ci sono pacchetti disponibili ...",
    "name": "Nome",
    "version": "Versione",
    "title": "Titolo",
    "desc": "Descrizione",
    "modifiedBy": "Modificato da",
    "modifiedAt": "Modificato A"
  },
  "bundleDetailsView": {
    "windowTitle": "Bundle '{id}'",
    "createWindowTitle": "Carica Bundles",
    "name": "Nome",
    "version": "Versione",
    "dependencies": "Dipendenze:",
    "main": "Il file principale:",
    "layer": "File di livello:",
    "location": "Località:",
    "title": "Titolo:",
    "description": "Descrizione:",
    "createdAt": "Creato il:",
    "createdBy": "Creato da:",
    "modifiedAt": "Modificato A",
    "modifiedBy": "Modificato da",
    "id": "ID:",
    "upload": "Carica",
    "uploaded": "100% - fasci vengono estratti e importati",
    "updateError": "Fascio '{id}' non poteva essere salvato! {error}",
    "updateSuccess": "Fascio '{id}' di successo ha salvato!",
    "uploadStart": "Carica Iniziato!",
    "uploadError": "Carica di errore:",
    "uploadFinished": "Carica finito!",
    "createBundleInfo": "<strong>Carica le tue bundle</strong> <br/><ul><li> Ammessi sono file zip o jar </li><li> Un file può contenere più pacchetti. </li></ul>",
    "panelDefaultTitle": "<strong>Informazioni Generali</strong>",
    "panelExtendedTitle": "<strong>Informazioni esteso</strong>",
    "panelJsonInfoTitle": "<strong>package.json</strong>"
  }
}