{
  "bundleName": "Informačný displej",
  "bundleDescription": "Na displeji sa zobrazí správa s užívateľmi podstatné informácie o mieste, na mape v okne.",
  "ui": {
    "title": "Info Viewer",
    "tools": {
      "closeInfoWindowMapdeskTool": "Zavrieť",
      "closeInfoWindowMapTool": "Zavrieť",
      "focusMapTool": "Stred v mape",
      "attachToGeorefTool": "Pripojiť do polohy",
      "mainActivationTool": "Informácie o umiestnení"
    }
  }
}