{
  "bundleName": "Coordonarea de configurare a afișajului",
  "bundleDescription": "Configurarea afișajului de coordonate",
  "menu": {
    "title": "Coordonarea afișare"
  },
  "widget": {
    "description": "Parametrii de configurare ale ecranului de coordonate.",
    "showScale": "Arată scară",
    "showCoordinates": "Arată coordonate",
    "degreeFormat": "Arată coordonează în grad",
    "degreeFormatTooltip": "Formatul de studii este folosit doar în cazul în care sistemul de referință spațial de coordonate la longitudine și latitudine bazat",
    "decimalPlaces": "Zecimale de coordonate",
    "transformSrs": "Transformarea coordonatelor",
    "targetSrs": "De transformare a sistemului țintă",
    "targetSrsTooltip": "Acest parametru este utilizat numai dacă este activată \"transformata coordonate."
  }
}