{
  "bundleName": "Mjerni alat",
  "bundleDescription": "Mjerenje značajka omogućuje korisniku da mjerenje udaljenosti i područja klikom na karti. Nadalje, to je u mogućnosti to pretvoriti rezultat u različitim mjernim jedinicama.",
  "ui": {
    "toolTitle": "Mjera",
    "finishBtnLabel": "Završiti"
  }
}