{
  "bundleName": "Prostorové Záložky",
  "bundleDescription": "Svazek záložky umožňuje uložit rozsah mapy jako několik záložek.",
  "ui": {
    "toolTitle": "Prostorové Záložky",
    "clearButton": "Odstranit všechny záložky",
    "deleteMessage": "Opravdu chcete smazat všechny záložky?",
    "deleteTitle": "Jste si jisti?",
    "deleteWarning": "Toto nelze vrátit zpět!"
  }
}