{
  "bundleName": "ESRI Aimsitheoir chumraíocht seirbhíse",
  "bundleDescription": "Bundle Cumraíocht na Seirbhíse Aimsitheoir ESRI.",
  "menu": {
    "title": "Seirbhís Aimsitheoir ESRI"
  },
  "widget": {
    "description": "Cumraíocht na Seirbhíse Aimsitheoir ESRI ábhar cuardaigh.",
    "enabled": "Ábhar Cuardaigh gníomhach",
    "enabledTooltip": "Cumasaigh an ábhar cuardaigh a úsáid sa chuardach Omni.",
    "defaultLabel": "Placeholder",
    "defaultLabelTooltip": "Sainmhíníonn an téacs réamhshocraithe an réimse ionchur cuardaigh (is luach roghnach).",
    "labelAttribute": "Teideal tréith",
    "labelAttributelTooltip": "Sainmhíníonn an tréith a úsáidtear le haghaidh an lipéad de hit cuardaigh.",
    "pageSize": "Torthaí Uasta",
    "pageSizeTooltip": "(:; Tá 0 neamhtheoranta 0-100 raon) Uasmhéid na n-amas sna torthaí.",
    "typingdelay": "Moill [ms]",
    "typingdelayTooltip": "Sos idir cófraí ​​eochair sula ndéanfar an cheist a cuireadh isteach (raon 0-1000 milleasoicind)",
    "url": "URL na seirbhíse",
    "urlTooltip": "URL an críochphointe CHUID seirbhíse cuardaigh."
  },
  "stores": {
    "locator": {
      "placeHolder": "Áit ainm ..."
    }
  }
}