{
  "bundleName": "Koordinaatti näyttökokoonpanon",
  "bundleDescription": "Konfigurointi koordinoida näyttö",
  "menu": {
    "title": "Koordinaatti näyttö"
  },
  "widget": {
    "description": "Konfigurointiparametreja koordinoida näytön.",
    "showScale": "Näytä mittakaava",
    "showCoordinates": "Näytä koordinaatit",
    "degreeFormat": "Näytä koordinaatit asteina",
    "degreeFormatTooltip": "Tutkinto-muotoa käytetään vain, jos alueellinen yhteistyö koordinaatisto pituus- ja leveyspiirien perustuvat",
    "decimalPlaces": "Desimaalissa koordinaatit",
    "transformSrs": "Transform koordinaatit",
    "targetSrs": "Tavoite-järjestelmä muutos",
    "targetSrsTooltip": "Tämä konfigurointiparametri käytetään vain, jos \"Transform koordinaatit\" on käytössä."
  }
}