{
    "bundleName": "ec-error-messages",
    "bundleDescription": "ec-error-messages",
    "general": {
      "serviceNotAvailable": "Le service demandé ne sont pas disponibles",
      "serviceNotSupported": "Le service demandé est pas pris en charge",
      "unsupportedServiceType": "Le service demandé est pas pris en charge",
      "technicalSupportCreateTicket": "Contacter support technique",
      "closeButton": "Ok",
      "invalidResource": "Une ressource non valide a été trouvé à l&#39;URL donnée",
      "unsupportedResource": "Une ressource non pris en charge a été trouvé à l&#39;URL donnée",
      "errorSource": "La source d&#39;erreur suivant a été déterminé",
      "requestedUrl": "URL demandée",
      "technicalSupport": "Si le problème persiste à l&#39;avenir, s&#39;il vous plaît contacter le support technique",
        "weWillContactProvider": "Nous allons contacter le fournisseur du service pour l’informer du problème."
    },
    "detailedErrors": {
      "crs": "Le service ne fournit pas un système de référence pris en charge la coordination",
      "encoding": "Le service ne fournit pas un codage de caractères pris en charge",
      "metadata": "Le document de métadonnées du service est erronée",
      "fileFormat": "Un format de données non valide a été reçu à l&#39;URL donnée",
      "dataRequest": "Bien que l&#39;interrogation des données du service une réponse non valide a été reçu. Les raisons peuvent être, par exemple: erreur de serveur interne, mauvaise configuration du service, non-conforme à la norme comportement du service, etc."
    },
    "httpIssues": {
      "303": "La réponse à la demande peut être trouvé sous un autre URI",
      "305": "La ressource demandée est disponible uniquement via un proxy",
      "400": "Le serveur ne peut pas ou ne veut pas traiter la requête en raison d&#39;une erreur de perception client",
      "401": "La ressource demandée nécessitait l'autorisation",
      "403": "La ressource demandée est pas accessible au public",
      "404": "La ressource demandée n&#39;a pas pu être trouvé",
      "405": "La ressource a été demandé par une méthode HTTP non autorisée",
      "406": "Un contenu pas acceptable a été demandé à la ressource",
      "407": "La ressource nécessite une authentification préalable à un service de proxy",
      "500": "La ressource ne sont pas disponibles en raison d&#39;une erreur de serveur interne",
      "501": "La ressource ne sont pas disponibles en raison d&#39;une méthode de requête non reconnue",
      "502": "La ressource est pas disponible en raison d&#39;une passerelle à tort configuré",
      "503": "La ressource est actuellement indisponible pour cause de surcharge ou de maintenance",
      "504": "La ressource est pas disponible en raison d&#39;une passerelle configuré à tort ou ne répond pas",
      "505": "La ressource ne supporte pas la version HTTP donné",
      "generic": "Une erreur de serveur tout en demandant la ressource donnée"
    }
}