{
  "bundleName": "UndoRedo",
  "bundleDescription": "Modul ponúka zrušiť / prerobiť systém.",
  "undoTool": {
    "title": "Zrušiť",
    "tooltip": "Zrušiť"
  },
  "redoTool": {
    "title": "Prerobiť",
    "tooltip": "Prerobiť"
  },
  "messages": {
    "undo": {
      "start": "Späť {operation} začať",
      "success": "Späť {operation} skončil",
      "failure": "Späť {operation} zlyhala. Chyba: {error}"
    },
    "redo": {
      "start": "Prerobiť {operation} začať",
      "success": "Prerobiť {operation}  skončil",
      "failure": "Prerobiť {operation} zlyhala. Chyba: {error}"
    }
  }
}