{
  "bundleName": "Usmerjanje",
  "bundleDescription": "Ta paket zagotavlja Navodila gradnik s ArcGIS API za JavaScript.",
  "tool": {
    "title": "Usmerjanje",
    "tooltip": "Prikaži usmerjanje widget"
  },
  "printTemplate": {
    "printbutton": "Natisni",
    "closebutton": "Zapri",
    "titleText": "Moje poti:",
    "notesPlaceholder": "Vnesete opombe",
    "routingSummaryETE": "Ocenjeni čas na poti:",
    "routingSummaryDistance": "Oddaljenost od:",
    "footerText": "Navodila so na voljo le za namene načrtovanja in za katere veljajo <a href='http://www.esri.com/legal/software-license' target='_blank'>pogoji za ESRI uporabe</a> . Dinamične razmere na cesti, da lahko obstajajo vzrok natančnost razlikujejo od vaših navodilih in jih je treba upoštevati skupaj z znaki in zakonskimi omejitvami. Prevzeti vsa tveganja uporabe."
  },
  "units": {
    "hour": "uro",
    "hours": "ur",
    "minute": "minute",
    "minutes": "minut",
    "esriMillimeters": "mm",
    "esriCentimeters": "cm",
    "esriDecimeters": "dm",
    "esriMeters": "m",
    "esriKilometers": "km",
    "esriFeet": "ft",
    "esriInches": "v",
    "esriMiles": "mi",
    "esriNauticalMiles": "nm",
    "esriUnknownUnits": "neznano"
  }
}