{
  "bundleName": "Izvještavanje alat",
  "bundleDescription": "Alat koji vam omogućuje stvaranje izvješća.",
  "title": "Izvještavanje",
  "description": "Postavite postavke za generiranje izvješća.",
  "widgets": {
    "reportTool": {
      "menuTitle": "Izvještavanje alat",
      "description": "Prilagodite ponašanje alata izvješće nalazi u centru rezultata.",
      "hint": "Postavljanje naziv datoteke je korisno kada se izravna preuzimanje opcija provjeriti.",
      "dataform": {
        "directDownload": {
          "title": "Izravno preuzimanje",
          "tooltip": "Pogledajte ovo, kada je generirana izvješće treba skinuti izravno. Inače će se prikazati u aplikaciji."
        },
        "fileName": {
          "title": "Naziv datoteke",
          "tooltip": "Naziv datoteke koji će biti generiran i skinuti."
        }
      }
    },
    "reportTask": {
      "menuTitle": "Prijavi Mapiranja",
      "description": "Prilagodite preslikavanja koje određuju što će izvješće biti korišten za Kakvu odabira teme.",
      "hint": "Ako nema mapiranje definirana, zadana izvješće će se koristiti.",
      "addReportMapping": {
        "title": "Dodaj novi zadatak",
        "tooltip": "Dodaj novi zadatak",
        "error": "Pogrešna konfiguraciju Izvješće je otkriven i da će biti odbačena. Izvješće:"
      },
      "removeReportMapping": {
        "title": "Brisanje Odabrana mapiranje (s)",
        "tooltip": "Brisanje Odabrana mapiranje (s)"
      },
      "grid": {
        "store": {
          "reportid": "Izvješće",
          "storeId": "Prodavaonica",
          "title": "Naziv"
        },
        "dataView": {
          "noDataFound": "Ne izvješću na zadatke.",
          "DGRID": {
            "noDataMessage": "Ne izvješće zadatke (s) našao ..."
          },
          "pager": {
            "pageSizeLabelText": "Prijavi preslikavanja ${pageStartItemNumber} - ${pageEndItemNumber} od ${itemCount}"
          }
        }
      },
      "widget": {
        "window": {
          "title": "Napravite raspored izvješća"
        },
        "addButtonTitle": "Dodati",
        "labelReportId": "Izvješće",
        "labelMapmodelId": "Tema za odabir"
      }
    }
  }
}