{
  "bundleName": "Viewer Content",
  "bundleDescription": "Показва различните видове съдържание.",
  "ui": {
    "unknownContentError": "Съдържанието е неизвестен.",
    "graphicinfotool": {
      "title": "Информация елемент",
      "desc": "Информация елемент"
    },
    "content": {
      "defaultTitle": "Елемент",
      "grid": {
        "detailView": "Покажи детайли",
        "key": "Имот",
        "value": "Стойност"
      },
      "customTemplate": {
        "detailView": "Покажи детайли"
      },
      "attachment": {
        "noAttachmentSupport": "Този слой не поддържа прикачени файлове",
        "detailView": "Покажи детайли"
      },
      "AGSDetail": {
        "title": "Вижте детайли",
        "print": "Печат",
        "serviceMetadata": "Метаданни Service",
        "serviceURL": "URL",
        "serviceCopyrights": "Copyrights",
        "serviceTitle": "Заглавие",
        "pager": {
          "pageSizeLabel": "Feature ${currentPage} на ${endPage}"
        },
        "key": "Имот",
        "value": "Стойност",
        "detailView": "Покажи детайли"
      }
    }
  }
}