{
  "bundleName": "Disegnare",
  "bundleDescription": "Disegno Bundle fornisce gli strumenti di disegno e modifica dell'utente.",
  "menu": {
    "title": "Disegnare"
  },
  "widget": {
    "description": "Si prega di selezionare quelli strumenti che dovrebbero essere disponibili Nuoto disegno:"
  },
  "tools": {
    "DrawEraseAllTool": {
      "title": "Elimina tutto",
      "tooltip": "Elimina interruttore strumento (Tutti i disegni cancellare)"
    },
    "DrawPointTool": {
      "title": "Punto",
      "tooltip": "Interruttore strumento punto (Disegna un punto)"
    },
    "DrawMultipointTool": {
      "title": "Punti",
      "tooltip": "Punti interruttore strumento (richiama più punti)"
    },
    "DrawLineTool": {
      "title": "Linea",
      "tooltip": "Interruttore strumento Linea (Disegna una linea retta)"
    },
    "DrawPolylineTool": {
      "title": "Polyline",
      "tooltip": "Interruttore strumento Polilinea (Disegna una polilinea)"
    },
    "DrawFreehandPolylineTool": {
      "title": "a mano libera polyline",
      "tooltip": "Interruttore strumento polyline a mano libera (Disegna una traccia definita dall'utente)"
    },
    "DrawPolygonTool": {
      "title": "Poligono",
      "tooltip": "Interruttore Poligono (Disegna un poligono)"
    },
    "DrawFreehandPolygonTool": {
      "title": "a mano libera poligono",
      "tooltip": "Interruttore strumento poligono Freehand (Disegna un poligono liberamente definibile)"
    },
    "DrawExtentTool": {
      "title": "Rettangolo gratuito",
      "tooltip": "Interruttore strumento Freehand Rettangolo (Disegna un rettangolo liberamente definibile)"
    },
    "DrawCircleTool": {
      "title": "Cerchio",
      "tooltip": "Interruttore strumento cerchio (Disegna un cerchio)"
    },
    "DrawEllipseTool": {
      "title": "Ellisse",
      "tooltip": "Interruttore strumento Ellisse (Disegna un'ellisse)"
    },
    "DrawRectangleTool": {
      "title": "Rettangolo",
      "tooltip": "Interruttore strumento Rettangolo (Disegna un rettangolo)"
    },
    "DrawArrowTool": {
      "title": "Freccia gratuito",
      "tooltip": "Freccia interruttore strumento (Disegna una freccia in qualsiasi direzione)"
    },
    "DrawLeftArrowTool": {
      "title": "Freccia a sinistra",
      "tooltip": "Interruttore Freccia allo strumento di sinistra (Disegnare un tasto freccia sinistra)"
    },
    "DrawRightArrowTool": {
      "title": "Freccia a destra",
      "tooltip": "Interruttore freccia per lo strumento giusto (Disegnare una freccia che punta verso destra)"
    },
    "DrawUpArrowTool": {
      "title": "Freccia",
      "tooltip": "Freccia passare up strumento (disegna un piatti freccia in alto)"
    },
    "DrawDownArrowTool": {
      "title": "Freccia giù",
      "tooltip": "Freccia passare giù strumento (Disegna una freccia rivolta verso il basso)"
    },
    "DrawTriangleTool": {
      "title": "Triangolo",
      "tooltip": "Interruttore strumento Triangolo (Disegna un triangolo)"
    },
    "DrawTextTool": {
      "title": "Testo",
      "tooltip": "Interruttore strumento Testo (qualsiasi testo sulla scrittura carta)"
    },
    "DrawSymbolTool": {
      "title": "Simbolo",
      "tooltip": "Interruttore Icona Strumento (Un simbolo dal disegno galleria simbolo)"
    },
    "StylePropertiesTool": {
      "title": "Proprietà / Modelli",
      "tooltip": "Interruttore strumento Proprietà (proprietà dei caratteri e modelli Modifica)"
    },
    "MoveScaleRotateVerticesTool": {
      "title": "Modifica grafica",
      "tooltip": "Strumento Modifica interruttore (figura spostare, ridimensionare o ruotare oppure modificare il nodo)"
    },
    "MoveScaleRotateTool": {
      "title": "Mossa",
      "tooltip": "Strumento Sposta interruttore (figura spostare, ridimensionare o ruotare)"
    },
    "EditVerticesTool": {
      "title": "Modifica nodo",
      "tooltip": "Interruttore Modifica Strumento (nodi di un grafo di modifica)"
    },
    "DeleteGraphicTool": {
      "title": "Cancellare",
      "tooltip": "Elimina interruttore strumento (Cancella grafico)"
    },
    "ExportGraphicsTool": {
      "title": "Grafica Esportazione",
      "tooltip": "Interruttore strumento Esportazione (esportazione grafica)"
    }
  }
}