{
  "bundleName": "Räumliche Lesezeichen",
  "bundleDescription": "Das Lesezeichenwerkzeug erlaubt es mehrere Raumausschnitte als Lesezeichen abzulegen.",
  "ui": {
    "toolTitle": "Räumliche Lesezeichen",
    "clearButton": "Alle Lesezeichen löschen",
    "deleteMessage": "Wollen Sie wirklich alle Lesezeichen löschen?",
    "deleteTitle": "Sind Sie sicher?",
    "deleteWarning": "Diese Aktion kann nicht rückgängig gemacht werden!"
  }
}