{
  "bundleName": "Konsole",
  "bundleDescription": "Konsole palīdz pārvaldīt un uzraudzīt uzstādīta paketi. Tā arī norāda pakalpojumus, to sastāvdaļas un žurnāla ziņas.",
  "ui": {
    "windowTitle": "Konsole",
    "bundleTab": "Paketes",
    "bundlesStoreFields": {
      "id": "ID",
      "name": "Nosaukums",
      "description": "Apraksts",
      "state": "Stāvoklis",
      "autostartPolicy": "Automātiskās palaišanas politika",
      "symbolicName": "Simboliskais nosaukums",
      "version": "Versija",
      "startLevel": "Start Level",
      "vendor": "Sniedzējs",
      "location": "Vieta"
    },
    "servicesTab": "Pakalpojumi",
    "servicesStoreFields": {
      "id": "ID",
      "provides": "Saskarnes",
      "bundle": "Saišķis",
      "component": "Komponents",
      "properties": "Properties"
    },
    "componentsTab": "Sastāvdaļas",
    "componentsStoreFields": {
      "id": "ID",
      "name": "Nosaukums",
      "state": "Stāvoklis",
      "properties": "Properties",
      "instances": "Gadījumi",
      "log": "Log",
      "bundleName": "Saišķis"
    },
    "messagesTab": "Ziņojumi",
    "messagesStoreFields": {
      "level": "Līmenis",
      "time": "Laiks",
      "message": "Īss apraksts",
      "announcement": "Ziņa"
    },
    "tools": {
      "bundles": {
        "start": {
          "title": "Sākt Paketes",
          "tooltip": "Sākt atlasītos Paketes"
        },
        "stop": {
          "title": "Izslēgšanas Paketes",
          "tooltip": "Stop atlasītos Paketes"
        }
      },
      "components": {
        "configure": {
          "title": "Konfigurēt sastāvdaļas",
          "tooltip": "Konfigurēt izvēlēto komponenti"
        }
      }
    },
    "dataView": {
      "pager": {
        "backButtonTooltip": "Atpakaļ",
        "forwardButtonTooltip": "Uz priekšu",
        "firstButtonTooltip": "Pirmā lapa",
        "lastButtonTooltip": "Pēdējā lapa",
        "pageLabelText": "Lappuse ${currentPage} no ${endPage}",
        "zeroResultsText": "",
        "pageSizeLabelText": "${pageStartItemNumber} - ${pageEndItemNumber} no ${itemCount}"
      },
      "filter": {
        "menuDefaultLabel": "Viss",
        "textBoxPlaceHolder": "Meklēt ..."
      },
      "DGRID": {
        "noDataMessage": "Nav datu.",
        "loadingMessage": "Iekraušana datus ..."
      }
    },
    "dataFormNotInstalled": "DATAFORM saišķa nav instalēta. Lai ļautu sastāvdaļu konfigurācija funkcija pievienot DATAFORM saišķis jūsu app.json failā."
  }
}