{
  "bundleName": "Follow Me",
  "bundleDescription": "Funkcja Follow Me zapewnia potężne narzędzie do pracy z map.apps. Użytkownicy mogą dzielić się z innymi swoją mapę lub połączenie istniejącej sesji prezentacji.",
  "tool": {
    "title": "Follow Me",
    "tooltip": "Follow Me"
  },
  "ui": {
    "createSessionTitle": "Tworzenie sesji",
    "joinSessionTitle": "Dołącz do sesji",
    "createSessionHint": "Proszę podać swoje imię i nazwisko, a następnie kliknij przycisk \"Rozpocznij sesję\".",
    "inviteSessionHint": "Zaproś gości do udziału w sesji, dostarczając session-id:",
    "joinSessionHint": "Aby uczestniczyć w sesji podać swoje imię i session-id i kliknij \"Dołącz do sesji\".",
    "name": "Twoje imię i nazwisko",
    "sessionId": "Identyfikator sesji",
    "startSession": "Rozpoczęcie sesji",
    "stopSession": "Koniec sesji",
    "joinSession": "Dołącz do sesji",
    "leaveSession": "Zostaw sesji",
    "inviteSession": "Wyślij zaproszenie",
    "organizer": "Organizator",
    "presenter": "Prezenter",
    "owner": "Mnie",
    "user": "Użytkownik",
    "session": "Sesja",
    "markLocation": "Podziel lokalizację",
    "markLocationTooltip": "Podziel się lokalizacją w Śledź mnie",
    "pleaseWaitForConnection": "Proszę czekać, łącząc ...",
    "userList": {
      "attendees": "Uczestnicy",
      "numberOfAttendeesSingular": "1 uczestnik jest w trybie online:",
      "numberOfAttendeesPlural": "${numberOfAttendees} uczestnicy są w trybie online:"
    },
    "sessionInfo": {
      "sessionActive": "${id}",
      "sessionCreatedAt": "Utworzono dnia ${timestamp}"
    },
    "invitation": {
      "subject": "Zostałeś zaproszony do sesji Follow Me",
      "body": "Aby przyłączyć się do sesji użyj URL ${url} i sesji ID ${id}"
    },
    "notifications": {
      "newUser": {
        "shrt": "${type} ${user} dołączył",
        "lng": "${type} ${user} dołączył do Follow Me sesji."
      },
      "userLeft": {
        "shrt": "${user} opuścił sesję",
        "lng": "${user} opuścił sesję Follow Me."
      },
      "sessionClosed": {
        "shrt": "Sesja została zamknięta",
        "lng": "Sesja została zamknięta Follow Me przez organizatora."
      },
      "parserError": {
        "shrt": "Błąd podczas analizowania odpowiedzi serwera"
      },
      "serverError": {
        "shrt": "Błąd na serwerze wystąpił"
      },
      "topicNotExistent": {
        "shrt": "ID sesji nie istnieje"
      },
      "newMarker": {
        "shrt": "${user} shared nową lokalizację"
      },
      "unkownError": {
        "shrt": "Wystąpił nieznany błąd"
      }
    }
  }
}