{
  "bundleName": "JoinAddress",
  "bundleDescription": "Tento balík poskytuje implementáciu pre server JoinAddress.",
  "store": {
    "name": "JoinAddress vyhľadávanie",
    "description": "Uchovávajte pre službu vyhľadávania JoinAddress",
    "placeHolder": "Názov Mesto alebo PSČ",
    "fields": {
      "ID": "Id",
      "LNGCODE": "Kód jazyka",
      "ZIP": "PSČ",
      "CITY": "Mesto",
      "ZIPNAME": "Poštové meno",
      "ADMCODE": "Administratívne kľúč",
      "XCOOR": "X",
      "YCOOR": "Y",
      "COQ": "Súradníc kvalitu",
      "SMLCITY": "Podobnosť názov mesta",
      "SMLZIPNAME": "Podobnosť poštové meno"
    }
  }
}