{
  "bundleName": "UndoRedo",
  "bundleDescription": "De module biedt een ongedaan maken / overdoen systeem.",
  "undoTool": {
    "title": "Ongedaan maken",
    "tooltip": "Ongedaan maken"
  },
  "redoTool": {
    "title": "Overdoen",
    "tooltip": "Overdoen"
  },
  "messages": {
    "undo": {
      "start": "Ongedaan maken {operation} begonnen",
      "success": "Ongedaan maken {operation} afgewerkte",
      "failure": "Ongedaan maken {operation} mislukt. Fout: {error}"
    },
    "redo": {
      "start": "Opnieuw {operation} begonnen",
      "success": "Opnieuw {operation} afgewerkte",
      "failure": "Opnieuw {operation} mislukt. Fout: {error}"
    }
  }
}