{
  "bundleName": "Kiválasztás",
  "bundleDescription": "Eszközöket biztosít kiválasztásával tárgyak adatforrások",
  "ui": {
    "tools": {
      "mainActivationTool": "Választ",
      "activationToolExtent": "Kiválasztás téglalap"
    },
    "noDataMessage": "Nem találtunk semmilyen tárgyat."
  }
}