{
  "bundleName": "Print",
  "bundleDescription": "Denne pakke indeholder et print værktøj til at udskrive kortet.",
  "tool": {
    "title": "Print",
    "tooltip": "Print",
    "back": "Tilbage"
  },
  "resultWin": {
    "title": "Print"
  }
}