{
  "bundleName": "Suíomh Eolas",
  "bundleDescription": "Taispeáin eolas faoi láthair ar leith.",
  "ui": {
    "tools": {
      "mainActivationTool": "Suíomh Eolas",
      "activationToolExtent": "Faisnéis Suíomh (roghnú dronuilleog)"
    },
    "result": {
      "type": "Cineál",
      "adapter": "Seirbhís",
      "title": "Teideal",
      "detailsUrl": "Nasc",
      "thumbnailUrl": "Mionsamhail"
    },
    "content": {
      "image": {
        "title": "Íomhá",
        "goToImageButton": "Téigh go dtí an suíomh gréasáin seo an íomhá",
        "sendByMailButton": "R-phost an íomhá seo",
        "detailViewButtonLabel": "Mionsonraí"
      },
      "wikipedia": {
        "title": "Wikipedia",
        "openLink": "Féach alt iomlán ag Vicipéid"
      }
    },
    "noDataMessage": "Ní mór dúinn a fuair aon rudaí."
  },
  "requestErrorMessage": "Tharla earráid. Is féidir leis an tseirbhís a bheith ar fáil faoi láthair."
}