{
  "bundleName": "Maršrutēšanas",
  "bundleDescription": "Šajā komplektā sniedz Virzieni logrīku no ArcGIS API JavaScript.",
  "tool": {
    "title": "Maršrutēšanas",
    "tooltip": "Rādīt maršrutu widget"
  },
  "printTemplate": {
    "printbutton": "Drukāt",
    "closebutton": "Aizvērt",
    "titleText": "Mans maršruts:",
    "notesPlaceholder": "Ievadiet piezīmes šeit",
    "routingSummaryETE": "Aprēķinātais laiks pa ceļam:",
    "routingSummaryDistance": "Attālums:",
    "footerText": "Virzieni ir paredzēti tikai plānošanas nolūkiem, un ir pakļauti <a href='http://www.esri.com/legal/software-license' target='_blank'>ESRI lietošanas noteikumiem</a> . Dinamiskās ceļa apstākļi var pastāvēt, kas izraisa precizitāti atšķirties no jūsu virzienos un ir jāņem vērā kopā ar zīmēm un juridiskajiem ierobežojumiem. Jūs uzņemties visu risku izmantošanas."
  },
  "units": {
    "hour": "stunda",
    "hours": "stundas",
    "minute": "minūte",
    "minutes": "protokols",
    "esriMillimeters": "mm",
    "esriCentimeters": "cm",
    "esriDecimeters": "dm",
    "esriMeters": "m",
    "esriKilometers": "km",
    "esriFeet": "ft",
    "esriInches": "uz",
    "esriMiles": "mi",
    "esriNauticalMiles": "nm",
    "esriUnknownUnits": "nezināms"
  }
}