{
  "bundleName": "AgolmapFinder",
  "bundleDescription": "Deze bundel zoekt naar beschikbare online kaarten in ArcGIS Online",
  "errorMessage": "Bij het laden van de Web Map met id '${webmapid}' is een fout opgetreden. Bericht: ${errorMsg}",
  "nodata": "De zoekopdracht heeft geen resultaten opgeleverd.",
  "store": {
    "title": "ArcGIS Online Web Map",
    "description": "Zoek ArcGIS Online Web Maps"
  },
  "tool": {
    "title": "ArcGIS Online zoeken",
    "tooltip": "ArcGIS Online zoeken"
  },
  "ui": {
    "id": "ID",
    "searchButtonLabel": "Beginnen met zoeken",
    "title": "Titel",
    "owner": "Eigenaar",
    "tags": "Tags",
    "description": "Groep beschrijving",
    "image": "Afbeelding",
    "snippet": "Beschrijving (uittreksel)",
    "created": "Gemaakt op",
    "from": "Uit",
    "to": "Naar",
    "omnisearch": "Zoeken naar AGOL Webmaps",
    "dataView": {
      "gridViewBtn": "Tafel",
      "iconViewBtn": "Pictogram",
      "filter": {
        "menuDefaultLabel": "Alle",
        "textBoxPlaceHolder": ""
      },
      "pager": {
        "backButtonText": "<",
        "backButtonTooltip": "Vorige pagina",
        "forwardButtonText": ">",
        "forwardButtonTooltip": "Komende pagina",
        "firstButtonText": "<<",
        "firstButtonTooltip": "Eerste pagina",
        "lastButtonText": ">>",
        "lastButtonTooltip": "Laatste pagina",
        "pageLabelText": "Pagina ${currentPage} van ${endPage}",
        "pageSizeLabelText": "Resultaten ${pageStartItemNumber}-${pageEndItemNumber} van ${itemCount}:",
        "zeroResultsText": "Geen resultaten."
      }
    }
  }
}