{
  "bundleName": "Ġestjoni qatta",
  "bundleDescription": "Jipprovdi interfaces għall-Ġestjoni qatta",
  "commonDelete": {
    "saveQuery": "Do you verament tixtieq li tħassar \"{number}\" oġġett (i)?",
    "error": "Tħassir ta 'oġġetti \"{items}\" naqset!",
    "partialSuccess": "Xi punti ma setgħux jiġu mħassra!",
    "errorFinish": "L-ebda punti ġie mħassar!",
    "success": "L-operazzjoni iħassar tlesta b'suċċess!"
  },
  "bundleListTool": {
    "title": "Qatet",
    "desc": "Lista ta 'gzuz"
  },
  "removeSelectedBundlesTool": {
    "title": "Ħassar",
    "desc": "Ħassar qatta"
  },
  "createBundleTool": {
    "title": "Upload",
    "desc": "Gzuz upload"
  },
  "dataViewCommon": {
    "filter": {
      "menuDefaultLabel": "Kollha",
      "textBoxPlaceHolder": ""
    },
    "pager": {
      "backButtonTooltip": "Paġna ta 'qabel",
      "forwardButtonTooltip": "Paġna li jmiss",
      "firstButtonTooltip": "L-ewwel paġna",
      "lastButtonTooltip": "Aħħar paġna",
      "pageLabeltext": "Paġna:",
      "pageSizeLabelText": "Riżultati ${pageStartItemNumber}-${pageEndItemNumber} ta '${itemCount}",
      "pageLabelText": "Paġna:"
    }
  },
  "bundlesView": {
    "noDataMessage": "M'hemm l-ebda qatet disponibbli ...",
    "name": "Isem",
    "version": "Verżjoni",
    "title": "Titolu",
    "desc": "Deskrizzjoni",
    "modifiedBy": "Modifikat Billi",
    "modifiedAt": "Modifikat Fuq"
  },
  "bundleDetailsView": {
    "windowTitle": "Bundle \"{id}\"",
    "createWindowTitle": "Gzuz upload",
    "name": "Isem",
    "version": "Verżjoni",
    "dependencies": "Dipendenzi:",
    "main": "Prinċipali fajl:",
    "layer": "Fajl Saff:",
    "location": "Location:",
    "title": "Titolu:",
    "description": "Deskrizzjoni:",
    "createdAt": "Maħluqa fuq:",
    "createdBy": "Maħluqa minn:",
    "modifiedAt": "Modifikat Fuq",
    "modifiedBy": "Modifikat Billi",
    "id": "ID:",
    "upload": "Upload",
    "uploaded": "100% - qatet huma estratti u importati",
    "updateError": "Qatta \"{id}\" ma setgħux jiġu salvati! {error}",
    "updateSuccess": "Qatta \"{id} \" succesfull salvati!",
    "uploadStart": "Tella beda!",
    "uploadError": "Tella 'żball:",
    "uploadFinished": "Tella titlesta!",
    "createBundleInfo": "<strong>Tella qatet tiegħek</strong> <br/><ul><li> Permissibli huma b'żipp jew vażett files </li><li> A fajl jista 'jkun fihom qatet multipli. </li></ul>",
    "panelDefaultTitle": "<strong>Informazzjoni Ġenerali</strong>",
    "panelExtendedTitle": "<strong>Informazzjoni Estiża</strong>",
    "panelJsonInfoTitle": "<strong>package.json</strong>"
  }
}