{
  "bundleName": "Výsledek Center",
  "bundleDescription": "Komponenta pro zobrazování výsledků vyhledávání.",
  "ui": {
    "dockTool": {
      "title": "Výsledek Center",
      "tooltip": "Výsledek Center"
    },
    "rectangleSelectBtn": {
      "title": "Vyberte výsledky na mapě"
    },
    "selectAllBtn": {
      "title": "Vybrat vše"
    },
    "deselectBtn": {
      "title": "Zrušit výběr"
    },
    "removeAllBtn": {
      "title": "Nenalezeno Center"
    },
    "removeSelectedBtn": {
      "title": "Odstranit vybrané položky z výsledku centra"
    },
    "searchStoreTool": {
      "title": "Prohlížet data"
    },
    "exportTool": {
      "title": "Export"
    },
    "dataView": {
      "filter": {
        "menuDefaultLabel": "Vše",
        "textBoxPlaceHolder": ""
      },
      "pager": {
        "backButtonTooltip": "Předchozí strana",
        "forwardButtonTooltip": "Další stránka",
        "firstButtonTooltip": "První strana",
        "lastButtonTooltip": "Poslední strana",
        "pageLabeltext": "Strana:",
        "pageSizeLabelText": "Výsledky ${pageStartItemNumber}-${pageEndItemNumber} z ${itemCount}:",
        "zeroResultsText": "Žádné zápasy",
        "pageLabelText": "Strana:"
      },
      "DGRID": {
        "noDataMessage": "Žádné údaje.",
        "loadingMessage": "Načítání dat ..."
      }
    },
    "newDataAvailable": "K dispozici jsou nové údaje"
  }
}