{
  "bundleName": "Scalebar Config Wizard Bundle",
  "bundleDescription": "Config Wizard Bundle of Scalebar",
  "menu": {
    "title": "Scalebar"
  },
  "widget": {
    "description": "Configuration for the scalebar.",
    "unit": "Unit",
    "showScaleTooltip": "Select a unit metric/miles/both. Meters & Miles work only if style is set to \"ruler\".",
    "metric": "Meters",
    "english": "Miles",
    "dual": "Meters & Miles",
    "style": "Style",
    "styleTooltip": "Select a style for the scale bar (ruler/line)",
    "ruler": "Ruler",
    "line": "Line"
  }
}