{
  "bundleName": "Samordna hitta",
  "bundleDescription": "Detta verktyg hjälper användaren att hitta platser vid ingången av geografiska koordinater.",
  "ui": {
    "invalidMessage": "Ogiltig koordinatformat!",
    "invalidDegreeCoordinates": "Ogiltig koordinatformat! <br /> <b>Beställning:</b> <br /> Longitud Latitud <br /> <b>Format Exempel:</b> <br /> 7.628694 51.962944 <br /> 7 ° 38'1 \"51 ° 58'1\"",
    "invalidMetricCoordinates": "Ogiltig koordinatformat! <br /> <b>Beställning:</b> <br /> Östlig Nordlig <br /> <b>Format Exempel:</b> <br /> 848860 6793187",
    "submitBtnTxt": "Ok",
    "toolTitle": "Hitta koordinater"
  }
}