{
  "bundleName": "Πλοήγηση εργαλείων",
  "bundleDescription": "Η γραμμή εργαλείων πλοήγησης παρέχει κλασικά εργαλεία που είναι διαθέσιμα πλοήγησης (όπως ζουμ σε πλήρη έκταση).",
  "ui": {
    "zoomInTool": {
      "title": "Μεγέθυνση",
      "tooltip": "Μεγέθυνση"
    },
    "zoomOutTool": {
      "title": "Μείωση",
      "tooltip": "Μείωση"
    },
    "panTool": {
      "title": "Κίνηση",
      "tooltip": "Κίνηση"
    },
    "zoomToNextExtent": {
      "title": "Επόμενη Έκταση",
      "tooltip": "Μετακίνηση στην επόμενη ενότητα χώρου"
    },
    "zoomToPrevExtent": {
      "title": "Προηγούμενο χώρο ενότητα",
      "tooltip": "Μετάβαση στην προηγούμενη ενότητα χώρου"
    },
    "zoomToFullExtent": {
      "title": "Πλήρης Έκταση",
      "tooltip": "Αλλαγή σε πλήρη έκταση"
    },
    "zoomToInitialExtent": {
      "title": "Αρχική τμήμα του χώρου",
      "tooltip": "Εναλλαγή στην αρχική επέκταση"
    },
    "zoomInClickTool": {
      "title": "Μεγέθυνση",
      "tooltip": "Μεγέθυνση"
    },
    "zoomOutClickTool": {
      "title": "Μείωση",
      "tooltip": "Μείωση"
    }
  }
}