{
  "bundleName": "Impressão",
  "bundleDescription": "Este pacote fornece uma ferramenta de impressão para imprimir o mapa.",
  "tool": {
    "title": "Impressão",
    "tooltip": "Impressão",
    "back": "De volta"
  },
  "resultWin": {
    "title": "Impressão"
  }
}