{
  "bundleName": "Zobrazení souřadnic",
  "bundleDescription": "Souřadnice displeji se zobrazí souřadnice a prostorový referenční systém na aktuální pozici myši. Kromě toho se zobrazí aktuální měřítko mapy.",
  "ui": {
    "coordinates": "<table><tr><td>${x}</td><td>:</td><td>${y}</td></tr><tr><td colspan='3'>${srs}</td></tr></table>",
    "scale": "Měřítko: 1: ${scale}",
    "noSrs": "-"
  },
  "hemispheres": {
    "north": "N",
    "south": "S",
    "east": "E",
    "west": "W"
  }
}