{
  "bundleName": "Estilo",
  "bundleDescription": "--FUNCIONALIDAD básica-- El paquete Temas gestiona toda la información CSS como colores, estilos de fuente, imágenes de fondo, etc. Los usuarios pueden cambiar entre diferentes miradas de los elementos de la interfaz de usuario mediante la selección de diferentes estilos.",
  "themes": {
    "pure": {
      "desc": "Estilo Las map.apps 'puro'."
    },
    "night": {
      "desc": "Los map.apps 'noche' estilo."
    }
  },
  "ui": {
    "selectorLabelTitle": "Estilo"
  }
}