{
  "bundleName": "Navigācijas rīkjosla",
  "bundleDescription": "Navigācijas rīkjosla nodrošina klasiskās pieejamos navigācijas līdzekļus (piemēram, tālummaiņa pilnā apjomā).",
  "ui": {
    "zoomInTool": {
      "title": "Palielināt",
      "tooltip": "Palielināt"
    },
    "zoomOutTool": {
      "title": "Samazināt",
      "tooltip": "Samazināt"
    },
    "panTool": {
      "title": "Pārvietot",
      "tooltip": "Pārvietot"
    },
    "zoomToNextExtent": {
      "title": "Nākamais Apjoms",
      "tooltip": "Pāriet uz nākamo kosmosa sadaļā"
    },
    "zoomToPrevExtent": {
      "title": "Iepriekšējā telpa sadaļa",
      "tooltip": "Doties uz iepriekšējo kosmosa nodaļā"
    },
    "zoomToFullExtent": {
      "title": "Pilnā apmērā",
      "tooltip": "Pārslēgties uz pilnu pagarinājumu"
    },
    "zoomToInitialExtent": {
      "title": "Sākotnējais posms telpu",
      "tooltip": "Pārslēgt uz sākotnējo paplašināšanos"
    },
    "zoomInClickTool": {
      "title": "Palielināt",
      "tooltip": "Palielināt"
    },
    "zoomOutClickTool": {
      "title": "Samazināt",
      "tooltip": "Samazināt"
    }
  }
}