{
  "bundleName": "Desenhar",
  "bundleDescription": "pacote desenho fornece as ferramentas de desenho e edição do usuário.",
  "commonDelete": {
    "saveQuery": "Você realmente quer apagar {number} item (s)?",
    "error": "Exclusão de itens '{items}' falhou!",
    "partialSuccess": "Alguns itens não poderia ser apagado!",
    "errorFinish": "Nenhum elemento foi eliminado!",
    "success": "A operação de apagamento concluída com sucesso!"
  },
  "ui": {
    "tools": {
      "moveScaleRotateVertices": {
        "title": "Editar gráfico",
        "tooltip": "Modificar um gráfico (clique em um gráfico para alternar o modo)"
      },
      "moveScaleRotate": {
        "title": "Mover, redimensionar, girar,",
        "tooltip": "Mover, dimensionar ou girar um gráfico"
      },
      "editVertices": {
        "title": "Editar nó",
        "tooltip": "Edite os vértices de um gráfico"
      },
      "deleteGraphic": {
        "title": "Excluir Gráficos",
        "tooltip": "Excluir Gráficos"
      }
    },
    "styleProperties": {
      "tool": {
        "title": "Propriedades de caracteres",
        "tooltip": "Propriedades de caracteres"
      },
      "presets": {
        "title": "Modelo",
        "deletePresetTool": "Excluindo um modelo",
        "editPresetTool": "Editar Modelo",
        "addPresetWidget": {
          "textboxPlaceHolder": "Salvar modelo ...",
          "buttonTooltip": "Salvar modelo ..."
        },
        "overwriteExistingItemMessageTitle": "Molde já existe",
        "overwriteExistingItemMessage": "Um modelo chamado '{itemName}' já existe. Se você quer o modelo para substituí-lo?",
        "overwritePreConfiguredItemTitle": "Erro",
        "overwritePreConfiguredItemMessage": "Você não pode substituir uma pré modelo configurado!",
        "dataview": {
          "pager": {
            "backButtonTooltip": "De volta",
            "forwardButtonTooltip": "Para a frente",
            "firstButtonTooltip": "Primeiro",
            "lastButtonTooltip": "Último",
            "pageLabelText": "Página ${currentPage} de ${endPage}",
            "zeroResultsText": "",
            "pageSizeLabelText": "${pageStartItemNumber} - ${pageEndItemNumber} de ${itemCount}"
          },
          "filter": {
            "menuDefaultLabel": "Tudo",
            "textBoxPlaceHolder": "Procurar ..."
          },
          "DGRID": {
            "noDataMessage": "Não armazenados modelos disponíveis.",
            "loadingMessage": "Carregando dados ...",
            "error": "Erro:"
          }
        },
        "presetStoreColumns": {
          "id": "Nome",
          "style": "Tipo",
          "preconfigured": "Configurado"
        },
        "notifier": {
          "saveSuccess": "Modelo '{itemName}' foi salva com sucesso.",
          "saveError": "Modelo '{itemName}' não pôde ser salvo. {error}",
          "applySuccess": "Modelo '{itemName}' foi aplicada com sucesso.",
          "applyError": "Template '{itemName}' não poderia ser aplicada. {error}"
        },
        "groups": {
          "font": "Texto",
          "stroke": "Linha",
          "fill": "Preencher",
          "symbol": "Símbolo",
          "marker": "Marcador"
        }
      },
      "text": {
        "title": "Texto",
        "fontFamily": "Fonte",
        "fontSize": "Tamanho da fonte",
        "fontColor": "Cor",
        "fontStyle": {
          "title": "Estilo",
          "bold": "Negrito",
          "italic": "Itálico",
          "underlined": "Sublinhar"
        },
        "fontTransparency": "Transparência"
      },
      "symbol": {
        "title": "Traço / preenchimento",
        "stroke": {
          "title": "Linha",
          "color": "Cor",
          "style": "Estilo",
          "width": "Largura",
          "transparency": "Transparência",
          "strokeval": {
            "none": "Nenhum"
          }
        },
        "fill": {
          "title": "Preencher",
          "color": "Cor",
          "pattern": "Padrão",
          "transparency": "Transparência",
          "patternval": {
            "none": "Nenhum",
            "solid": "Sólido",
            "vertical": "Preto Vertical",
            "horizontal": "Preto Horizontal",
            "backwarddiagonal": "Preto direito diagonal",
            "forwarddiagonal": "Preto Diagonal Esquerda",
            "cross": "Preto verificado",
            "diagonalcross": "Preto ruzadas"
          }
        }
      },
      "marker": {
        "title": "Marcador",
        "style": "Estilo",
        "size": "Tamanho",
        "styleval": {
          "circle": "Círculo",
          "square": "Quadrado",
          "cross": "Mais",
          "diamond": "Diamante",
          "x": "Cruz"
        }
      },
      "symbols": {
        "title": "Símbolos"
      }
    },
    "edit": {
      "activation": {
        "warn": "O gráfico selecionado não pode ser editado com a ferramenta atual.",
        "info": "Graphic selecionado."
      }
    },
    "drawpointtool": "Ponto: Desenha um ponto",
    "drawmultipointtool": "Número de pontos: Chama a vários pontos",
    "drawlinetool": "Linha: Desenhar uma linha reta",
    "drawpolylinetool": "Polilinha: Chama a várias linhas",
    "drawfreehandpolylinetool": "Polilinha sagacidade: Desenha um traço definido pelo usuário",
    "drawpolygontool": "Polygon: Desenha um polígono",
    "drawfreehandpolygontool": "Polígono de forma livre: Desenha um polígono definido livremente",
    "drawextenttool": "Mão livre retângulo: Desenha um retângulo definido livremente",
    "drawcircletool": "Círculo: desenha um círculo",
    "drawellipsetool": "Elipse: Desenha uma elipse",
    "drawrectangletool": "Retângulo: Desenhe um retângulo",
    "drawarrowtool": "Seta: Desenhe uma seta em qualquer direção",
    "drawleftarrowtool": "Seta para a esquerda: Desenhe uma chave de seta para a esquerda",
    "drawrightarrowtool": "Seta para a direita: Desenhe uma seta apontando para a direita",
    "drawuparrowtool": "Seta para cima: desenhar uma seta para cima tribunais",
    "drawdownarrowtool": "Seta para baixo: Desenhe uma seta apontando para baixo",
    "drawtriangletool": "Triângulo: Desenha um triângulo",
    "drawerasealltool": "Limpe todos os desenhos",
    "exportTool": "Exportar gráficos",
    "defaultInfoTemplate": {
      "title": "Desenho conjunto de ferramentas",
      "template": "<div> <span>ID: ${id}</span> <br/> <span>Tipo de Geometria: ${geometryType}</span> </div>"
    },
    "texteditor": {
      "tool": {
        "title": "Editor de Texto",
        "tooltip": "Escreva qualquer texto no cartão."
      }
    },
    "drawsymbol": {
      "tool": {
        "title": "Galeria Ícone",
        "tooltip": "Desenhe um símbolo da galeria símbolo."
      },
      "store": {
        "fields": {
          "title": "Título",
          "description": "Descrição"
        }
      },
      "dataview": {
        "pager": {
          "backButtonTooltip": "De volta",
          "forwardButtonTooltip": "Para a frente",
          "firstButtonTooltip": "Primeiro",
          "lastButtonTooltip": "Último",
          "pageLabelText": "Página ${currentPage} de ${endPage}",
          "zeroResultsText": "",
          "pageSizeLabelText": "${pageStartItemNumber} - ${pageEndItemNumber} de ${itemCount}"
        },
        "filter": {
          "menuDefaultLabel": "Tudo",
          "textBoxPlaceHolder": "Procurar ..."
        },
        "ICON": {
          "noDataMessage": "Nenhum símbolo!",
          "loadingMessage": "Carregando símbolos ..."
        }
      }
    }
  }
}