{
  "bundleName": "Startbildschirm",
  "bundleDescription": "Der Startbildschirm zeigt einen Fortschrittsbalken während die Anwendung gestartet wird.",
  "loadTitle": "Starte Anwendung '{appName}'",
  "loadBundle": "{percent}% - {startedBundles}/{maxBundlesToStart} - Lade {name}"
}