{
  "bundleName": "Το δικό του περιεχόμενο του Οδηγού ρύθμισης παραμέτρων Bundle",
  "bundleDescription": "Config Οδηγός Δέσμη έθιμο widget πληροφορίες",
  "menu": {
    "title": "Το περιεχόμενό μου"
  },
  "widget": {
    "window": {
      "title": "Όνομα",
      "saveDeleteQuery": "Θέλετε πραγματικά »{number}« διαγραφή καταχωρήσεων;",
      "editCustomInfoDefinitionTitle": "Επεξεργασία περιεχομένου",
      "newCustomInfoDefinitionTitle": "Δημιουργία νέου περιεχομένου"
    },
    "wizard": {
      "types": {
        "copyright": {
          "title": "Πνευματική ιδιοκτησία",
          "tooltip": "Εμφάνιση πληροφορίες πνευματικών δικαιωμάτων"
        },
        "disclaimer": {
          "title": "Άρνηση",
          "tooltip": "Εμφάνιση Αποποίηση"
        },
        "imprint": {
          "title": "Αποτύπωμα",
          "tooltip": "Εμφάνιση αποτύπωμα"
        },
        "info": {
          "title": "Πληροφορίες",
          "tooltip": "Εμφάνιση πληροφοριών"
        },
        "help": {
          "title": "Βοήθεια",
          "tooltip": "Εμφάνιση Βοήθεια"
        },
        "legend": {
          "title": "Θρύλος",
          "tooltip": "Εμφάνιση θρύλος"
        },
        "link": {
          "title": "Σύνδεσμος",
          "tooltip": "Προβολή συνδέσμου"
        },
        "custom": {
          "title": "Έθιμο"
        }
      },
      "generalPane": {
        "paneTitle": "Ρυθμίσεις Εργαλείο",
        "type": "Τύπος",
        "typeTooltip": "Επιλέξτε έναν τύπο για τον προκαθορισμένο πληροφορίες",
        "title": "Τίτλος",
        "titleTooltip": "Ορίστε έναν τίτλο για το εργαλείο",
        "tooltip": "Tooltip",
        "tooltipTooltip": "Ορίστε το κείμενο tooltip",
        "toolClass": "CSS εργαλεία κατηγορία",
        "toolClassTooltip": "Επιλέξτε ένα προαιρετικό κλάση CSS για το εικονίδιο κουμπί του εργαλείου"
      },
      "windowPane": {
        "paneTitle": "Ορίστε τις επιλογές παράθυρο",
        "title": "Τίτλος",
        "titleTooltip": "Επιλέξτε έναν τίτλο για το παράθυρο",
        "windowWidth": "Πλάτος",
        "windowWidthTooltip": "Πλάτος του παραθύρου",
        "windowHeight": "Ύψος",
        "windowHeightTooltip": "Ύψος του παραθύρου",
        "position": "Θέση",
        "positionTooltip": "Επιλέξτε τη θέση του παραθύρου",
        "center": "κεντρικά",
        "left": "αριστερά",
        "right": "δεξιά",
        "top": "κορυφή",
        "bottom": "κάτω μέρος",
        "modal": "Τροπικός",
        "modalTooltip": "Επιλέξτε αν το παράθυρο είναι τροπική",
        "draggable": "Κινητός",
        "draggableTooltip": "Επιλέξτε αν το παράθυρο είναι κινητό",
        "resizable": "Δυνατότητα αλλαγής μεγέθους",
        "resizableTooltip": "Επιλέξτε για να επιτρέψει την αλλαγή μεγέθους του παραθύρου",
        "closable": "Να κλείνει",
        "closableTooltip": "Επιλέξτε αν το παράθυρο μπορεί να κλείσει",
        "maximizable": "Μεγιστοποίηση",
        "maximizableTooltip": "Επιλέξτε αν το παράθυρο μεγιστοποιείται"
      },
      "contentPane": {
        "paneTitle": "Επιλέξτε αν θέλετε ένα δωρεάν περιεχόμενο ή ένα σύνδεσμο για να εμφανίσετε",
        "content": "Αυθαίρετη περιεχόμενο",
        "link": "Σύνδεσμος",
        "linkWidget": {
          "url": "URL",
          "urlTooltip": "Πληκτρολογήστε μια διεύθυνση URL",
          "newTab": "Άνοιγμα σε νέα καρτέλα / παράθυρο",
          "newTabTooltip": "Επιλέξτε αν θέλετε ο σύνδεσμος να ανοίξει σε νέα καρτέλα / παράθυρο"
        }
      }
    },
    "grid": {
      "removeCustomInfoTool": "Αφαιρέστε το δικό σας περιεχόμενο",
      "addCustomInfoTool": "Προσθήκη νέου περιεχομένου",
      "title": "Τίτλος",
      "dataView": {
        "DGRID": {
          "noDataMessage": "Δεν βρέθηκαν το δικό του περιεχόμενο."
        },
        "pager": {
          "pageSizeLabelText": "Περιεχόμενο ${pageStartItemNumber} - ${pageEndItemNumber} του ${itemCount}"
        }
      }
    }
  }
}