{
  "bundleName": "Taisomas konfigūracija",
  "bundleDescription": "Konfigūracijos paketas už redagavimo paketas.",
  "title": "Redagavimas",
  "description": "Nurodykite aplink geologine objektų redagavimo nustatymus.",
  "hint": "Norėdami naudoti redagavimo galimybes bent vienas požymis paslaugos turi būti pažymėti kaip redaguoti.",
  "widget": {
    "snapping": {
      "menuTitle": "Fotografuoja",
      "description": "Nustatykite surinkimo savybėmis.",
      "hint": "Pakeitę savybes būtina suaktyvinti aktyvius redagavimo įrankiai.",
      "componentEnabled": {
        "title": "Įjungti fotografuoja",
        "tooltip": "Visiškai įjungti / išjungti fotografuoja."
      },
      "alwaysSnap": {
        "title": "Visada pradėkite",
        "tooltip": "Kai įjungta Kaimaniniai visada aktyvus. Priešingu atveju turi būti naudojamas fotografuoja raktas."
      },
      "tolerance": {
        "title": "Tolerancija [px]",
        "tooltip": "Fotografuoja pikseliais tolerancija."
      }
    },
    "tools": {
      "menuTitle": "Redagavimo įrankiai",
      "description": "Pasirinkite laisvų redagavimo įrankiai.",
      "DefaultCreateFeatureTool": {
        "title": "Sukurti naują geoduomenis objektus",
        "tooltip": "Įjungti / Išjungti įrankis kurti naujų funkcijų."
      },
      "DeleteFeatureTool": {
        "title": "Išvalyti geoduomenis objektus",
        "tooltip": "Įjungti / Išjungti priemonę išbraukiant funkcijas."
      },
      "DefaultEditFeatureTool": {
        "title": "Redaguoti geoduomenis objektus",
        "tooltip": "Įjungti / Išjungti įrankis redagavimo funkcijos."
      }
    },
    "editmodes": {
      "menuTitle": "Redagavimas geoduomenis objektus",
      "description": "Redaguojami skelbimai geologine objektų.",
      "editAttributes": {
        "title": "Atributai gali būti redaguojami",
        "tooltip": "Įjungti / išjungti, kad būtų galima redaguoti atributus geoobjects / draudimas."
      },
      "editGeometry": {
        "title": "Geometrija yra redaguoti",
        "tooltip": "Įjungti / Išjungti leisti / neleisti remtis funkcija geometrijos redagavimą."
      }
    },
    "createmodes": {
      "menuTitle": "Kurti geoduomenis objektus",
      "description": "Tvarka geologine objektų parengimo.",
      "persistAfterFeatureDrawn": {
        "title": "Iš karto Išsaugoti geoduomenis objektus po piešimo",
        "tooltip": "Kai įjungta, pasirašė geoduomenis objektus saugomi karto baigus piešimo proceso, kitaip po spustelėdami Įrašyti."
      },
      "disableDrawToolAfterCreation": {
        "title": "Išjungti piešimo įrankį po sukūrimo",
        "tooltip": "Kai patikrino įrankis kuriant funkcijų yra išjungtas po taupymo funkciją. Priešingu atveju jis lieka aktyvus."
      }
    },
    "attachments": {
      "menuTitle": "Įrangos",
      "description": "Konfigūruoti tvirtinimo paramą.",
      "hint": "Įrangos yra tik tada, jei sukonfigūruotas funkcija serverio! <br/> Pakeitę savybes būtina suaktyvinti aktyvius redagavimo įrankiai.",
      "enable": {
        "title": "Leiskite priedų",
        "tooltip": "Kai įjungta, galima įkelti priedų esamiems geografiniams objektams. Tai įmanoma tik jei į vaidybinio serverio funkcija yra sukonfigūruotas."
      }
    }
  }
}