{
  "bundleName": "Helyszín információ",
  "bundleDescription": "Információ egy adott helyen.",
  "ui": {
    "tools": {
      "mainActivationTool": "Helyszín információ",
      "activationToolExtent": "Helyszín információ (téglalap szelekció)"
    },
    "result": {
      "type": "Típus",
      "adapter": "Szolgáltatás",
      "title": "Cím",
      "detailsUrl": "Link",
      "thumbnailUrl": "Thumbnail"
    },
    "content": {
      "image": {
        "title": "Kép",
        "goToImageButton": "Lépj a honlapunkon erre a képre",
        "sendByMailButton": "E-mail ezt a képet",
        "detailViewButtonLabel": "Részletek"
      },
      "wikipedia": {
        "title": "Wikipedia",
        "openLink": "Lásd teljes cikk Wikipedia"
      }
    },
    "noDataMessage": "Nem találtunk semmilyen tárgyat."
  },
  "requestErrorMessage": "Hiba történt. A szolgáltatás jelenleg nem elérhetők."
}