{
  "bundleName": "Konfiguracja narzędzia pomiarowe",
  "bundleDescription": "Pakiet Konfiguracja pakietu narzędzi pomiaru.",
  "menu": {
    "title": "Narzędzia pomiarowe"
  },
  "widget": {
    "description": "Konfiguracja narzędzi pomiarowych.",
    "finishWithButton": {
      "title": "Zatrzymanie pomiaru, klikając na przycisk",
      "tooltip": "Jeśli opcja jest włączona, wyświetlany jest przycisk do wykończenia rysunku. W przeciwnym razie kliknij dwukrotnie kończy rysunek."
    },
    "showTools": {
      "area": "Pokaż obszar pomiaru narzędzia",
      "distance": "Pokaż narzędziem pomiaru odległości",
      "location": "Pokaż narzędziem pomiaru położenia"
    },
    "defaultTool": {
      "title": "Domyślnie włączone narzędzie",
      "none": "Żaden",
      "area": "Obszar",
      "distance": "Dystans",
      "location": "Pozycja"
    },
    "defaultAreaUnit": {
      "title": "Urządzenie domyślne pole",
      "ACRES": "Acres",
      "SQUARE_MILES": "Kilometrów kwadratowych",
      "SQUARE_KILOMETERS": "Kilometrów kwadratowych",
      "HECTARES": "Ha",
      "SQUARE_YARDS": "Plac Yard",
      "SQUARE_FEET": "Metrów kwadratowych",
      "SQUARE_METERS": "Metr kwadratowy"
    },
    "defaultLengthUnit": {
      "title": "Jednostka długości Domyślnie",
      "MILES": "Km",
      "KILOMETERS": "Kilometr",
      "FEET": "Stopa",
      "METERS": "Metr",
      "YARDS": "Podwórze",
      "NAUTICAL_MILES": "Nautical Miles"
    },
    "defaultLocationUnit": {
      "title": "Standardowe współrzędne jednostkowe",
      "DECIMAL_DEGREES": "Stopień",
      "DEGREE_MINUTE_SECONDS": "DMS"
    }
  }
}