{
  "bundleName": "Übersichtskarten Konfiguration",
  "bundleDescription": "Das Konfigurationsbundle für die Übersichtskarte.",
  "menu": {
    "title": "Übersichtskarte"
  },
  "widget": {
    "description": "Bitte wählen Sie einen Dienst für die Übersichtskarte. Falls der Dienst mehr als eine Ebene zur Verfügung stellt, können Sie diese ebenfalls wählen.",
    "hint": "Neue Dienste können über das Menü 'Diensteverwaltung' hinzugefügt werden.",
    "service": "Kartendienst",
    "layers": "Kartenebene",
    "transparency": "Transparenz des Rechtecks",
    "color": "Farbe des Rechtecks",
    "allLayers": "Alle verfügbaren",
    "expandFactor": "Erweiterungs/Zoom-Faktor",
    "errorMessage": "Bitte wählen Sie mindestens eine Kartenebene aus!"
  }
}