{
  "bundleName": "Webmap-Config",
  "bundleDescription": "Este paquete proporciona los componentes de configuración para el paquete Webmaps.",
  "menu": {
    "title": "ArcGIS Online Webmaps"
  },
  "widget": {
    "description": "Configuración de ArcGIS Online Webmap",
    "webmaps": {
      "title": "Webmaps",
      "tooltip": "Lista de webmaps separados por comas."
    },
    "webmapsEnabled": {
      "title": "Webmaps Habilitado",
      "tooltip": "Lista de webmaps-subíndices que son para ser activado separados por comas. 0 representa el primer Mapa web, 1 para el segundo, etc."
    },
    "baseWebMapAsCategory": {
      "title": "Resumir la Capa de Mapa web básica (primera Mapa web) en una categoría",
      "tooltip": "Si la capa operativo de la base-Webmap ser encapsulado dentro de una categoría / un tema? Si no hay casilla está marcada, una categoría separada (por ejemplo, un Cover Flow en el mapa) se genera para cada capa."
    },
    "onlyAsOperationalLayer": {
      "title": "Webmaps son sólo temas adicionales",
      "tooltip": "Si webmaps sólo ser Categorías addional / temas? Si esta propiedad no está marcada, el primer mapa web reemplazará el contenido de mapas (incluyendo mapas base y punto inicial)."
    }
  }
}