{
  "bundleName": "teman-konfiguration",
  "bundleDescription": "Konfigurations bunt för teman bunten.",
  "menu": {
    "title": "Designtema"
  },
  "widget": {
    "description": "Val av designtema för appen. Designen Temat definierar utseende appen; Färger, ikoner, teckensnitt, etc.",
    "selectedTheme": {
      "title": "Valt designtema:",
      "tooltip": "Välj ett designtema som bör användas av appen"
    }
  }
}