{
  "bundleName": "Конфигурация Esri Locator услуга",
  "bundleDescription": "Конфигурация пакет за Esri Locator служба.",
  "menu": {
    "title": "Esri Locator Service"
  },
  "widget": {
    "description": "Конфигурация за търсене темата на Esri Locator Service.",
    "enabled": "Търси в активна",
    "enabledTooltip": "Активира темата за търсене, за да го използвате в търсенето Omni.",
    "defaultLabel": "Заместител",
    "defaultLabelTooltip": "Определя текста по подразбиране на полето за въвеждане на търсене (стойност е по избор).",
    "labelAttribute": "Заглавие атрибут",
    "labelAttributelTooltip": "Определя атрибут, който се използва за етикета на съвпадение търсене.",
    "pageSize": "Максимални резултати",
    "pageSizeTooltip": "Максимален брой попадения в резултатите (обхват: 0-100; 0 е неограничен).",
    "typingdelay": "Забавяне [MS]",
    "typingdelayTooltip": "Пауза между натисканията на клавишите, преди подаване на заявката (диапазон 0-1000 милисекунди)",
    "url": "URL на услугата",
    "urlTooltip": "URL на услугата за търсене REST крайна точка на."
  },
  "stores": {
    "locator": {
      "placeHolder": "Поставете име ..."
    }
  }
}