{
  "bundleName": "Nalazite Alat",
  "bundleDescription": "Alatna traka za navigaciju nudi klasične navigacijske alate dostupne (kao što su zumiranje na punoj mjeri).",
  "ui": {
    "zoomInTool": {
      "title": "Uvećati",
      "tooltip": "Uvećati"
    },
    "zoomOutTool": {
      "title": "Smanjiti",
      "tooltip": "Smanjiti"
    },
    "panTool": {
      "title": "Potez",
      "tooltip": "Potez"
    },
    "zoomToNextExtent": {
      "title": "Sljedeći Opseg",
      "tooltip": "Pomicanje na sljedeći prostor sekcije"
    },
    "zoomToPrevExtent": {
      "title": "Prethodna prostor odjeljak",
      "tooltip": "Idi na prethodnom poglavlju prostora"
    },
    "zoomToFullExtent": {
      "title": "Punoj mjeri",
      "tooltip": "Prebaci se na punu ekstenziju"
    },
    "zoomToInitialExtent": {
      "title": "Početni dio prostora",
      "tooltip": "Prebaci se na početne ekspanzije"
    },
    "zoomInClickTool": {
      "title": "Uvećati",
      "tooltip": "Uvećati"
    },
    "zoomOutClickTool": {
      "title": "Smanjiti",
      "tooltip": "Smanjiti"
    }
  }
}