{
  "bundleName": "Zväzkov Vedenie",
  "bundleDescription": "Poskytuje rozhranie pre správu zväzkov",
  "commonDelete": {
    "saveQuery": "Naozaj chcete zmazať '{number}' položku (y)?",
    "error": "Vymazanie položky '{items}' zlyhalo!",
    "partialSuccess": "Niektoré položky sa nedajú odstrániť!",
    "errorFinish": "Žiadny prvok bol zmazaný!",
    "success": "Operácia mazanie úspešne dokončená!"
  },
  "bundleListTool": {
    "title": "Zväzky",
    "desc": "Zoznam zväzkov"
  },
  "removeSelectedBundlesTool": {
    "title": "Vymazať",
    "desc": "Zmazať balík"
  },
  "createBundleTool": {
    "title": "Nahrať",
    "desc": "Nahrať balíčky"
  },
  "dataViewCommon": {
    "filter": {
      "menuDefaultLabel": "Všetko",
      "textBoxPlaceHolder": ""
    },
    "pager": {
      "backButtonTooltip": "Predchádzajúca strana",
      "forwardButtonTooltip": "Ďalšia stránka",
      "firstButtonTooltip": "Prvá strana",
      "lastButtonTooltip": "Posledná strana",
      "pageLabeltext": "Strana:",
      "pageSizeLabelText": "Výsledky ${pageStartItemNumber}-${pageEndItemNumber} z ${itemCount}",
      "pageLabelText": "Strana:"
    }
  },
  "bundlesView": {
    "noDataMessage": "Nie sú k dispozícii žiadne zväzky ...",
    "name": "Názov",
    "version": "Verzia",
    "title": "Názov",
    "desc": "Popis",
    "modifiedBy": "Zmenil",
    "modifiedAt": "Zmenená"
  },
  "bundleDetailsView": {
    "windowTitle": "Bundle \"{id} '",
    "createWindowTitle": "Nahrať balíčky",
    "name": "Názov",
    "version": "Verzia",
    "dependencies": "Závislosti:",
    "main": "Hlavné súbor:",
    "layer": "Súbor vrstva:",
    "location": "Miesto:",
    "title": "Názov:",
    "description": "Popis:",
    "createdAt": "Vytvorené:",
    "createdBy": "Vytvoril:",
    "modifiedAt": "Zmenená",
    "modifiedBy": "Zmenil",
    "id": "ID:",
    "upload": "Nahrať",
    "uploaded": "100% - zväzky sú extrahované a dovážajú",
    "updateError": "Balík \"{id} 'nemohol byť uložený! {error}",
    "updateSuccess": "Balík \"{id} 'úspešné zachránení!",
    "uploadStart": "Nahrať Začíname!",
    "uploadError": "Nahrať chyba:",
    "uploadFinished": "Nahrávanie dokončené!",
    "createBundleInfo": "<strong>Nahrajte svoje zväzky</strong> <br/><ul><li> Povolené je zips alebo jar súbory </li><li> Súbor môže obsahovať viac zväzkov. </li></ul>",
    "panelDefaultTitle": "<strong>Všeobecné informácie</strong>",
    "panelExtendedTitle": "<strong>Rozšírené informácie</strong>",
    "panelJsonInfoTitle": "<strong>package.json</strong>"
  }
}