{
  "bundleName": "Content Viewer",
  "bundleDescription": "Näyttää erilaisia ​​sisältöä.",
  "ui": {
    "unknownContentError": "Sisältö on tuntematon.",
    "graphicinfotool": {
      "title": "Elementti tiedot",
      "desc": "Elementti tiedot"
    },
    "content": {
      "defaultTitle": "Elementti",
      "grid": {
        "detailView": "Näytä tiedot",
        "key": "Omaisuus",
        "value": "Arvo"
      },
      "customTemplate": {
        "detailView": "Näytä tiedot"
      },
      "attachment": {
        "noAttachmentSupport": "Tämä kerros ei tue liitetiedostoja",
        "detailView": "Näytä tiedot"
      },
      "AGSDetail": {
        "title": "Tarkemmat tiedot",
        "print": "Painatus",
        "serviceMetadata": "Service Metadata",
        "serviceURL": "URL",
        "serviceCopyrights": "Tekijänoikeudet",
        "serviceTitle": "Otsikko",
        "pager": {
          "pageSizeLabel": "Ominaisuus ${currentPage} on ${endPage}"
        },
        "key": "Omaisuus",
        "value": "Arvo",
        "detailView": "Näytä tiedot"
      }
    }
  }
}