{
  "bundleName": "Street View configuratie",
  "bundleDescription": "Configuratie bundel voor Streetview bundel.",
  "menu": {
    "title": "Google Street View"
  },
  "widget": {
    "description": "Configuratie voor de functie van Google Street View.",
    "hint": "Zorg ervoor dat u gebruik maakt van Google Street View volgens de bepalingen en voorwaarden van Google.",
    "disableDoubleClickZoom": "Inzoomen op dubbelklikken",
    "panControlEnabled": "Enable navigatie controle",
    "scrollWheelZoomingEnabled": "Enable scroll-wheel zoom",
    "scrollWheelTurningEnabled": "Enable scroll-wiel draaien",
    "zoomControlEnabled": "Enable zoomregeling"
  }
}