{
  "bundleName": "Ruumiline Bookmarks",
  "bundleDescription": "Järjehoidjad kimp võimaldab salvestada ulatuses kaardil mitu järjehoidjat.",
  "ui": {
    "toolTitle": "Ruumiline Bookmarks",
    "clearButton": "Eemalda kõik järjehoidjad",
    "deleteMessage": "Kas tõesti kustutada kõik järjehoidjad?",
    "deleteTitle": "Oled sa selles kindel?",
    "deleteWarning": "See ei saa tagasi võtta!"
  }
}