{
  "bundleName": "Láimhseáil Paraiméadar",
  "bundleDescription": "Tá an bhainistíocht freagrach paraiméadar an t-iarratas ar aistriú na paraiméadair ón URL do na comhpháirteanna comhfhreagracha nuair a sheoladh.",
  "menu": {
    "title": "Uirlis Nasc"
  },
  "widget": {
    "description": "Chumrú an uirlis Nasc.",
    "showLink": {
      "title": "Féach ar Nasc",
      "tooltip": "Taispeáin bosca téacs go bhfuil an nasc parameterized leis an dearcadh léarscáil atá ann faoi láthair."
    },
    "showHTMLSnippet": {
      "title": "Taispeáin cód gur féidir a leabaithe i leathanach HTML.",
      "tooltip": "Taispeáin cód gur féidir a leabaithe i leathanach HTML."
    },
    "showMailToButton": {
      "title": "Taispeáin E-Mail cnaipe",
      "tooltip": "Taispeáin cnaipe a scríobh E-Mail ina bhfuil an nasc chuig an dearcadh léarscáil atá ann faoi láthair."
    },
    "showRefreshButton": {
      "title": "Taispeáin cnaipe Nuashonrú",
      "tooltip": "Taispeáin cnaipe a athnuachan na naisc sa dialóg."
    },
    "showQRCode": {
      "title": "Taispeáin QR cód",
      "tooltip": "Taispeáin cód QR íomhá."
    }
  }
}