{
  "bundleName": "Lestvica čarovnik zaslon konfiguracija Bundle",
  "bundleDescription": "Lestvica čarovnik zaslon konfiguracija Bundle",
  "menu": {
    "title": "Prikazovalna skala"
  },
  "widget": {
    "description": "Konfiguracija prikazovalnik.",
    "unit": "Enota",
    "showScaleTooltip": "Izberite enoto za zaslonu lestvici (m / Mil / oboje). Kombinirani zaslon deluje, ko je nastavljen postavitev \"linijo\".",
    "metric": "Meter",
    "english": "Miles",
    "dual": "Metrov in Miles",
    "style": "Postavitev",
    "styleTooltip": "Izberite postavitev za prikaz na zaslonu lestvici (vladar / linija)",
    "ruler": "Ravnilo",
    "line": "Line"
  }
}