{
  "bundleName": "Map Flow",
  "bundleDescription": "The Map Flow is used to switch between layer groups which focus on certain themes. It is a cover based UI element, referring to the Apple Cover Flow.",
  "tool": {
    "title": "Map Content",
    "tooltip": "Map Content"
  },
  "ui": {
    "transparency": "Transparency",
    "transparencyTooltip": "Change transparency",
    "zoomToTooltip": "Zoom to extent of category",
    "showDetailsTooltip": "Show detail information",
    "rotatorTooltip": "Rotate to front",
    "deleteTooltip": "Delete",
    "deleteQuestion": "Do you really want to delete this item?"
  }
}