{
  "bundleName": "Konzola",
  "bundleDescription": "Konzola pomaže upravljati i nadzirati instaliran paket. To također pokazuje usluge, komponente i prijavite poruke.",
  "ui": {
    "windowTitle": "Konzola",
    "bundleTab": "Skupovi",
    "bundlesStoreFields": {
      "id": "ID",
      "name": "Naziv",
      "description": "Opis",
      "state": "Status",
      "autostartPolicy": "Automatsko pokretanje politika",
      "symbolicName": "Simboličko ime",
      "version": "Verzija",
      "startLevel": "Početak Razina",
      "vendor": "Davatelj",
      "location": "Mjesto"
    },
    "servicesTab": "Usluge",
    "servicesStoreFields": {
      "id": "ID",
      "provides": "Sučelja",
      "bundle": "Snop",
      "component": "Sastavni",
      "properties": "Nekretnine"
    },
    "componentsTab": "Dijelovi",
    "componentsStoreFields": {
      "id": "ID",
      "name": "Naziv",
      "state": "Status",
      "properties": "Nekretnine",
      "instances": "Slučajevi",
      "log": "Prijavite",
      "bundleName": "Snop"
    },
    "messagesTab": "Poruke",
    "messagesStoreFields": {
      "level": "Nivo",
      "time": "Vrijeme",
      "message": "Kratki opis",
      "announcement": "Poruka"
    },
    "tools": {
      "bundles": {
        "start": {
          "title": "Početak Skupovi",
          "tooltip": "Početak odabrane Skupovi"
        },
        "stop": {
          "title": "Zaustavite Skupovi",
          "tooltip": "Prestanite Odabrane Skupovi"
        }
      },
      "components": {
        "configure": {
          "title": "Konfiguracija Komponenta",
          "tooltip": "Konfiguracija odabrane komponente"
        }
      }
    },
    "dataView": {
      "pager": {
        "backButtonTooltip": "Natrag",
        "forwardButtonTooltip": "Naprijed",
        "firstButtonTooltip": "Prva stranica",
        "lastButtonTooltip": "Posljednja stranica",
        "pageLabelText": "Stranica ${currentPage} od ${endPage}",
        "zeroResultsText": "",
        "pageSizeLabelText": "${pageStartItemNumber} - ${pageEndItemNumber} od ${itemCount}"
      },
      "filter": {
        "menuDefaultLabel": "Sve",
        "textBoxPlaceHolder": "Potražite ..."
      },
      "DGRID": {
        "noDataMessage": "Nema podataka.",
        "loadingMessage": "Učitavanje podataka ..."
      }
    },
    "dataFormNotInstalled": "Dataform paket nije instaliran. Da biste omogućili značajku konfiguraciji komponenti dodati dataform zavežljaj na svom app.json datoteku."
  }
}