{
  "bundleName": "Čarovnik zaznamki konfiguracija snop",
  "bundleDescription": "Konfiguracija čarovnik snop Zaznamki widget",
  "menu": {
    "title": "Prostorski Zaznamki"
  },
  "widget": {
    "description": "Konfiguracija zaznamki",
    "editable": "Dovoli meri zaznamki",
    "localStorageKey": "Ime lokalno shranjevanje",
    "predefinedBookmarks": "Vnaprej določenih zaznamki",
    "predefinedBookmarksHint": "Možno je, da prefine seznam zaznamkov. Ti zaznamki bodo na voljo vsem uporabnikom privzeto. Premaknete zemljevid do želene mere, in jo shranite."
  }
}