{
  "bundleName": "Trekken",
  "bundleDescription": "Tekening bundel biedt de gebruiker teken- en editing tools.",
  "commonDelete": {
    "saveQuery": "Wil je echt wilt {number} artikel (en) wilt verwijderen?",
    "error": "Schrapping van de items '{items}' mislukt!",
    "partialSuccess": "Sommige items kunnen niet worden verwijderd!",
    "errorFinish": "Geen enkel items is verwijderd!",
    "success": "Het wissen met succes afgerond!"
  },
  "ui": {
    "tools": {
      "moveScaleRotateVertices": {
        "title": "Grafische bewerken",
        "tooltip": "Wijzigen van een afbeelding (klik op een afbeelding om de modus te schakelen)"
      },
      "moveScaleRotate": {
        "title": "Verplaatsen, schalen, roteren,",
        "tooltip": "Verplaatsen, schalen of roteren van een grafische"
      },
      "editVertices": {
        "title": "Knooppunt bewerken",
        "tooltip": "Bewerk de hoekpunten van een grafische"
      },
      "deleteGraphic": {
        "title": "Verwijderen grafische",
        "tooltip": "Verwijderen grafische"
      }
    },
    "styleProperties": {
      "tool": {
        "title": "Karakter eigenschappen",
        "tooltip": "Karakter eigenschappen"
      },
      "presets": {
        "title": "Sjablonen",
        "deletePresetTool": "Een sjabloon verwijderen van",
        "editPresetTool": "Sjabloon bewerken",
        "addPresetWidget": {
          "textboxPlaceHolder": "Opslaan Sjabloon ...",
          "buttonTooltip": "Opslaan Sjabloon ..."
        },
        "overwriteExistingItemMessageTitle": "Sjabloon bestaat reeds",
        "overwriteExistingItemMessage": "Een sjabloon met de naam '{itemName}' bestaat al. Als u de sjabloon wilt overschrijven?",
        "overwritePreConfiguredItemTitle": "Fout",
        "overwritePreConfiguredItemMessage": "U kunt een vooraf geconfigureerde sjabloon niet overschrijven!",
        "dataview": {
          "pager": {
            "backButtonTooltip": "Terug",
            "forwardButtonTooltip": "Vooruit",
            "firstButtonTooltip": "Eerste",
            "lastButtonTooltip": "Laatste",
            "pageLabelText": "Pagina ${currentPage} van ${endPage}",
            "zeroResultsText": "",
            "pageSizeLabelText": "${pageStartItemNumber} - ${pageEndItemNumber} van ${itemCount}"
          },
          "filter": {
            "menuDefaultLabel": "Alle",
            "textBoxPlaceHolder": "Zoek Naar ..."
          },
          "DGRID": {
            "noDataMessage": "Geen opgeslagen templates beschikbaar.",
            "loadingMessage": "Het laden van gegevens ...",
            "error": "Fout:"
          }
        },
        "presetStoreColumns": {
          "id": "Naam",
          "style": "Type",
          "preconfigured": "Geconfigureerd"
        },
        "notifier": {
          "saveSuccess": "Sjabloon '{itemName}' is opgeslagen.",
          "saveError": "Sjabloon '{itemName}' kan niet worden opgeslagen. {error}",
          "applySuccess": "Sjabloon '{itemName}' is met succes toegepast.",
          "applyError": "Sjabloon '{itemName}' kan niet worden toegepast. {error}"
        },
        "groups": {
          "font": "Tekst",
          "stroke": "Lijn",
          "fill": "Vullen",
          "symbol": "Symbool",
          "marker": "Fiche"
        }
      },
      "text": {
        "title": "Tekst",
        "fontFamily": "Doopvont",
        "fontSize": "Lettertypegrootte",
        "fontColor": "Kleur",
        "fontStyle": {
          "title": "Stijl",
          "bold": "Gedurfd",
          "italic": "Cursief",
          "underlined": "Onderstrepen"
        },
        "fontTransparency": "Doorzichtigheid"
      },
      "symbol": {
        "title": "Beroerte / Vullen",
        "stroke": {
          "title": "Lijn",
          "color": "Kleur",
          "style": "Stijl",
          "width": "Breedte",
          "transparency": "Doorzichtigheid",
          "strokeval": {
            "none": "Geen"
          }
        },
        "fill": {
          "title": "Vullen",
          "color": "Kleur",
          "pattern": "Patroon",
          "transparency": "Doorzichtigheid",
          "patternval": {
            "none": "Geen",
            "solid": "Solide",
            "vertical": "Zwarte verticale",
            "horizontal": "Zwarte Horizontale",
            "backwarddiagonal": "Zwart rechts diagonaal",
            "forwarddiagonal": "Zwart links diagonaal",
            "cross": "Zwarte Gecontroleerd",
            "diagonalcross": "Zwart gekruist"
          }
        }
      },
      "marker": {
        "title": "Fiche",
        "style": "Stijl",
        "size": "Grootte",
        "styleval": {
          "circle": "Cirkel",
          "square": "Vierkant",
          "cross": "Plus",
          "diamond": "Diamant",
          "x": "Kruis"
        }
      },
      "symbols": {
        "title": "Symbolen"
      }
    },
    "edit": {
      "activation": {
        "warn": "De geselecteerde afbeelding kan niet worden bewerkt met het huidige gereedschap.",
        "info": "Grafische geselecteerd."
      }
    },
    "drawpointtool": "Punt: Tekent een punt",
    "drawmultipointtool": "Aantal punten: Tekent een aantal punten",
    "drawlinetool": "Lijn: Trek een rechte lijn",
    "drawpolylinetool": "Polylijn: Tekent meerdere regels",
    "drawfreehandpolylinetool": "Uit de vrije hand polylijn: Tekent een door de gebruiker gedefinieerde trace",
    "drawpolygontool": "Polygoon: Tekent een veelhoek",
    "drawfreehandpolygontool": "Uit de vrije hand  Polygon: Tekent een veelhoek vrij definieerbare",
    "drawextenttool": "Uit de vrije hand rechthoek: Tekent een rechthoek vrij definieerbare",
    "drawcircletool": "Cirkel: Tekent een cirkel",
    "drawellipsetool": "Ellips: Tekent een ellips",
    "drawrectangletool": "Rechthoek: Teken een rechthoek",
    "drawarrowtool": "Pijl: Teken een pijl in elke richting",
    "drawleftarrowtool": "Pijl naar links: Teken een pijl links-toets",
    "drawrightarrowtool": "Pijl naar rechts: Teken een pijl naar rechts",
    "drawuparrowtool": "Pijl omhoog: Teken een opwaartse pijl rechtbanken",
    "drawdownarrowtool": "Pijl omlaag: Teken een pijl naar beneden",
    "drawtriangletool": "Driehoek: Tekent een driehoek",
    "drawerasealltool": "Wis alle tekeningen",
    "exportTool": "Graphics export",
    "defaultInfoTemplate": {
      "title": "Tekenwerkset",
      "template": "<div> <span>ID: ${id}</span> <br/> <span>Soort meetkunde: ${geometryType}</span> </div>"
    },
    "texteditor": {
      "tool": {
        "title": "Text Editor",
        "tooltip": "Schrijf elke tekst op de kaart."
      }
    },
    "drawsymbol": {
      "tool": {
        "title": "Icoon galerij",
        "tooltip": "Teken een symbool uit het symbool galerij."
      },
      "store": {
        "fields": {
          "title": "Titel",
          "description": "Beschrijving"
        }
      },
      "dataview": {
        "pager": {
          "backButtonTooltip": "Terug",
          "forwardButtonTooltip": "Vooruit",
          "firstButtonTooltip": "Eerste",
          "lastButtonTooltip": "Laatste",
          "pageLabelText": "Pagina ${currentPage} van ${endPage}",
          "zeroResultsText": "",
          "pageSizeLabelText": "${pageStartItemNumber} - ${pageEndItemNumber} van ${itemCount}"
        },
        "filter": {
          "menuDefaultLabel": "Alle",
          "textBoxPlaceHolder": "Zoek Naar ..."
        },
        "ICON": {
          "noDataMessage": "Geen symbolen!",
          "loadingMessage": "Laden symbolen ..."
        }
      }
    }
  }
}