{
  "bundleName": "Mapa Sprievodca konfiguráciou Balík",
  "bundleDescription": "Balíček Map riadi hlavnú mapu a všetky informácie mapa obsahu. Klient môže abstraktné služby použité v hierarchickom modeli mapy tak, že môžu byť zobrazené rôznymi spôsobmi pre užívateľa.",
  "menu": {
    "mapstate": {
      "title": "Mapa Rozsah"
    },
    "mapmodel": {
      "title": "Mapa obsah"
    },
    "mrrbuilder": {
      "title": "Služby v oblasti riadenia"
    },
    "mapoptions": {
      "title": "Možnosti Mapa"
    }
  },
  "commonDelete": {
    "saveQuery": "Naozaj chcete zmazať '{number}' položku (y)? Upozornenie :! Systém môže byť nekonzistentné, ak odstránite služby uvádzané ostatnými zložkami <b>V súčasnej dobe žiadne trvalé kontroly vykonávali!</b>",
    "error": "Vymazanie položky '{items}' zlyhalo!",
    "partialSuccess": "Niektoré položky sa nedajú odstrániť!",
    "errorFinish": "Žiadny prvok bol zmazaný!",
    "success": "Operácia mazanie úspešne dokončená!"
  },
  "serviceDetails": {
    "windowTitle": "Service '{id}'",
    "newServiceId": "Nový",
    "url": "URL:",
    "urltooltip": "Prosím, zadajte presný koncový bod služby url tu! napr http://services.arcgisonline.com/ArcGIS/rest/services/World_Topo_Map/MapServer",
    "title": "Názov:",
    "titletooltip": "Prosím, zadajte názov pre službu",
    "description": "Popis:",
    "descriptiontooltip": "Zadajte prosím popis služby",
    "type": "Typ:",
    "typetooltip": "Prosím, vyberte si platný typ služby",
    "layer": "Vrstva:",
    "layertooltip": "Tu môžete zadať metadáta vrstvy služby, ktoré sú štruktúrované takto: <pre> [{\n  \"id\": \"0\",\n  \"title\": \"My Layer\"\n}, ...] </pre>",
    "options": "Voľby:",
    "optionstooltip": "<p> Tu môžete zadať špeciálny možnosti pre služby stavbu, štruktúrované ako: <pre> {\n  \"optionName\": \"optionValue\",\n  ...\n} </pre></p><p> Napríklad, opacita služby môže byť konfigurovaný nasledujúcim spôsobom: <pre> {\n  \"opacity\": 0,5\n} </pre></p>",
    "fetchMetadata": "Načítať metadáta",
    "fetchMetadatatooltip": "Kliknutím na toto tlačidlo pre načítanie konfigurácie metadáta z adresy URL. Vezmite prosím na vedomie, že všetky zadané metadáta budú prepísané údajov poskytovaných službou!",
    "fetchMetadataDesc": "To bude fungovať pre typy služieb \"AGS_DYNAMIC\", \"AGS_FEATURE\" a \"AGS_TILED\". Avšak, iné typy služieb môžu byť pridané ručne s touto formou.",
    "fetchError": "Pripojenie k službe '{url}' zlyhalo! {error}",
    "updateError": "Aktualizácia služby \"{id} 'zlyhalo! {error}",
    "updateSuccess": "Služby '{id}' úspešne aktualizované!"
  },
  "mrrBuilderWidget": {
    "createNewTitle": "Vytvoriť nový uzol",
    "removeServiceTool": "Odstrániť službu",
    "addServiceTool": "Pridať novú službu",
    "dataView": {
      "filter": {
        "menuDefaultLabel": "[All]",
        "textBoxPlaceHolder": ""
      },
      "noDataFound": "Žiadne dostupné služby ...",
      "pager": {
        "pageLabelText": "Strana ${currentPage} z ${endPage}",
        "backButtonTooltip": "Predchádzajúca strana",
        "forwardButtonTooltip": "Ďalšia stránka",
        "firstButtonTooltip": "Prvá strana",
        "lastButtonTooltip": "Posledná strana",
        "pageSizeLabelText": "Výsledky ${pageStartItemNumber}-${pageEndItemNumber} z ${itemCount}"
      }
    },
    "categories": {
      "id": "Názov",
      "title": "Názov",
      "serviceUrl": "URL",
      "serviceType": "Typ"
    }
  },
  "mapModelBuilderWidget": {
    "description": "V tomto okne sa karty spolu Táto aplikácia môže byť definovaná tému a pozadia vrstvy. Na ľavej strane sa zobrazia všetky dostupné služby. Tie môžu byť pretiahnuť do rovín v stredu.",
    "hint": "Nové služby môžu byť pridané pomocou menu \"Služby v oblasti riadenia\".",
    "categoryDescription": "Popis:",
    "categoryDescriptionTooltip": "Popis služby",
    "categoryTitle": "Názov:",
    "categoryTitleTooltip": "Názov služby",
    "imageUrl": "URL pre Map Cover Flow obrázku:",
    "imageUrlTooltip": "URL pre Map Cover Flow obrázku (veľkosť: 267x159 px, formáty: jpg, png, gif)",
    "defaultEnabled": "Kategória povolený štartu:",
    "defaultEnabledTooltip": "Skontrolujte nastavenia služby, aby bolo možné na spustenie aplikácie.",
    "detailsPaneTitle": "Nastavenie služby Change <b>\"{category.title}\"</b>",
    "detailsPaneService": "Na službe základe <b>\"{service}\"</b>",
    "transparencySlider": "Transparentnosť:",
    "mapFlowPaneTitle": "<b>Map Flow Nastavenie</b> <br /> Ak používate Map Flow, môžete definovať vlastnosti (opis a obrázok) v nasledujúcej časti.",
    "detailsHint": "Vyberte uzol pre nastavenie detailov ...",
    "servicesHint": "Pretiahnutím službu tu ...",
    "servicesTitle": "Služby",
    "detailsTitle": "Podrobnosti",
    "operationalLayer": "Prevádzková vrstva",
    "baseLayer": "Základná vrstva",
    "chooseLayers": "Zvoliť, ktoré vrstvy by mali byť zahrnuté do prevádzky, a v prípade, že by mala byť viditeľná na počiatku.",
    "layerHead": "<b>Vrstva</b>",
    "layerVisibleHead": "<b>Počiatočné viditeľný</b>",
    "layerVisibleTooltip": "Skontrolujte nastavenie predvolené viditeľný stav vrstvy <b>\"{title}\".</b>",
    "layerIncludeHead": "<b>Zahrnúť</b>",
    "layerIncludeTooltip": "Skontrolujte, či zahrnúť vrstva <b>\"{title}\".</b>",
    "editable": "Editable",
    "editableTooltip": "Skontrolujte, či umožní editáciu na túto službu"
  },
  "mapStateWidget": {
    "description": "Mapa rozsah definuje viditeľnej časti mapy. Prosím, vyberte metódu pre stanovenie počiatočnej mapy rozsahu.",
    "checkBoxApplyMainMapState": "Nastavte mapa miere ryžovanie hlavného mapu",
    "setExtentManually": "Zadajte ručne v hodnôt v rozsahu mapy",
    "spatialReference": "Priestorové referenčný systém:",
    "errorMessage": "Skontrolujte súradníc!"
  },
  "mapOptionsWidget": {
    "description": "S nasledujúce nastavenia rôzne možnosti mapu možno definovať.",
    "slider": {
      "label": "Show zoom slider",
      "tooltip": "Zobrazte posuvník zoomu na mape"
    },
    "sliderStyle": {
      "label": "Štýl Posuvník zoomu",
      "tooltip": "Pomocou malého alebo štandardný zoom jazdec",
      "type": {
        "small": "malý",
        "large": "veľký"
      }
    },
    "nav": {
      "label": "Zobraziť navigačné šípky",
      "tooltip": "Určuje, ak sa zobrazí navigačné šípky v rohoch mapy."
    },
    "logo": {
      "label": "šou \"powered-by\" logo",
      "tooltip": "Určuje, v prípade, že \"powered-by\" logo je zobrazené na mape."
    },
    "doubleClickZoom": {
      "label": "Povoliť zväčšenie na dvojklikom",
      "tooltip": "Určuje, ak zoom je možné dvojitým kliknutím."
    },
    "clickRecenter": {
      "label": "Centrum stlačením tlačidla [Shift] + Click",
      "tooltip": "Určuje, ak Centrum na mape je povolené stlačením tlačidla [Shift] a kliknite na tlačidlo myši."
    },
    "keyboardNavigation": {
      "label": "Povoliť navigácia z klávesnice",
      "tooltip": "Určuje, ak klávesnica navigácia je povolené."
    },
    "scrollWheelZoom": {
      "label": "Povoliť zoomovanie by kolieska myši",
      "tooltip": "Určuje, ak priblíženie by kolieska myši je povolené."
    },
    "sliderPosition": {
      "label": "Pozícia jazdca zoomu",
      "tooltip": "Pozícia jazdca zoomu (\"vľavo hore\", \"vpravo hore\", \"vpravo dole\" alebo \"v ľavom dolnom rohu\")",
      "position": {
        "topLeft": "vľavo hore",
        "topRight": "vpravo hore",
        "bottomLeft": "v ľavom dolnom rohu",
        "bottomRight": "vpravo dole"
      }
    },
    "displayGraphicsOnPan": {
      "label": "Zobraziť grafika kým ryžovanie",
      "tooltip": "Ak je povolené, grafika pri pohybe mapou zobraziť. Vypnutie tejto voľby môže zvýšiť výkon pri Internet Explorer."
    },
    "navigationMode": {
      "label": "Režim Navigation",
      "tooltip": "Označuje, či mapa využíva CSS3 transformáciou pri posúvaní a zväčšovanie (pokiaľ je podporované v prehliadači).",
      "csstransform": "CSS-transformácia",
      "classic": "klasický"
    },
    "fadeOnZoom": {
      "label": "Zvädnúť na zväčšenie",
      "tooltip": "Ak je povolené, podporované vrstvy sa prekrývajú pri zoomovaní. V súčasnej dobe to je podporovaný iba u kachľových vrstvy a navigačné režim musí byť nastavený na \"css-transformácia\" zákona."
    },
    "showAttribution": {
      "label": "Zobraziť informácie o copyright",
      "tooltip": "Ak je povolené, autorské práva sú zobrazené informácie o zobrazených vrstiev v mape."
    },
    "sliderOrientation": {
      "label": "Orientácia posuvník zoomu",
      "tooltip": "Definuje zarovnanie ovládač priblíženia (\"vertikálne\" alebo \"horizontálne\").",
      "show": "šou",
      "hide": "skryť",
      "orientation": {
        "horizontal": "horizontálne",
        "vertical": "vertikálne"
      }
    },
    "sliderLabels": {
      "label": "Zobraziť zoom posuvníka štítky",
      "tooltip": "Určuje, či sú popisky zobrazené vedľa posuvníka zoomu. (Funguje iba s \"veľkým\" jazdca.)",
      "labels": {
        "country": "Krajiny",
        "region": "Kraj",
        "town": "Mesto"
      }
    }
  }
}