{
  "bundleName": "Live-konfigurationsmenuen",
  "bundleDescription": "Menu for levende konfiguration af en app.",
  "ui": {
    "title": "Live-konfiguration",
    "entry": "Adgang",
    "entries": "Angivelser",
    "noEntries": "I øjeblikket er der ingen emner i denne kategori",
    "chooseCategory": "Vælg en mulighed",
    "buttons": {
      "back": "Tilbage",
      "apply": "Opdater eksempel",
      "save": "Gem App"
    },
    "dataFormBuilderWidget": {
      "defaultValidationErrorMessage": "Kontroller dit input (s)!"
    },
    "saveStart": "Lagring i gang!",
    "saveError": "Gem mislykkedes! {message}",
    "saveSuccess": "Succes!",
    "unknownError": "Ukendt fejl!",
    "notAppliedConfigChanges": "Ikke anvendte konfigurationsændringer opdaget! Bør de anvendes?",
    "loadConfigBundles": "<p> Initialisering konfiguration bundter ({pos} / {count}). <br/> Vær tålmodig. </p>",
    "configureBtn": "Live-konfiguration",
    "bundleStart": "På",
    "bundleStartMessage": "Opret Bundle '{name} ({symname})'",
    "bundleStartMessageSuccess": "Start bundt '{name} ({symname})' med succes!",
    "bundleStartMessageFailure": "Start bundt '{name} ({} symname) misbrugt! {error}",
    "bundleStop": "Af",
    "bundleStopMessage": "Stop Bundle '{name} ({symname})'",
    "bundleStopMessageSuccess": "Stop bundt '{name} ({symname})' med succes!",
    "bundleStopMessageFailure": "Stop bundt '{name} ({symname})! {error}",
    "bundleInfo": {
      "components": "Komponenter",
      "bundleIdentifier": "Identifikator",
      "bundleName": "Navn",
      "bundleDescription": "Beskrivelse",
      "bundleVersion": "Version",
      "bundleLocation": "Url",
      "bundleCopyRight": "Copyright",
      "bundleState": "Status",
      "bundleVendor": "Producent",
      "bundleCategory": "Kategorier",
      "bundleContactAddress": "Kontakt Adresse",
      "bundleDocUrl": "Dokumentation",
      "bundleLicense": "Licens",
      "bundleLicenseUrl": "Licens Url"
    },
    "componentInfo": {
      "component": "Komponent",
      "componentIdentifier": "Identifikator",
      "componentName": "Navn",
      "componentState": "Status",
      "componentInstances": "Forekomster",
      "componentLog": "Log",
      "jsonError": "Ugyldigt JSON format: {error}",
      "commonDescription": "Du kan ændre konfigurationen af en komponent ved at redigere konfigurationen JSON her. <b>Vær forsigtig!</b>",
      "factoryCreateHint": "Denne komponent er en \"Component Factory\"! Definition af en ny konfiguration vil oprette en ny komponent!",
      "factoryDeleteHint": "Denne komponent er en \"Component Factory-punkt! Rydning af tekstfeltet vil slette komponent!",
      "notConfigurableHint": "Denne komponent kan ikke konfigureres."
    }
  },
  "menu": {
    "main": {
      "title": "Live-konfiguration"
    },
    "content": {
      "title": "Indhold",
      "description": "Definer indhold: Services, kort model, kort stat ..."
    },
    "widgets": {
      "title": "Widgets",
      "description": "Vælg en widget"
    },
    "search": {
      "title": "Search & Selection",
      "description": "Vælg en søgning og udvælgelse option"
    },
    "tools": {
      "title": "Værktøj",
      "description": "Definerer værktøjer, der kan anvendes i denne app"
    },
    "design": {
      "title": "Layout & Design",
      "description": "Definerer det visuelle layout og design af app"
    },
    "bundles": {
      "title": "Avanceret konfiguration (bundter)"
    }
  }
}