{
  "bundleName": "Oversigtskort",
  "bundleDescription": "Oversigtskort giver bedre orientering til brugeren ved at vise det nuværende omfang af kortet i en mindre skaleret kort inden et adskilt vindue.",
  "tool": {
    "title": "Oversigtskort",
    "tooltip": "Vis oversigtskort"
  }
}