{
  "bundleName": "Szerkesztési konfiguráció",
  "bundleDescription": "Konfigurációs csomagot a szerkesztő csomagot.",
  "title": "Szerkesztés",
  "description": "Adja meg a beállítások körül szerkesztése geo-objektumok.",
  "hint": "Ahhoz, hogy a szerkesztési lehetőségek legalább egy jellemző szolgáltatásokat kell megjelölni szerkeszthető.",
  "widget": {
    "snapping": {
      "menuTitle": "Harapós",
      "description": "Állítsa be a felvétel tulajdonságait.",
      "hint": "Módosítása után tulajdonságai szükséges aktiválnia a jelenleg aktív szerkesztő eszközök.",
      "componentEnabled": {
        "title": "Engedélyezze Harapós",
        "tooltip": "Teljesen engedélyezése / tiltása harapós."
      },
      "alwaysSnap": {
        "title": "Mindig indul",
        "tooltip": "Ha engedélyezve van harapós mindig aktív. Ellenkező esetben a harapós kulcsot kell használni."
      },
      "tolerance": {
        "title": "Tolerancia [px]",
        "tooltip": "A tolerancia harapós pixel."
      }
    },
    "tools": {
      "menuTitle": "Szerkesztő eszközök",
      "description": "Válassza ki a rendelkezésre álló szerkesztő eszközök.",
      "DefaultCreateFeatureTool": {
        "title": "Új létrehozása geo-objektumok",
        "tooltip": "Engedélyezése / tiltása eszköz létrehozása az új funkciók."
      },
      "DeleteFeatureTool": {
        "title": "Tiszta geo-objektumok",
        "tooltip": "Engedélyezése / tiltása eszköz törlése funkciók."
      },
      "DefaultEditFeatureTool": {
        "title": "Szerkesztés geo-objektumok",
        "tooltip": "Engedélyezése / tiltása eszköz szerkesztési funkciók."
      }
    },
    "editmodes": {
      "menuTitle": "Szerkesztési geo-objektumok",
      "description": "Szerkeszthető tulajdonságai geo-objektumok.",
      "editAttributes": {
        "title": "Attribútumok szerkeszthető",
        "tooltip": "Kapcsolja be / ki ahhoz, hogy szerkeszteni attribútumai geoobjects / ban."
      },
      "editGeometry": {
        "title": "Geometries szerkeszthető",
        "tooltip": "Engedélyezése / tiltása, hogy / tiltsa a szerkesztő egy funkció geometriáját."
      }
    },
    "createmodes": {
      "menuTitle": "Létrehozása geo-objektumok",
      "description": "Előállítására szolgáló eljárást a geo-objektumok.",
      "persistAfterFeatureDrawn": {
        "title": "Mentsd geo-objektumok után azonnal rajz",
        "tooltip": "Ha engedélyezve van, az aláírt geo-objektumok tároljuk után azonnal a rajzolás folyamatát, különben kattintás után Save."
      },
      "disableDrawToolAfterCreation": {
        "title": "Tiltsa rajzeszköz létrehozása után",
        "tooltip": "Ha engedélyezed a eszköz létrehozása funkciók ki van kapcsolva a mentés után a funkció. Ellenkező esetben, hogy marad aktív."
      }
    },
    "attachments": {
      "menuTitle": "Mellékletek",
      "description": "Konfigurálja mellékletek támogatása.",
      "hint": "Mellékletek csak akkor állnak rendelkezésre, ha konfigurálva funkció szerver! <br/> Módosítása után tulajdonságai szükséges aktiválnia a jelenleg aktív szerkesztő eszközök.",
      "enable": {
        "title": "Hagyjuk mellékletek",
        "tooltip": "Ha engedélyezve van, akkor lehet, hogy fel csatolmányokat meglévő geo-objektumok. Ez csak akkor lehetséges, ha a funkciót a funkció kiszolgáló konfigurálva."
      }
    }
  }
}