{
  "bundleName": "ArcGIS för serverutskrift",
  "bundleDescription": "Detta paket ger en ArcGIS Server utskrift verktyg.",
  "ui": {
    "button": {
      "title": "Skriv den aktuella kartan"
    },
    "window": {
      "title": "Tryckning utgång"
    },
    "error": {
      "unknown": "ArcGIS Server Utskrift: Ett okänt fel har uppstått!",
      "code403": "AGS Utskrift: Den konfigurerade utskriftstjänst URL måste vara i dina proxys tillåtet listan!",
      "code404": "AGS Utskrift: Det utskriftstjänst kunde inte lösas för den konfigurerade URL!"
    },
    "dialog": {
      "title": "Titel",
      "format": "Format",
      "layout": "Layout",
      "dpi": "DPI",
      "scale": "Underhålls skala",
      "submitBtnLabel": "Trycket"
    },
    "imgPrintResultWidget": {
      "printBtnText": "Trycket"
    }
  }
}