{
  "bundleName": "JoinAddress",
  "bundleDescription": "Denne pakke indeholder en implementering for JoinAddress serveren.",
  "store": {
    "name": "JoinAddress søgning",
    "description": "Opbevar for JoinAddress søgetjeneste",
    "placeHolder": "Navn By eller postnummer",
    "fields": {
      "ID": "Id",
      "LNGCODE": "Sprog kode",
      "ZIP": "Postnummer",
      "CITY": "By",
      "ZIPNAME": "Postal navn",
      "ADMCODE": "Administrativ nøgle",
      "XCOOR": "X",
      "YCOOR": "Y",
      "COQ": "Koordinere kvalitet",
      "SMLCITY": "Ligheden bynavn",
      "SMLZIPNAME": "Ligheden postal navn"
    }
  }
}