{
  "bundleName": "Căutare Omni-configurare",
  "bundleDescription": "Pachet de configurare pentru pachet omnisearch.",
  "menu": {
    "title": "Căutare Omni"
  },
  "widget": {
    "description": "Acest meniu este utilizat pentru configurarea numai suprafața de căutare Omni. Temele de căutare activate poate fi necesar să configurați individual.",
    "hint": "Căutarea este vizibilă numai dacă cel puțin o căutare subiect este activată.",
    "displayLoadingIcon": "Afișare pictogramă de încărcare",
    "ignoreCase": "Ignorați de caz",
    "autoComplete": "Activați auto-complet",
    "autoSelect": "Selectați element evidențiat în drop-down",
    "selectFirstResultOnEnter": "Selectați primul rezultat atunci când apăsați <ENTER>"
  }
}