{
  "bundleName": "App Stores",
  "bundleDescription": "Innehåller butiken implementeringar till access appar och app mallar",
  "editorStateValues": {
    "DRAFT": "Utkast",
    "EDITED": "Edited",
    "VERIFIED": "Verified",
    "PUBLISHED": "Publicerad",
    "DEPRECATED": "Borttagen"
  }
}