{
  "bundleName": "ArcGIS serveri trükkimine",
  "bundleDescription": "See kimp annab ArcGIS Server trükkimine vahend.",
  "menu": {
    "title": "ArcGIS serveri trükkimine"
  },
  "widget": {
    "description": "Konfiguratsiooni ags trükkimine funktsionaalsust.",
    "hint": "See funktsioon on saadaval ainult ArcGIS Server 10.1 või uuem versioon, mis annab Ekspordi Web Map Task.",
    "url": {
      "title": "URL ArcGIS Server Prindi Task",
      "tooltip": "AGS URL printida teenust."
    },
    "directDownload": {
      "title": "Otsene lae",
      "tooltip": "Laadib väljaprint otse avamise asemel seda akent."
    }
  }
}