{
  "bundleName": "Contenuto propria configurazione guidata Bundle",
  "bundleDescription": "Config Wizard Bundle di informazioni widget personalizzato",
  "menu": {
    "title": "Il mio contenuto"
  },
  "widget": {
    "window": {
      "title": "Nome",
      "saveDeleteQuery": "Vuoi davvero '{number}' eliminare le voci?",
      "editCustomInfoDefinitionTitle": "Modifica contenuto",
      "newCustomInfoDefinitionTitle": "Creare nuovi contenuti"
    },
    "wizard": {
      "types": {
        "copyright": {
          "title": "Diritto d'autore",
          "tooltip": "Visualizza informazioni sul copyright"
        },
        "disclaimer": {
          "title": "Disconoscimento",
          "tooltip": "Mostra di responsabilità"
        },
        "imprint": {
          "title": "Impronta",
          "tooltip": "Mostra impronta"
        },
        "info": {
          "title": "Info",
          "tooltip": "Visualizza informazioni"
        },
        "help": {
          "title": "Aiuto",
          "tooltip": "Mostra aiuto"
        },
        "legend": {
          "title": "Leggenda",
          "tooltip": "Mostra leggenda"
        },
        "link": {
          "title": "Collegamento",
          "tooltip": "Mostra link"
        },
        "custom": {
          "title": "Qualsiasi"
        }
      },
      "generalPane": {
        "paneTitle": "Impostazioni dello strumento",
        "type": "Tipo",
        "typeTooltip": "Scegliere un tipo per le informazioni predefinito",
        "title": "Titolo",
        "titleTooltip": "Definire un titolo per lo strumento",
        "tooltip": "Tooltip",
        "tooltipTooltip": "Definire il testo tooltip",
        "toolClass": "Strumento di classe CSS",
        "toolClassTooltip": "Scegli una classe CSS facoltativo per l'icona del pulsante dello strumento"
      },
      "windowPane": {
        "paneTitle": "Definire le opzioni della finestra",
        "title": "Titolo",
        "titleTooltip": "Selezionare un titolo per la finestra",
        "windowWidth": "Larghezza",
        "windowWidthTooltip": "Larghezza della finestra",
        "windowHeight": "Altezza",
        "windowHeightTooltip": "Altezza della finestra",
        "position": "Posizione",
        "positionTooltip": "Selezionare la posizione della finestra",
        "center": "centralmente",
        "left": "sinistra",
        "right": "destra",
        "top": "top",
        "bottom": "fondo",
        "modal": "Modale",
        "modalTooltip": "Selezionare se la finestra è modale",
        "draggable": "Trascinabili",
        "draggableTooltip": "Selezionare se la finestra è mobile",
        "resizable": "Ridimensionabile",
        "resizableTooltip": "Scegliere di consentire il ridimensionamento della finestra",
        "closable": "Closable",
        "closableTooltip": "Selezionare se la finestra può essere chiusa",
        "maximizable": "Massima",
        "maximizableTooltip": "Selezionare se la finestra è massimizzata"
      },
      "contentPane": {
        "paneTitle": "Selezionare se si desidera un contenuto gratuito o un link da visualizzare",
        "content": "Contenuti arbitraria",
        "link": "Collegamento",
        "linkWidget": {
          "url": "URL",
          "urlTooltip": "Immettere un URL",
          "newTab": "Aprire in una nuova scheda / finestra",
          "newTabTooltip": "Scegliere se si desidera che il collegamento per aprire in una nuova scheda / finestra"
        }
      }
    },
    "grid": {
      "removeCustomInfoTool": "Rimuovere i propri contenuti",
      "addCustomInfoTool": "Aggiungi nuovi contenuti",
      "title": "Titolo",
      "dataView": {
        "DGRID": {
          "noDataMessage": "Nessun contenuto proprio trovato."
        },
        "pager": {
          "pageSizeLabelText": "Contenuti ${pageStartItemNumber} - ${pageEndItemNumber} di ${itemCount}"
        }
      }
    }
  }
}