{
  "bundleName": "Konfiguracija Preglednik sadržaja",
  "bundleDescription": "Ovaj paket pruža sredstva za konfiguriranje gledatelja sadržaja.",
  "menu": {
    "title": "Sadržaj preglednik"
  },
  "widget": {
    "window": {
      "title": "Naziv",
      "saveDeleteQuery": "Da li stvarno želite obrisati '{number}' predmet (e)?",
      "editContentDefinitionTitle": "Definicija Uredi sadržaj",
      "newContentDefinitionTitle": "Napravite novu definiciju sadržaja"
    },
    "wizard": {
      "storePaneTitle": "Uz gledatelja sadržaja, možete definirati koji sadržaj se prikazuje kada kliknete na rezultat pretraživanja ili element u karti. Stoga, molimo odaberite Search-/ tema i / ili karta modela čvor. <br /><br /> Nove Teme Search-/ izbor može biti dodan u pretraživanju i Selection \"u glavnom izborniku. Upisi na karti modela popisu čvor odgovarati pojedinačne slojeve karta koja se koriste u ovom aplikacijom (vidi 'sadržaj' u glavnom izborniku). <br /><br /> <b>Pažnja:</b> Molimo vas da samo odabir vrijednosti u oba popisa u isto vrijeme, ako je odgovarajuće usluge utakmicu.",
      "storeSelect": "Traži / Izbor tema",
      "storeSelectTooltip": "Odaberite pretraživanje / izbor temu",
      "mapModelNodeSelect": "Karta sadržaj",
      "mapModelNodeSelectTooltip": "Odaberite sadržaj kartice",
      "noStoreLabel": "Ne pretraživanje / izbor tema",
      "noMapModelNodeLabel": "Sadržaj Karta Ne",
      "typePaneTitle": "Unesite ime za ovaj info zaslona (ovo je potrebno samo za upravljanje uživo konfiguraciji prozor), a zatim odaberite hoće li informacije moraju imati kompaktan prikaz i / ili pogled na detalj.",
      "typeTitle": "Naslov",
      "typeTitleTooltip": "Odredite naziv za ovaj sadržaj pregledniku.",
      "typeLayoutAttr": "Odaberite izgled",
      "typelayoutAttrTooltip": "Odaberite izgled (stol ili prilagoditi)",
      "typeGrid": "Tablica izgleda",
      "typeCustom": "Običaj raspored",
      "typeAttachment": "Dodatak",
      "typeCompactView": "Kompaktni gledatelja",
      "typeCompactViewTooltip": "Odaberite ako želite koristiti kompaktan preglednik",
      "typeFullView": "Prikaz pojedinosti",
      "typeFullViewTooltip": "Odaberite koristiti detaljan prikaz",
      "layoutPaneTitle": "Molimo izaberite raspored za gledatelja (s)",
      "layoutDefaultValue": "Zadana vrijednost",
      "layoutDefaultValueTooltip": "Ova vrijednost se koristi kada odabrani objekt nema vrijednosti za željeni atribut.",
      "layoutSettingsCompactViewer": "<b>Postavke za kompaktne gledatelja</b>",
      "layoutCompactWindowTitle": "Naslov Prozor",
      "layoutCompactWindowTitleTooltip": "Naslov kompaktnog gledatelja prozor. Moguće je koristiti rezervirana za polja. Sljedeći rezerviranih mjesta su dostupni: ${fields}.",
      "layoutCompactWindowWidth": "Širina prozora",
      "layoutCompactWindowWidthTooltip": "Širina prozora kompaktan gledatelja [piksela]",
      "layoutCompactWindowHeight": "Visina Prozor",
      "layoutCompactWindowHeightTooltip": "Visina prozora kompaktan gledatelja [piksela]",
      "layoutSettingsFullViewer": "<b>Postavke prikaza detaljno</b>",
      "layoutFullWindowTitle": "Naslov Prozor",
      "layoutFullWindowTitleTooltip": "Naslov detalj gledatelja prozor. Moguće je koristiti rezervirana za polja. Sljedeći rezerviranih mjesta su dostupni: ${fields}.",
      "gridPaneTitle": "Postavke za izgled stola",
      "gridFieldName": "Polje",
      "gridAllow": "Predstava",
      "gridAllowTooltip": "Odaberite hoće li ovo polje je prikazan u tablici",
      "attachmentPanel": "Nema prilagodbe nužne",
      "editor": {
        "plugin": {
          "PlaceHolder": {
            "label": "Dodaj rezervirano mjesto"
          }
        }
      },
      "noStores": "Nema teme pretraživanje / izbor pronađena!",
      "noStore": "Ne pretraživanje / izbor tema pronađen!",
      "fieldsError": "Kad upite metapodataka je greška (poruka o pogrešci: ${msg})!",
      "noErrorSpecified": "Ne detaljna poruka o pogrešci na raspolaganju!",
      "noContextQuery": "Ova tema pretraživanje / odabir ne definira upit konteksta. To mora biti ručno urediti."
    },
    "grid": {
      "removeContentTool": "Uklonite definiciju sadržaja",
      "addContentTool": "Dodaj novu definiciju sadržaja",
      "title": "Naslov",
      "dataView": {
        "noDataFound": "Ne definicija sadržaj pronađena ...",
        "pager": {
          "pageSizeLabelText": "Sadržaj Definicija ${pageStartItemNumber} - ${pageEndItemNumber} od ${itemCount}",
          "pageLabelText": "Stranica ${currentPage} od ${endPage}",
          "backButtonTooltip": "Prethodna stranica",
          "forwardButtonTooltip": "Sljedeća stranica",
          "firstButtonTooltip": "Prva stranica",
          "lastButtonTooltip": "Posljednja stranica"
        },
        "filter": {
          "menuDefaultLabel": "Sve",
          "textBoxPlaceHolder": ""
        }
      }
    }
  }
}