{
  "bundleName": "Στυλ",
  "bundleDescription": "--CORE Λειτουργιών-- Η δέσμη Θέματα διαχειρίζεται όλες τις πληροφορίες CSS, όπως χρώματα, στυλ γραμματοσειράς, εικόνες φόντου, κλπ χρήστες μπορούν να εναλλαγή μεταξύ των διαφορετικών εμφάνιση των στοιχείων διεπαφής χρήστη με την επιλογή διαφορετικών στυλ.",
  "themes": {
    "pure": {
      "desc": "«Καθαρό» το στυλ του map.apps."
    },
    "night": {
      "desc": "Οι map.apps «νύχτας» στυλ."
    }
  },
  "ui": {
    "selectorLabelTitle": "Στυλ"
  }
}