{
  "bundleName": "Pozadie mapy prepínač",
  "bundleDescription": "Pozadie Mapa prepínač umožňuje ovládanie pripravené pre prepínanie preddefinovaných máp pozadia.",
  "ui": {
    "labelTitle": "Mapa"
  }
}