{
  "bundleName": "Jelentéskészítő eszköz",
  "bundleDescription": "Egy eszköz, amely lehetővé teszi, hogy jelentéseket.",
  "title": "Jelentő",
  "description": "Teríték jelentések készítéséhez.",
  "widgets": {
    "reportTool": {
      "menuTitle": "Jelentéskészítő eszköz",
      "description": "Állítsa be a viselkedés a jelentés eszköz található az eredmény központjában.",
      "hint": "Beállítása a fájlnév akkor hasznos, ha közvetlen letöltési opció ki van pipálva.",
      "dataform": {
        "directDownload": {
          "title": "Közvetlen letöltés",
          "tooltip": "Ez a horog be, ha a jelentés generált lesz azonnal letölthető. Máskülönben a jelentést az app jelenik meg."
        },
        "fileName": {
          "title": "Fájl név",
          "tooltip": "A fájl neve, hogy jön létre, és letölthető."
        }
      }
    },
    "reportTask": {
      "menuTitle": "Jelentés leképezés",
      "description": "Állítsa leképezés, amely meghatározza, amely jelentést fogják használni, hogy milyen kiválasztási téma.",
      "hint": "Ha nem mapping definiált, az alapértelmezett jelentést fogja használni.",
      "addReportMapping": {
        "title": "Új feladat",
        "tooltip": "Új feladat",
        "error": "Érvénytelen riport konfiguráció volt kimutatható, és elveti. Jelentés:"
      },
      "removeReportMapping": {
        "title": "A kijelöltek törlése térképezés (ek)",
        "tooltip": "A kijelöltek törlése térképezés (ek)"
      },
      "grid": {
        "store": {
          "reportid": "Jelentés",
          "storeId": "Bolt",
          "title": "Név"
        },
        "dataView": {
          "noDataFound": "Nem elérhető jelentésben feladatokat.",
          "DGRID": {
            "noDataMessage": "No jelentés feladatokat (ek) található ..."
          },
          "pager": {
            "pageSizeLabelText": "Report leképezés ${pageStartItemNumber} - ${pageEndItemNumber} a ${itemCount}"
          }
        }
      },
      "widget": {
        "window": {
          "title": "Hozzon létre egy jelentést hozzárendelés"
        },
        "addButtonTitle": "Hozzáad",
        "labelReportId": "Jelentés",
        "labelMapmodelId": "Témaválasztás"
      }
    }
  }
}