{
  "bundleName": "Kartta Desk",
  "bundleDescription": "Kartta Desk on universaali tilaa arkistointi minkäänlaisia ​​esineitä, jotka näkyvät map.apps näytön (kuten työkalurivejä ja ikkunat).",
  "ui": {
    "title": "Kartta Desk"
  }
}