{
  "bundleName": "themes-Konfiguration",
  "bundleDescription": "Konfigurationsbundle für das Themes Bundle.",
  "menu": {
    "title": "Design-Thema"
  },
  "widget": {
    "description": "Auswahl des Design-Themas für die App. Das Design-Thema definiert das visuelle Erscheinungsbild der App; Farben, Icons, Fonts, etc.",
    "selectedTheme": {
      "title": "Ausgewähltes Design-Thema:",
      "tooltip": "Auswahl des Design-Thema der App."
    }
  }
}