{
  "bundleName": "levande konfigurationsmeny",
  "bundleDescription": "Meny för levande konfiguration av en app.",
  "ui": {
    "title": "Levande konfiguration",
    "entry": "Tillträde",
    "entries": "Inlägg",
    "noEntries": "För närvarande finns det inga artiklar i denna kategori",
    "chooseCategory": "Välj ett alternativ",
    "buttons": {
      "back": "Tillbaka",
      "apply": "Uppdatera förhandsgranskning",
      "save": "App att spara"
    },
    "dataFormBuilderWidget": {
      "defaultValidationErrorMessage": "Vänligen kontrollera din ingång (s)!"
    },
    "saveStart": "Spara igång!",
    "saveError": "Spara misslyckades! {message}",
    "saveSuccess": "Framgång!",
    "unknownError": "Okänt fel!",
    "notAppliedConfigChanges": "Inte tillämpade konfigurationsändringar upptäckta! Bör de tillämpas?",
    "loadConfigBundles": "<p> Initiera konfigurations buntar ({pos} / {count}). <br/> Ha tålamod. </p>",
    "configureBtn": "Levande konfiguration",
    "bundleStart": "På",
    "bundleStartMessage": "Skapa Bunta '{name} ({symname}) \"",
    "bundleStartMessageSuccess": "Starta bunten '{name} ({symname}) \"framgångsrikt!",
    "bundleStartMessageFailure": "Starta bunten '{name} ({symname}) misslyckades! {error}",
    "bundleStop": "Av",
    "bundleStopMessage": "Stopp Bundle '{name} ({symname}) \"",
    "bundleStopMessageSuccess": "Stoppa bunten '{name} ({symname}) \"framgångsrikt!",
    "bundleStopMessageFailure": "Stoppa bunten '{name} ({symname}) misslyckades! {error}",
    "bundleInfo": {
      "components": "Komponenter",
      "bundleIdentifier": "Identifierare",
      "bundleName": "Namn",
      "bundleDescription": "Beskrivning",
      "bundleVersion": "Version",
      "bundleLocation": "Url",
      "bundleCopyRight": "Copyright",
      "bundleState": "Status",
      "bundleVendor": "Tillverkare",
      "bundleCategory": "Kategorier",
      "bundleContactAddress": "Kontakt Adress",
      "bundleDocUrl": "Dokumentation",
      "bundleLicense": "License",
      "bundleLicenseUrl": "Licens Url"
    },
    "componentInfo": {
      "component": "Komponent",
      "componentIdentifier": "Identifierare",
      "componentName": "Namn",
      "componentState": "Status",
      "componentInstances": "Instanser",
      "componentLog": "Log",
      "jsonError": "Ogiltig JSON format: {error}",
      "commonDescription": "Du kan ändra konfigurationen för en komponent genom att redigera konfigurations JSON här. <b>Var försiktig!</b>",
      "factoryCreateHint": "Denna komponent är en \"Component Factory '! Definiera en ny konfiguration kommer att skapa en ny komponent!",
      "factoryDeleteHint": "Denna komponent är en \"Component Factory-punkt! Rensa textfältet kommer att ta bort komponenten!",
      "notConfigurableHint": "Denna komponent kan inte konfigureras."
    }
  },
  "menu": {
    "main": {
      "title": "Levande konfiguration"
    },
    "content": {
      "title": "Innehåll",
      "description": "Definiera innehåll: Tjänster, Karta Model, Karta State, ..."
    },
    "widgets": {
      "title": "Widgets",
      "description": "Välj en widget"
    },
    "search": {
      "title": "Search & Selection",
      "description": "Välj en sökning och urval alternativ"
    },
    "tools": {
      "title": "Verktyg",
      "description": "Definierar verktyg som kan användas i denna app"
    },
    "design": {
      "title": "Layout & Design",
      "description": "Definierar den visuella layout och design av app"
    },
    "bundles": {
      "title": "Avancerad konfiguration (buntar)"
    }
  }
}