{
  "bundleName": "Configurare Editarea",
  "bundleDescription": "Pachet de configurare pentru pachetul de editare.",
  "title": "Editarea",
  "description": "Specificați setările jurul editarea de geo-obiectelor.",
  "hint": "Pentru a utiliza capacitățile de editare, cel puțin una servicii metraj trebuie marcate ca editabil.",
  "widget": {
    "snapping": {
      "menuTitle": "Rupă",
      "description": "Setați proprietățile de captare.",
      "hint": "După schimbarea proprietăților este necesar să se reactiveze instrumentele de editare în prezent active.",
      "componentEnabled": {
        "title": "Activați Rupă",
        "tooltip": "Complet activare / dezactivare rupă."
      },
      "alwaysSnap": {
        "title": "Începe întotdeauna",
        "tooltip": "Rupă Când este activat este întotdeauna activ. În caz contrar, trebuie să fie utilizate tasta rupă."
      },
      "tolerance": {
        "title": "Toleranța [px]",
        "tooltip": "Toleranța pentru rupă în pixeli."
      }
    },
    "tools": {
      "menuTitle": "Editarea unelte",
      "description": "Selectați instrumentele de editare disponibile.",
      "DefaultCreateFeatureTool": {
        "title": "Crearea de noi geo-obiectelor",
        "tooltip": "Activează / Dezactivează instrument pentru crearea de noi caracteristici."
      },
      "DeleteFeatureTool": {
        "title": "Șterge geo-obiectelor",
        "tooltip": "Activează / Dezactivează instrument pentru ștergerea caracteristici."
      },
      "DefaultEditFeatureTool": {
        "title": "Editați geo-obiectelor",
        "tooltip": "Activează / Dezactivează instrument pentru editare caracteristici."
      }
    },
    "editmodes": {
      "menuTitle": "Editarea geo-obiectelor",
      "description": "Proprietăți editabile de geo-obiectelor.",
      "editAttributes": {
        "title": "Atributele sunt editabile",
        "tooltip": "Pornire / Oprire, pentru a permite editarea de atribute ale geoobjects / ban."
      },
      "editGeometry": {
        "title": "Geometrii sunt editabile",
        "tooltip": "Activare / Dezactivare pentru a permite / interzice editarea geometriei o caracteristică lui."
      }
    },
    "createmodes": {
      "menuTitle": "Crearea geo-obiectelor",
      "description": "Procedura pentru prepararea de geo-obiectelor.",
      "persistAfterFeatureDrawn": {
        "title": "Salvați geo-obiectelor imediat după desen",
        "tooltip": "Când este activat, un geo-obiectelor semnat este stocat imediat după finalizarea procesului de desen, în caz contrar click pe Salvare."
      },
      "disableDrawToolAfterCreation": {
        "title": "Dezactivați instrument de desen după creare",
        "tooltip": "Când este bifat instrumentul pentru crearea de facilitati este dezactivată după salvarea caracteristica. Altfel rămâne activ."
      }
    },
    "attachments": {
      "menuTitle": "Echipamente",
      "description": "Configurarea sprijin atașament.",
      "hint": "Echipamente sunt disponibile numai dacă este configurat pe server facilitate! <br/> După schimbarea proprietăților este necesar să se reactiveze instrumentele de editare în prezent active.",
      "enable": {
        "title": "Permiteți atașamente",
        "tooltip": "Când este activat, este posibil să se încarce echipamente de geo-obiectelor existente. Acest lucru este posibil numai dacă funcția în serverul facilitate este configurat."
      }
    }
  }
}