{
  "bundleName": "Rotot",
  "bundleDescription": "Dan sorra jipprovdi l-Istruzzjonijiet Widget mill-API ArcGIS għall JavaScript.",
  "tool": {
    "title": "Rotot",
    "tooltip": "Uri routing widget"
  },
  "printTemplate": {
    "printbutton": "Stampa",
    "closebutton": "Agħlaq",
    "titleText": "Rotta tiegħi:",
    "notesPlaceholder": "Ikteb noti hawn",
    "routingSummaryETE": "Ħin stmat Enroute:",
    "routingSummaryDistance": "Distanza:",
    "footerText": "Direzzjonijiet huma pprovduti għal skopijiet ta 'ppjanar biss u huma suġġetti għal <a href='http://www.esri.com/legal/software-license' target='_blank'>termini ta ESRI ta 'użu</a> . Jista 'jeżisti kondizzjonijiet tat-toroq dinamiċi li l-preċiżjoni iġiegħel li jvarjaw minn direzzjonijiet tiegħek u għandhom jittieħdu f'kunsiderazzjoni flimkien ma' sinjali u r-restrizzjonijiet legali. Għandek tassumi kull riskju ta 'użu."
  },
  "units": {
    "hour": "siegħa",
    "hours": "sigħat",
    "minute": "minuta",
    "minutes": "minuti",
    "esriMillimeters": "mm",
    "esriCentimeters": "cm",
    "esriDecimeters": "dm",
    "esriMeters": "m",
    "esriKilometers": "km",
    "esriFeet": "pied",
    "esriInches": "fil",
    "esriMiles": "mi",
    "esriNauticalMiles": "nm",
    "esriUnknownUnits": "mhux magħruf"
  }
}