{
  "bundleName": "Atpažinimas",
  "bundleDescription": "Teikia autentifikacijos funkcijų",
  "ui": {
    "usernameLabel": "${name}",
    "logout": "Atsijungti",
    "login": "Vartotojas",
    "cancel": "Atšaukti",
    "username": "Vartotojas",
    "password": "Slaptažodis",
    "logonProcessing": "Registracija vyksta",
    "logonSuccess": "Vartotojas Sėkmingas",
    "logonError": "Prisijungti nepavyko",
    "blockWindowTitle": "Atpažinkite",
    "blockWindowMsg": "Prašome palaukti ..."
  }
}