{
  "bundleName": "ArcGIS for Server Search & Selection Konfigurace",
  "bundleDescription": "Konfigurace balík pro ArcGIS Server pro vyhledávání a výběru.",
  "menu": {
    "title": "ArcGIS Server pro vyhledávání a výběr"
  },
  "widget": {
    "saveDeleteQuery": "Opravdu chcete smazat '{number}' položku (y)?",
    "hint": "Nové služby mohou být přidány v menu \"Správa služeb\".",
    "storeWindow": {
      "newStoreTitle": "Vytvořit nové téma hledání",
      "editStoreTitle": "Editovat téma hledání",
      "defaultLabel": "Zadejte hledaný výraz ..."
    },
    "storeWizard": {
      "loadingServiceMetadata": "Načítání metadata služby ...",
      "loadingLayerMetadata": "Načítání vrstvy metadat ...",
      "noQueryService": "Vybraná služba nelze použít, protože neumožňuje dotazy!",
      "noQueryLayer": "Vybrané vrstvy nelze použít, protože neumožňuje dotazy!",
      "noFields": "Vybrané vrstvy nelze použít, protože neobsahuje žádné pole!",
      "serviceError": "Chyba připojení ke službě (chybová zpráva: ${msg})!",
      "layerError": "Informace o Error dotazování vrstva (chybová zpráva: ${msg})!",
      "noErrorSpecified": "No detailní chybová zpráva k dispozici!",
      "selectServiceTooltip": "Vyberte si službu",
      "servicePaneTitle": "Prosím, vyberte službu použít pro toto téma hledání",
      "serviceTitle": "Služba",
      "selectLayerTooltip": "Vyberte vrstvu",
      "layerPaneTitle": "Prosím, vyberte vrstvu použít pro toto téma hledání",
      "layerTitle": "Vrstva",
      "storePaneTitle": "Prosím, definovat některé základní nastavení pro toto téma hledání",
      "searchPaneTitle": "Prosím, definovat omnisearch nastavení pro tento obchod",
      "storeTitle": "Název",
      "storeTitleTooltip": "Název tématu hledání",
      "storeDescription": "Popis",
      "storeDescriptionTooltip": "Popis tématu hledání",
      "storeSearchAttr": "Hledat atribut",
      "storeSearchAttrTooltip": "Tento atribut se používá k vyhledávání",
      "storeLabelAttr": "Jméno atribut",
      "storeLabelAttrTooltip": "Tento atribut se používá k popisu",
      "defaultLabel": "Zástupný",
      "defaultLabelTooltip": "Definuje výchozí text vyhledávání vstupního pole (hodnota je nepovinný).",
      "pageSize": "Maximální výsledky",
      "pageSizeTooltip": "Maximální počet zásahů ve výsledcích (rozsah: 0 - 100, 0 je neomezená).",
      "typingdelay": "Zpoždění [ms]",
      "typingdelayTooltip": "Pauza mezi stisky kláves, než dotaz předložena (rozmezí 0-1000 milisekund)",
      "suggestContains": "Obsahuje vyhledávání",
      "suggestContainsTooltip": "Je-li zaškrtnuto, je vyhledávání \"obsahuje\" je proveden, jinak \"začíná\" vyhledávání",
      "selectionPaneTitle": "Prosím definujte nastavení pro výběr",
      "useInSearch": "Použití v omni vyhledávání",
      "useInSearchTooltip": "Určuje, zda obchod bude použita pro výběr.",
      "useInSelection": "Používá se pro výběr",
      "useInSelectionTooltip": "Kontrola úložiště by měla být použita při výběru",
      "selectionType": "Typ nářadí",
      "selectionTypeTooltip": "Vyberte nástroj pro výběr",
      "selectinToolExtent": "Rozsah",
      "selectinToolPoint": "Bod",
      "selectinToolCircle": "Kruh",
      "selectinToolPolygon": "Polygon",
      "selectinToolFreehandPolygon": "Ruky mnohoúhelník",
      "selectionToolIconClass": "CSS třída pro přepínač",
      "selectionToolIconClassTooltip": "Definuje třídu CSS pro přepínače nástroje",
      "selectionToolTolerance": "Klikněte na toleranci",
      "selectionToolToleranceTooltip": "Vyberte klikněte na toleranci (rozsah: 0. - 100px Tolerance budou použity pouze na bod nástroj.)."
    },
    "grid": {
      "removeStoreTool": "Odstranit vyhledávání témat",
      "addStoreTool": "Přidat nový Hledat téma",
      "title": "Název",
      "type": "Typ",
      "url": "URL",
      "typeResolve": {
        "AGS_TILED": "Kachlová",
        "AGS_DYNAMIC": "Dynamický",
        "AGS_FEATURE": "Rys",
        "UNKNOWN": "Neznámo"
      },
      "dataView": {
        "noDataFound": "Nebyly nalezeny žádné vyhledávání témat ...",
        "pager": {
          "pageSizeLabelText": "Vyhledat témata ${pageStartItemNumber} - ${pageEndItemNumber} z ${itemCount}",
          "pageLabelText": "Strana ${currentPage} z ${endPage}",
          "backButtonTooltip": "Předchozí strana",
          "forwardButtonTooltip": "Další stránka",
          "firstButtonTooltip": "První strana",
          "lastButtonTooltip": "Poslední strana"
        },
        "filter": {
          "menuDefaultLabel": "Vše",
          "textBoxPlaceHolder": ""
        }
      }
    }
  }
}