{
  "bundleName": "Szukaj Omni-konfiguracji",
  "bundleDescription": "Pakiet konfiguracyjny omnisearch wiązki.",
  "menu": {
    "title": "Szukaj Omni"
  },
  "widget": {
    "description": "To menu służy do konfiguracji tylko powierzchnia poszukiwaniu Omni. Aktywowane tematy wyszukiwania może trzeba skonfigurować indywidualnie.",
    "hint": "Wyszukiwarka jest widoczny tylko wtedy, gdy co najmniej jeden temat wyszukiwania jest włączony.",
    "displayLoadingIcon": "Pokaż ikonę załadunku",
    "ignoreCase": "Ignoruj ​​sprawy",
    "autoComplete": "Włącz autouzupełnianie",
    "autoSelect": "Wybierz zaznaczony element w rozwijanym",
    "selectFirstResultOnEnter": "Wybierz pierwszy wynik po naciśnięciu <ENTER>"
  }
}