{
  "bundleName": "Kresliť",
  "bundleDescription": "Kreslenie Bundle poskytuje užívateľovi kreslenie a editačných nástrojov.",
  "menu": {
    "title": "Kresliť"
  },
  "widget": {
    "description": "Prosím, vyberte tie, kresliacich nástrojov, ktoré by mali byť k dispozícii bazén:"
  },
  "tools": {
    "DrawEraseAllTool": {
      "title": "Zmazať všetko",
      "tooltip": "Odstrániť spínač nástroje (všetky kresby zmazať)"
    },
    "DrawPointTool": {
      "title": "Bod",
      "tooltip": "Prepínač bod nástroj (nakreslí bod)"
    },
    "DrawMultipointTool": {
      "title": "Body",
      "tooltip": "Nástroj body spínač (nakreslí niekoľko bodov)"
    },
    "DrawLineTool": {
      "title": "Linka",
      "tooltip": "Prepínač nástroj linky (nakreslí čiaru)"
    },
    "DrawPolylineTool": {
      "title": "Krivka",
      "tooltip": "Prepínač polyline nástroj (nakreslí krivku)"
    },
    "DrawFreehandPolylineTool": {
      "title": "Voľné Krivka",
      "tooltip": "Voľné krivky vypínač náradia (Kreslí užívateľom definované trasu)"
    },
    "DrawPolygonTool": {
      "title": "Polygon",
      "tooltip": "Polygón switch nástroj (Kreslí polygón)"
    },
    "DrawFreehandPolygonTool": {
      "title": "Voľné polygón",
      "tooltip": "Freehand polygón vypínač náradia (Kreslí voľne definovateľný polygón)"
    },
    "DrawExtentTool": {
      "title": "Zadarmo obdĺžnik",
      "tooltip": "Freehand Rectangle vypínač náradia (Kreslí voľne definovateľnú obdĺžnik)"
    },
    "DrawCircleTool": {
      "title": "Kruh",
      "tooltip": "Kruh switch nástroj (nakreslí kruh)"
    },
    "DrawEllipseTool": {
      "title": "Elipsa",
      "tooltip": "Elipsa switch nástroj (Kreslí elipsu)"
    },
    "DrawRectangleTool": {
      "title": "Obdĺžnik",
      "tooltip": "obdĺžnik prepínač nástroj (Nakreslí obdĺžnik)"
    },
    "DrawArrowTool": {
      "title": "Zadarmo šíp",
      "tooltip": "šíp prepínač nástroj (Kreslí šíp v ľubovoľnom smere)"
    },
    "DrawLeftArrowTool": {
      "title": "Šípka doľava",
      "tooltip": "šípka prepínač na ľavej strane nástroja (nakresliť šípka vľavo kľúč)"
    },
    "DrawRightArrowTool": {
      "title": "Šípka doprava",
      "tooltip": "šípkou prepnúť do vhodného nástroja (nakresliť šípkou smerujúcou vpravo)"
    },
    "DrawUpArrowTool": {
      "title": "Šípka hore",
      "tooltip": "Šípka spínač up náradie (nakreslí riadu šípku hore)"
    },
    "DrawDownArrowTool": {
      "title": "Šípka dole",
      "tooltip": "Šípka spínač dole náradia (Kreslí šípka smerujúca nadol)"
    },
    "DrawTriangleTool": {
      "title": "Trojuholník",
      "tooltip": "trojuholník switch nástroj (nakreslí trojuholník)"
    },
    "DrawTextTool": {
      "title": "Textu",
      "tooltip": "Prepínač textu nástroj (ľubovoľný textu na karte write)"
    },
    "DrawSymbolTool": {
      "title": "Ikona",
      "tooltip": "Prepínač symbol náradie (symbol z symbol galérie obrázku)"
    },
    "StylePropertiesTool": {
      "title": "Vlastnosti / Šablóny",
      "tooltip": "Reality switch nástroj (Charakteristické vlastnosti a šablóny editovať)"
    },
    "MoveScaleRotateVerticesTool": {
      "title": "Editovať grafický",
      "tooltip": "Editovať nástroj vypínač (obr presunúť, zmeniť veľkosť alebo otočiť, alebo alternatívne upraviť uzol)"
    },
    "MoveScaleRotateTool": {
      "title": "Sťahovať",
      "tooltip": "Sťahovať nástroj vypínač (obr pohyb, zmena veľkosti alebo otočenie)"
    },
    "EditVerticesTool": {
      "title": "Upraviť uzol",
      "tooltip": "Prepínač Editovať nástrojl (uzly grafu editovať)"
    },
    "DeleteGraphicTool": {
      "title": "Vymazať",
      "tooltip": "Zmazať spínač nástroje (Zmazať grafika)"
    },
    "ExportGraphicsTool": {
      "title": "Exportovať grafika",
      "tooltip": "Prepínač Exportovať nástroj (exportovať grafika)"
    }
  }
}