{
  "bundleName": "Esri CH Location Finder",
  "bundleDescription": "Een locatie kan worden doorzocht door zoekcriteria in een tekstveld. De applicatie helpt de gebruiker om de gewenste locatie te vinden door automatisch suggereren passende resultaten tijdens het typen.",
  "typeResolver": {
    "Gemeinde": "Gemeenschap",
    "TopoName": "Topografische naam",
    "Ort": "Plaats",
    "Straße": "Straat",
    "Kreis": "Provincie",
    "Regierungsbezirk": "Wijk",
    "Address": "Adres"
  },
  "stores": {
    "locationFinder": {
      "name": "Locatie Zoek",
      "description": "Plugin voor de locatie zoekdienst ESRI CH.",
      "placeHolder": "Locatie, adres, POI ..."
    },
    "fields": {
      "type": "Type",
      "ort": "Plaats",
      "plz": "Postcode",
      "ote": "Wijk",
      "str": "Straat",
      "hnr": "Huisnummer",
      "name": "Naam",
      "id": "ID",
      "lan": "Staat",
      "rbz": "Wijk",
      "krs": "Provincie",
      "gde": "Gemeenschap"
    }
  }
}