{
  "bundleName": "Geonames - Configuratie",
  "bundleDescription": "De configuratie van de bundel Geonames bundel.",
  "menu": {
    "geonames": {
      "title": "Geonames",
      "description": "Kies een Geonames winkel"
    },
    "wikipedia": {
      "title": "Wikipedia"
    },
    "poi": {
      "title": "Points of Interest"
    },
    "postalcodes": {
      "title": "Postcodes"
    }
  },
  "common": {
    "enabled": "Zoek Onderwerp actief",
    "enabledTooltip": "Hiermee kan de zoektocht onderwerp om het te gebruiken in de Omni zoeken.",
    "defaultLabel": "Placeholder",
    "defaultLabelTooltip": "Definieert de standaard tekst van het zoekveld ingang (waarde is optioneel).",
    "pageSize": "Maximale Resultaten",
    "pageSizeTooltip": "Maximum aantal hits in de resultaten (bereik: 0-100; 0 is onbeperkt).",
    "typingdelay": "Vertraging [ms]",
    "typingdelayTooltip": "Pauze tussen toetsaanslagen voordat de query wordt ingediend (bereik 0-1000 milliseconden)",
    "languageAware": "Taal bewust resultaten",
    "languageAwareTooltip": "De taal die gebruikt wordt in map.apps zal worden gebruikt om gelokaliseerde resultaten te halen.",
    "url": "URL van de dienst",
    "urlTooltip": "URL van de zoekdienst REST eindpunt.",
    "username": "Geonames gebruikersnaam",
    "usernameTooltip": "Naam van de persoonlijke Geonames rekening."
  },
  "wikipediaWidget": {
    "description": "De Wikipedia zoekonderwerp configureren."
  },
  "poiWidget": {
    "description": "Configuratie voor de bezienswaardigheden in de buurt zoeken winkel."
  },
  "postalcodesWidget": {
    "description": "Configuratie van de postcode zoeken onderwerp.",
    "countries": "Landen filter",
    "countriesTooltip": "Landcode het filter, bijv. \"DE\" (waarde optioneel)."
  },
  "stores": {
    "postalcodes": {
      "placeHolder": "Voer postcode of plaatsnaam ..."
    },
    "wikipedia": {
      "placeHolder": "Voer een zoekterm in ..."
    },
    "poi": {
      "placeHolder": "Point of Interest ..."
    }
  }
}