{
  "bundleName": "Street View",
  "bundleDescription": "Ένας χρήστης μπορεί να επιλέξει μια τοποθεσία στο χάρτη και να δείτε το Google Street View εικόνες για τη συγκεκριμένη θέση σε ένα χωριστό παράθυρο.",
  "ui": {
    "tools": {
      "streetViewToggleTool": {
        "title": "Street View",
        "tooltip": "Street View (context-sensitive στην υποδιαίρεση της κλίμακας 1: 2.000.000 έως 1: 2.000)"
      },
      "streetViewCenterOnMarkerTool": {
        "title": "Μετάβαση στο δείκτη",
        "tooltip": "Μετάβαση στο δείκτη"
      }
    },
    "noStreetViewData": "Δεν Street View διαθέσιμο σε αυτή την τοποθεσία των δεδομένων."
  }
}