{
  "bundleName": "TileJson",
  "bundleDescription": "Registra o ServiceType 'TILEJSON' para permitir o uso de servidores de hospedagem de telha o formato por exemplo mapbox (http://mapbox.com) tilejson (http://mapbox.com/developers/tilejson/)."
}