{
  "bundleName": "Konfigurácia prehliadač obsahu",
  "bundleDescription": "Tento balík poskytuje prostriedky pre konfiguráciu diváka obsahu.",
  "menu": {
    "title": "Prehliadač obsahu"
  },
  "widget": {
    "window": {
      "title": "Názov",
      "saveDeleteQuery": "Naozaj chcete zmazať '{number}' položku (y)?",
      "editContentDefinitionTitle": "Definícia Upraviť obsah",
      "newContentDefinitionTitle": "Vytvoriť nový obsah definície"
    },
    "wizard": {
      "storePaneTitle": "S prehliadač obsahu, môžete určiť, ktorý obsah sa zobrazí po kliknutí na výsledok vyhľadávania alebo prvok v mape. Preto, prosím vyberte / tému výber Search-a / alebo uzol mapa modelu. <br /><br /> Nové témy Search- / výber môžu byť pridané do \"Search & Selection\" v hlavnom menu. Položky v zozname uzlov mapa modelu zodpovedajú jednotlivé mapové vrstvy, ktoré sú použité v tejto aplikácii (pozri \"obsah\" v hlavnom menu). <br /><br /> <b>Pozor:</b> Prosím len vybrať hodnotu v oboch zozname súčasne, v prípade, že zápas zodpovedajúce služby.",
      "storeSelect": "Hľadanie / téma výber",
      "storeSelectTooltip": "Vybrať / téma výberu vyhľadávania",
      "mapModelNodeSelect": "Mapa Content",
      "mapModelNodeSelectTooltip": "Vyberte obsah karty",
      "noStoreLabel": "Nie vyhľadávania / téma výber",
      "noMapModelNodeLabel": "No mapa obsah",
      "typePaneTitle": "Prosím, zadajte názov pre túto info displej (je to potrebné iba pre správu konfiguračné okno živé použité), a vyberte, či informácie, musia mať kompaktný displej a / alebo detailný pohľad.",
      "typeTitle": "Názov",
      "typeTitleTooltip": "Definovať práva k tomuto obsahu prehliadač.",
      "typeLayoutAttr": "Vyberte rozloženie",
      "typelayoutAttrTooltip": "Vyberte rozloženie (tabuľka alebo upravené)",
      "typeGrid": "Rozloženie Tabuľka",
      "typeCustom": "Vlastné rozloženia",
      "typeAttachment": "Príloha",
      "typeCompactView": "Kompaktné prehliadač",
      "typeCompactViewTooltip": "Vyberte, či chcete použiť kompaktný prehliadač",
      "typeFullView": "Zobraziť detaily",
      "typeFullViewTooltip": "Vyberte použiť detailný pohľad",
      "layoutPaneTitle": "Prosím, vyberte rozloženie pre diváka (y)",
      "layoutDefaultValue": "Predvolená hodnota",
      "layoutDefaultValueTooltip": "Táto hodnota sa používa, keď vybraný objekt nemá žiadnu hodnotu pre požadovanú atribútu.",
      "layoutSettingsCompactViewer": "<b>Nastavenie pre kompaktné diváka</b>",
      "layoutCompactWindowTitle": "Názov okna",
      "layoutCompactWindowTitleTooltip": "Názov kompaktný prehliadača okná. Je možné použiť zástupné symboly pre polia. Nasledujúce zástupné znaky sú k dispozícii: ${fields}.",
      "layoutCompactWindowWidth": "Šírka okna",
      "layoutCompactWindowWidthTooltip": "Šírka okna kompaktný prehliadača [pixelov]",
      "layoutCompactWindowHeight": "Výška okna",
      "layoutCompactWindowHeightTooltip": "Výška okna kompaktný prehliadača [pixelov]",
      "layoutSettingsFullViewer": "<b>Nastavenie detailnom pohľade</b>",
      "layoutFullWindowTitle": "Názov okna",
      "layoutFullWindowTitleTooltip": "Názov detail prehliadača okná. Je možné použiť zástupné symboly pre polia. Nasledujúce zástupné znaky sú k dispozícii: ${fields}.",
      "gridPaneTitle": "Nastavenie pre usporiadanie tabuľky",
      "gridFieldName": "Polia",
      "gridAllow": "Show",
      "gridAllowTooltip": "Zvoliť, či toto pole je zobrazený v tabuľke",
      "attachmentPanel": "Žiadne úpravy nevyhnutné",
      "editor": {
        "plugin": {
          "PlaceHolder": {
            "label": "Pridať zástupný"
          }
        }
      },
      "noStores": "Neboli nájdené žiadne vyhľadávanie / výber tém!",
      "noStore": "Žiadne téma hľadania / výber nájdených!",
      "fieldsError": "Pri dotazovanie metadáta bola chyba (chybové hlásenie: ${msg})!",
      "noErrorSpecified": "Nie detailné chybové hlásenie k dispozícii!",
      "noContextQuery": "Táto téma hľadania / výber nedefinuje kontexte dotazu. Je potrebné upravovať ručne."
    },
    "grid": {
      "removeContentTool": "Odobrať obsah definície",
      "addContentTool": "Pridať nový obsah definície",
      "title": "Názov",
      "dataView": {
        "noDataFound": "No definícia obsah nájdený ...",
        "pager": {
          "pageSizeLabelText": "Obsah definície ${pageStartItemNumber} - ${pageEndItemNumber} z ${itemCount}",
          "pageLabelText": "Strana ${currentPage} z ${endPage}",
          "backButtonTooltip": "Predchádzajúca strana",
          "forwardButtonTooltip": "Ďalšia stránka",
          "firstButtonTooltip": "Prvá strana",
          "lastButtonTooltip": "Posledná strana"
        },
        "filter": {
          "menuDefaultLabel": "Všetko",
          "textBoxPlaceHolder": ""
        }
      }
    }
  }
}