{
  "bundleName": "Locate Me configuratie",
  "bundleDescription": "Configuratie bundel voor de LocateMe bundel.",
  "menu": {
    "title": "LocateMe"
  },
  "widget": {
    "description": "Configuratie van de lokalisatie functie.",
    "showPositionLogs": {
      "title": "Enable positie logs",
      "tooltip": "Indien ingeschakeld, wordt u op de nieuwe locatie-updates worden gemeld"
    }
  }
}