{
  "bundleName": "Sijainti haun määrittäminen",
  "bundleDescription": "Kokoonpano nippu sijainti Search nippu.",
  "menu": {
    "title": "ESRI CH Sijainti Finder"
  },
  "widget": {
    "description": "Kokoonpano Esri Toimipaikanhaku hakuaihe.",
    "enabled": "Etsi aihe aktiivinen",
    "enabledTooltip": "Aktivoi hakuaihe käyttää sitä Omni hakuun.",
    "defaultLabel": "Placeholder",
    "defaultLabelTooltip": "Määrittää oletuksena tekstin haku syöttökenttään (arvo on valinnainen).",
    "pageSize": "Suurin tulokset",
    "pageSizeTooltip": "Suurin määrä hittejä tulokset (alue: 0-100; 0 on rajaton).",
    "typingdelay": "Viive [ms]",
    "typingdelayTooltip": "Tauko painallusten väliin ennen kysely on toimitettu (vaihteluväli 0-1000 millisekuntia)",
    "url": "URL palvelun",
    "urlTooltip": "URL hakupalvelu REST päätepiste."
  },
  "stores": {
    "locationFinder": {
      "placeHolder": "Sijainti, osoite, POI ..."
    }
  }
}