{
  "bundleName": "Configurazione Routing",
  "bundleDescription": "Pacchetto di configurazione per il pacchetto di routing",
  "menu": {
    "title": "Routing"
  },
  "routing": {
    "menuTitle": "Widget di Routing",
    "description": "Configurazione per il pacchetto di routing.",
    "configSections": {
      "basic": "Configurazione di base",
      "stops": "Interrompe configurazione",
      "traffic": "Configurazione del traffico"
    },
    "routeTaskUrl": {
      "title": "URL del compito rotta",
      "tooltip": "Specifica il servizio che verrà utilizzata per calcolare le direzioni. Le direzioni del widget utilizza Analysis Network World come servizio predefinito utilizzato per calcolare indicazioni stradali. Si tratta di un servizio in abbonamento disponibile attraverso ArcGIS Online. Se si dispone di un servizio di Network Analysis ArcGIS Server che si desidera utilizzare per calcolare le direzioni specificare l'URL di tale servizio."
    },
    "directionsLengthUnits": {
      "title": "Unità di lunghezza",
      "tooltip": "Unità di lunghezza. L'impostazione predefinita è chilometri.",
      "units": {
        "esriMillimeters": "mm",
        "esriCentimeters": "cm",
        "esriDecimeters": "dm",
        "esriMeters": "m",
        "esriKilometers": "km",
        "esriFeet": "ft",
        "esriInches": "in",
        "esriMiles": "mi",
        "esriNauticalMiles": "nm",
        "esriUnknownUnits": "sconosciuto"
      }
    },
    "dragging": {
      "title": "Consenti trascinamento di Stops",
      "tooltip": "Attivare il trascinamento di posizioni di arresto sulla mappa. Quando i veri fermate possono essere trascinate in una nuova posizione e il percorso sarà ricalcolato. Il valore predefinito è true."
    },
    "showPrintPage": {
      "title": "Mostra pulsante percorso di stampa",
      "tooltip": "Selezionare per stampare la visualizzazione dei pulsanti istruzioni di routing."
    },
    "showMilesKilometersOption": {
      "title": "Mostra miglia-chilometro ginocchiera",
      "tooltip": "Se selezionata, il gruppo pulsante di commutazione che consente all'utente di scegliere tra Miles e chilometri è mostrato"
    },
    "showTravelModesOption": {
      "title": "Mostra 'di navigazione di selezione della modalità' a",
      "tooltip": "Se selezionata, viene visualizzato il gruppo pulsante di commutazione che consente all'utente di scegliere le modalità di viaggio"
    },
    "showClearButton": {
      "title": "Mostra 'ripristino di routing' pulsante",
      "tooltip": "Selezionare per visualizzare il pulsante di reset di routing."
    },
    "canModifyStops": {
      "title": "Consentire l'aggiunta di fermate",
      "tooltip": "Visualizzare il pulsante 'Aggiungi destinazione'. Questo pulsante consente agli utenti di aggiungere fermate supplementari."
    },
    "minStops": {
      "title": "Fermate minimi",
      "tooltip": "Numero minimo di fermate."
    },
    "maxStops": {
      "title": "Fermate Maximal",
      "tooltip": "Numero massimo di fermate."
    },
    "returnToStart": {
      "title": "Rientro per iniziare",
      "tooltip": "Quando vero, il percorso tornerà al punto di partenza."
    },
    "showReturnToStartOption": {
      "title": "Mostra ritorno opzione per avviare",
      "tooltip": "Quando la vera, viene mostrato il ritorno opzione per avviare."
    },
    "traffic": {
      "title": "Utilizzare i dati sul traffico",
      "tooltip": "Se i dati sul traffico in tempo reale vengono utilizzati per il calcolo del percorso?"
    },
    "showTrafficOption": {
      "title": "Opzione Mostra traffico",
      "tooltip": "Visualizza i dati di traffico di opzione Usa."
    }
  },
  "template": {
    "description": "Configurazione per il modello di routing stampa.",
    "menuTitle": "Modello di stampa di routing",
    "titleText": {
      "title": "Titolo del testo",
      "tooltip": "Impostare un titolo che compare sulla parte superiore della stampa routing.",
      "defaultText": "Il mio percorso"
    },
    "logoImageUrl": {
      "title": "URL immagine",
      "tooltip": "URL immagine di un logo sulla Stampa rotta."
    },
    "customStyleSheet": {
      "title": "URL per il proprio foglio di stile",
      "tooltip": "URL di un foglio di stile personalizzato che viene applicato alla stampa di routing."
    },
    "showMap": {
      "title": "Visualizza Mappa",
      "tooltip": "Una mappa aggiuntiva con il percorso calcolato viene aggiunto alla stampa."
    },
    "showSummary": {
      "title": "Mostra un sommario di routing",
      "tooltip": "Il riepilogo mostrerà la distanza e il tempo del percorso calcolato."
    },
    "showNotes": {
      "title": "Note Mostra utenti",
      "tooltip": "Consenti all'utente di aggiungere note a stampa di routing."
    },
    "footerText": {
      "title": "Piè di pagina",
      "tooltip": "Aggiungi testo personalizzato da visualizzare nella parte inferiore della pagina di routing stampa.",
      "defaultText": "Indicazioni vengono fornite solo a scopo di pianificazione e sono soggette a <a href='http://www.esri.com/legal/software-license' target='_blank'>termini di Esri di utilizzo</a> . Condizioni stradali dinamici possono esistere che la precisione motivo di differire dai vostri sensi e devono essere presi in considerazione insieme a segni e restrizioni legali. L'utente si assume tutti i rischi relativi all'uso."
    }
  }
}