{
  "bundleName": "Stil",
  "bundleDescription": "--Temeljne Funkcije-- Teme paket upravlja sve CSS informacije kao što su boja, font stilova, slike za pozadinu i sl Korisnici mogu prebacivati ​​između različitih izgleda elemenata korisničkog sučelja odabirom različitih stilova.",
  "themes": {
    "pure": {
      "desc": "'Čista' stil map.apps."
    },
    "night": {
      "desc": "Map.apps 'noć' stilu."
    }
  },
  "ui": {
    "selectorLabelTitle": "Stil"
  }
}