{
  "bundleName": "ArcGIS for Server udskrivning",
  "bundleDescription": "Denne pakke indeholder en ArcGIS Server Printing værktøj.",
  "menu": {
    "title": "ArcGIS for Server udskrivning"
  },
  "widget": {
    "description": "Konfiguration til AGS udskrivning funktionalitet.",
    "hint": "Denne funktion er kun tilgængelig med ArcGIS Server 10.1 eller nyere version, som giver en Export Web Map Opgave.",
    "url": {
      "title": "URL til ArcGIS Server Print Opgave",
      "tooltip": "AGS URL for at udskrive service."
    },
    "directDownload": {
      "title": "Direkte link til mappen",
      "tooltip": "Henter udskriftsresultatet direkte i stedet for at åbne det i et vindue."
    }
  }
}