{
  "bundleName": "Centar Rezultat",
  "bundleDescription": "Komponenta za prikaz rezultata pretraživanja.",
  "ui": {
    "dockTool": {
      "title": "Centar Rezultat",
      "tooltip": "Centar Rezultat"
    },
    "rectangleSelectBtn": {
      "title": "Odaberite rezultati na karti"
    },
    "selectAllBtn": {
      "title": "Odaberi sve"
    },
    "deselectBtn": {
      "title": "Poništite odabir"
    },
    "removeAllBtn": {
      "title": "Prazna Centar rezultat"
    },
    "removeSelectedBtn": {
      "title": "Ukloni odabrane stavke iz Centra rezultata"
    },
    "searchStoreTool": {
      "title": "Pretraživanje podataka"
    },
    "exportTool": {
      "title": "Izvoz"
    },
    "dataView": {
      "filter": {
        "menuDefaultLabel": "Sve",
        "textBoxPlaceHolder": ""
      },
      "pager": {
        "backButtonTooltip": "Prethodna stranica",
        "forwardButtonTooltip": "Sljedeća stranica",
        "firstButtonTooltip": "Prva stranica",
        "lastButtonTooltip": "Posljednja stranica",
        "pageLabeltext": "Stranica:",
        "pageSizeLabelText": "Rezultati ${pageStartItemNumber}-${pageEndItemNumber} od ${itemCount}:",
        "zeroResultsText": "Nema rezultata",
        "pageLabelText": "Stranica:"
      },
      "DGRID": {
        "noDataMessage": "Nema podataka.",
        "loadingMessage": "Učitavanje podataka ..."
      }
    },
    "newDataAvailable": "Novi podaci dostupni"
  }
}