{
  "bundleName": "Διαμόρφωση Επεξεργασία",
  "bundleDescription": "Δέσμη ρυθμίσεων για το πακέτο μοντάζ.",
  "title": "Επεξεργασία",
  "description": "Καθορίστε τις ρυθμίσεις γύρω από την επεξεργασία των γεω-αντικειμένων.",
  "hint": "Για να χρησιμοποιήσετε τις δυνατότητες επεξεργασίας τουλάχιστον ένα χαρακτηριστικό των υπηρεσιών πρέπει να επισημαίνονται ως επεξεργάσιμο.",
  "widget": {
    "snapping": {
      "menuTitle": "σπάνε",
      "description": "Ορίστε τις ιδιότητες δέσμευσης.",
      "hint": "Μετά την αλλαγή των ιδιοτήτων, είναι αναγκαίο να επανενεργοποιήσει τις ενεργές εργαλεία επεξεργασίας.",
      "componentEnabled": {
        "title": "Ενεργοποίηση σπάνε",
        "tooltip": "Εντελώς ενεργοποίηση / απενεργοποίηση σπάνε."
      },
      "alwaysSnap": {
        "title": "Πάντα ξεκινάτε",
        "tooltip": "Όταν ενεργοποιηθεί σπάνε είναι πάντα ενεργή. Διαφορετικά, πρέπει να χρησιμοποιείται το κλειδί σπάνε."
      },
      "tolerance": {
        "title": "Ανοχή [px]",
        "tooltip": "Η ανοχή για κούμπωμα σε pixels."
      }
    },
    "tools": {
      "menuTitle": "Εργαλεία επεξεργασίας",
      "description": "Επιλέξτε τα διαθέσιμα εργαλεία επεξεργασίας.",
      "DefaultCreateFeatureTool": {
        "title": "Δημιουργία νέας γεω-αντικείμενα",
        "tooltip": "Ενεργοποίηση του εργαλείου / Απενεργοποίηση για τη δημιουργία νέων χαρακτηριστικών."
      },
      "DeleteFeatureTool": {
        "title": "Σαφή εω-αντικείμενα",
        "tooltip": "Ενεργοποίηση / Απενεργοποίηση εργαλείο για τη διαγραφή χαρακτηριστικά."
      },
      "DefaultEditFeatureTool": {
        "title": "Επεξεργασία γεω-αντικείμενα",
        "tooltip": "Ενεργοποίηση / Απενεργοποίηση εργαλείο για λειτουργίες επεξεργασίας."
      }
    },
    "editmodes": {
      "menuTitle": "Επεξεργασία γεω-αντικείμενα",
      "description": "Επεξεργάσιμη ιδιότητες της γεω-αντικειμένων.",
      "editAttributes": {
        "title": "Χαρακτηριστικά είναι επεξεργάσιμη",
        "tooltip": "Ενεργοποίηση / απενεργοποίηση για να επιτρέψει την επεξεργασία των χαρακτηριστικών των geoobjects / απαγόρευση."
      },
      "editGeometry": {
        "title": "Γεωμετρίες επεξεργάσιμο",
        "tooltip": "Ενεργοποίηση / Απενεργοποίηση για να επιτρέψετε / απαγορεύσετε την επεξεργασία της γεωμετρίας ενός χαρακτηριστικού."
      }
    },
    "createmodes": {
      "menuTitle": "Δημιουργία γεω-αντικείμενα",
      "description": "Διαδικασία για την προετοιμασία της γεω-αντικειμένων.",
      "persistAfterFeatureDrawn": {
        "title": "Εξοικονομήστε γεω-αντικείμενα αμέσως μετά την κατάρτιση",
        "tooltip": "Όταν είναι ενεργοποιημένη, ένα υπογεγραμμένο γεω-αντικείμενα αποθηκεύεται αμέσως μετά την ολοκλήρωση της διαδικασίας σχεδίασης, αλλιώς μετά κλικ στο κουμπί Αποθήκευση."
      },
      "disableDrawToolAfterCreation": {
        "title": "Απενεργοποιήστε το εργαλείο την κατάρτιση μετά τη δημιουργία",
        "tooltip": "Όταν είναι επιλεγμένο το εργαλείο για τη δημιουργία χαρακτηριστικά απενεργοποιείται μετά την αποθήκευση της λειτουργίας. Διαφορετικά παραμένει ενεργό."
      }
    },
    "attachments": {
      "menuTitle": "Συνημμένα",
      "description": "Διαμορφώστε υποστήριξη συνημμένων.",
      "hint": "Συνημμένα είναι διαθέσιμη μόνο αν έχει ρυθμιστεί σε λειτουργία του server! <br/> Μετά την αλλαγή των ιδιοτήτων, είναι αναγκαίο να επανενεργοποιήσει τις ενεργές εργαλεία επεξεργασίας.",
      "enable": {
        "title": "Επιτρέψτε συνημμένα",
        "tooltip": "Όταν είναι ενεργοποιημένη, δεν είναι δυνατόν να ανεβάσετε συνημμένα αρχεία για τις υφιστάμενες γεω-αντικείμενα. Αυτό είναι δυνατό μόνο εάν η λειτουργία του διακομιστή λειτουργία έχει διαμορφωθεί."
      }
    }
  }
}