{
  "bundleName": "Legenda configurare",
  "bundleDescription": "Acest pachet oferă componentele de configurare pentru pachet legenda.",
  "menu": {
    "title": "Legendă"
  },
  "widget": {
    "description": "Configurarea funcției legenda.",
    "alignmentLeft": {
      "title": "Aliniați conținut legenda stângă",
      "tooltip": "Dacă dezactivat, conținutul legenda este aliniat dreapta."
    },
    "respectCurrentMapScale": {
      "title": "Informații legenda afișare pentru straturile vizibile numai",
      "tooltip": "Dacă este activat, legenda se va actualiza la fiecare hartă schimbare scară și afișa informații numai despre straturi, care sunt vizibile în hartă scara actual."
    },
    "showBaseLayer": {
      "title": "Afișare legendă pentru cartões de base",
      "tooltip": "Dacă este activată, intrările legenda for fi afișate și pentru cartões de base."
    }
  }
}