{
  "bundleName": "Configurazione di stampa",
  "bundleDescription": "Questo bundle configura la funzionalità di stampa.",
  "menu": {
    "title": "Stampa"
  },
  "widget": {
    "description": "Configurazione per lo strumento di stampa.",
    "printservletURL": {
      "title": "Stampa Servlet URL",
      "tooltip": "URL del Servlet stampa"
    },
    "downloadResponseWithoutShowing": {
      "title": "Download diretto senza mostrare",
      "tooltip": "Il risultato di stampa generato può essere visualizzata in una finestra, oppure può essere scaricato direttamente"
    },
    "format": {
      "title": "Formato",
      "tooltip": "Il formato del risultato di stampa generato"
    },
    "title": {
      "title": "Titolo",
      "tooltip": "Un titolo per il risultato di stampa"
    }
  }
}