{
  "bundleName": "Benachrichtigungen",
  "bundleDescription": "Alle Status-, Fortschritts- oder Fehlermeldungen werden dem Anwender in einer Popup Meldung angezeigt, so dass klar ist, was gerade in der Anwendung passiert.",
  "ui": {
    "title": "Notifier",
    "tooltips": {
      "close": "Nachricht schließen",
      "glue": "Nachricht anheften"
    }
  }
}