{
  "bundleName": "AddThis",
  "bundleDescription": "Z AddThis lahko uporabniki delijo map.apps aplikacijo v različnih socialnih omrežjih.",
  "ui": {
    "errorOnAPILoad": "AddThis ni na voljo!",
    "addThisAPILoader": {
      "exceptionAnn": "Ni mogoče naložiti JavaScript-API za AddThis.",
      "exceptionMsg": "Ni mogoče naložiti JavaScript-API za AddThis."
    }
  }
}