{
  "bundleName": "Merjenje geometrije orodja",
  "bundleDescription": "Konfiguracija snop za sveženj merjenje orodja.",
  "menu": {
    "title": "Orodja za merjenje"
  },
  "widget": {
    "description": "Konfiguracija orodij merjenja.",
    "finishWithButton": {
      "title": "Stop merjenje s klikom na gumb",
      "tooltip": "Če je omogočeno, se prikaže gumb za dodelavo risbo. Drugače dvoklik konča risbo."
    },
    "showTools": {
      "area": "Orodje za merjenje predstava območje",
      "distance": "Prikaži merjenje razdalje orodje",
      "location": "Prikaži merjenje lokacija orodje"
    },
    "defaultTool": {
      "title": "Privzeto omogočeno orodje",
      "none": "Noben",
      "area": "Območje",
      "distance": "Oddaljenost",
      "location": "Položaj"
    },
    "defaultAreaUnit": {
      "title": "Privzeto območje enote",
      "ACRES": "Acres",
      "SQUARE_MILES": "Kvadratnih milj",
      "SQUARE_KILOMETERS": "Kvadratnih kilometrov",
      "HECTARES": "Hektarjev",
      "SQUARE_YARDS": "Kvadratni dvorišče",
      "SQUARE_FEET": "Kvadratnih metrov",
      "SQUARE_METERS": "Kvadratni meter"
    },
    "defaultLengthUnit": {
      "title": "Privzeta enota za dolžino",
      "MILES": "Miles",
      "KILOMETERS": "Kilometer",
      "FEET": "Foot",
      "METERS": "Meter",
      "YARDS": "Yard",
      "NAUTICAL_MILES": "Navtičnih milj"
    },
    "defaultLocationUnit": {
      "title": "Standardni koordinate enote",
      "DECIMAL_DEGREES": "Stopnja",
      "DEGREE_MINUTE_SECONDS": "DMS"
    }
  }
}