{
  "bundleName": "App Panoramica",
  "bundleDescription": "Visualizza una finestra di dialogo che elenca tutte le applicazioni disponibili.",
  "dataViewCommon": {
    "noDataMessage": "Nessuna applicazione disponibile.",
    "filter": {
      "menuDefaultLabel": "Tutto",
      "textBoxPlaceHolder": ""
    },
    "pager": {
      "backButtonTooltip": "Pagina precedente",
      "forwardButtonTooltip": "Pagina successiva",
      "firstButtonTooltip": "Prima pagina",
      "lastButtonTooltip": "Ultima pagina",
      "pageLabeltext": "Pagina:",
      "pageSizeLabelText": "Risultati ${pageStartItemNumber}-${pageEndItemNumber} di ${itemCount}",
      "pageLabelText": "Pagina:"
    }
  },
  "appsTool": {
    "title": "Apps",
    "desc": "Elenco delle Apps"
  },
  "appsView": {
    "id": "Nome",
    "title": "Titolo",
    "desc": "Descrizione",
    "filename": "File",
    "modifiedBy": "Modificato da",
    "modifiedAt": "Modificato A"
  }
}