{
  "bundleName": "Konfiguracija tiskanje",
  "bundleDescription": "Ta paket nastavi funkcionalnost tiskanja.",
  "menu": {
    "title": "Natisni"
  },
  "widget": {
    "description": "Konfiguracija za orodje tiskanje.",
    "printservletURL": {
      "title": "Natisni Servlet URL",
      "tooltip": "URL za tiskalni Servlet"
    },
    "downloadResponseWithoutShowing": {
      "title": "Neposreden prenos ne kaže",
      "tooltip": "Doseženi rezultati tiskanje lahko prikazana v oknu, ali se lahko neposredno prenesejo"
    },
    "format": {
      "title": "Format",
      "tooltip": "Oblika ustvarjenega rezultata tiskanja"
    },
    "title": {
      "title": "Naslov",
      "tooltip": "Naslov za rezultat tiskanja"
    }
  }
}