{
  "bundleName": "Kaart",
  "bundleDescription": "De Kaart bundel beheert de belangrijkste kaart en al kaartinhoud informatie. De klant kan de samenvatting in een hiërarchische Kaart model zodat ze kunnen worden weergegeven op verschillende manieren aan de gebruiker diensten.",
  "ui": {
    "nodeUpdateError": {
      "info": "Actualisering van de dienst \"${title} 'mislukt! Fout: ${errorMsg}",
      "detail": "Actualisering van de dienst \"${title} 'mislukt! Fout: ${url} ${errorMsg} - Meer informatie: ${error}"
    },
    "sliderLabels": {
      "country": "Land",
      "region": "Regio",
      "town": "Stad"
    }
  },
  "drawTooltips": {
    "addPoint": "Klik op de kaart",
    "addMultipoint": "Klik om te starten",
    "finishLabel": "Afwerking"
  }
}