{
  "bundleName": "thema-configuratie",
  "bundleDescription": "Configuratie-bundel voor de sjabloon bundel.",
  "menu": {
    "title": "Layout Templates"
  },
  "widget": {
    "description": "Selecteer een app layout template. De lay-out bepaalt de structuur van de app en de positie van de UI-elementen. Hierdoor wordt de opmaak die wordt gebruikt door de applicatie standaard zijn.",
    "selectedTemplate": {
      "title": "Geselecteerde Layout sjabloon:",
      "tooltip": "Selectie van de lay-out templates van de app."
    }
  }
}