{
  "sheet" : [ {
    "src" : "BmpBigFill2",
    "slice" : [ {
      "id" : "bay_window",
      "params" : "0,0,334,230,16,1",
      "ofs" : "-158,-95",
      "data" : "_blocker,_target",
      "dep" : "20,1",
      "anim" : [ {
        "range" : "0,1,2,3,4,5,6,7,8,9,10,11,12,13,14,15",
        "rhythm" : "2,2,2,2,2,2,2,2,2,2,2,2,2,2,2,2",
        "auto" : true
      } ],
      "frame" : [ {
        "color" : "64685c"
      } ]
    }, {
      "id" : "bay_window_upgrade",
      "params" : "0,230,334,230,16,1",
      "ofs" : "-159,-96",
      "data" : "_blocker",
      "dep" : "20,1",
      "anim" : [ {
        "range" : "0,1,2,3,4,5,6,7,8,9,10,11,12,13,14,15",
        "rhythm" : "2,2,2,2,2,2,2,2,2,2,2,2,2,2,2,2",
        "auto" : true
      } ]
    }, {
      "id" : "bay_alpha_platform",
      "params" : "0,1437,194,110,2,1",
      "ofs" : "33,-32",
      "data" : "_decal,_target",
      "engine" : "tile",
      "dep" : "4,6",
      "state" : {
        "id" : "off",
        "value" : " bay_alpha_platform_off "
      },
      "anim" : [ {
        "range" : "0,1",
        "rhythm" : "8,8",
        "auto" : true
      } ],
      "frame" : [ {
        "color" : "776b60"
      } ]
    }, {
      "id" : "bay_alpha_platform_upgrade",
      "params" : "0,1548,194,110,2,1",
      "ofs" : "33,-32",
      "data" : "_decal",
      "dep" : "4,6",
      "state" : {
        "id" : "off",
        "value" : " bay_alpha_platform_off "
      },
      "anim" : [ {
        "range" : "0,1",
        "rhythm" : "8,8",
        "auto" : true
      } ],
      "frame" : [ {
        "color" : "776b61"
      } ]
    }, {
      "id" : "bay_beta_platform",
      "params" : "1,1658,194,110,2,1",
      "ofs" : "7,-19",
      "data" : "_decal,_target",
      "dep" : "4,6",
      "anim" : [ {
        "range" : "0,1",
        "rhythm" : "8,8",
        "auto" : true
      } ],
      "frame" : [ {
        "color" : "96867f"
      } ]
    }, {
      "id" : "bay_beta_platform_upgrade",
      "params" : "1,1768,194,110,2,1",
      "ofs" : "7,-19",
      "data" : "_decal",
      "dep" : "4,6",
      "anim" : [ {
        "range" : "0,1",
        "rhythm" : "8,8",
        "auto" : true
      } ]
    }, {
      "id" : "spaceship",
      "params" : "0,1878,110,78",
      "ofs" : "21,-36",
      "data" : "_equipment,_target",
      "dep" : "4,5",
      "frame" : [ {
        "color" : "ff64cb"
      } ]
    }, {
      "id" : "spaceship_upgrade_a",
      "params" : "0,1956,110,78",
      "ofs" : "21,-36",
      "data" : "_blocker"
    }, {
      "id" : "spaceship_upgrade_b",
      "params" : "0,2034,110,78",
      "ofs" : "21,-36",
      "data" : "_blocker"
    }, {
      "id" : "spaceship_upgrade_ab",
      "params" : "0,2112,110,78",
      "ofs" : "21,-36",
      "data" : "_blocker"
    }, {
      "id" : "spaceship_broken",
      "params" : "0,2856,110,78",
      "ofs" : "21,-36",
      "data" : "_blocker,_target",
      "dep" : "4,5",
      "frame" : [ {
        "color" : "64ad12"
      } ]
    }, {
      "id" : "pasiphae",
      "params" : "0,2755,100,100",
      "ofs" : "15,-42",
      "data" : "_equipment",
      "dep" : "4,5",
      "frame" : [ {
        "color" : "9b52ed"
      } ]
    }, {
      "id" : "icarus",
      "params" : "0,2191,190,140",
      "ofs" : "-55,-52",
      "data" : "_equipment,_target",
      "dep" : "8,2",
      "frame" : [ {
        "color" : "b86134"
      } ]
    }, {
      "id" : "icarus_upgrade_a",
      "params" : "0,2332,190,140",
      "ofs" : "-55,-52",
      "data" : "_equipment"
    }, {
      "id" : "icarus_upgrade_b",
      "params" : "0,2473,190,140",
      "ofs" : "-55,-52",
      "data" : "_equipment"
    }, {
      "id" : "icarus_upgrade_ab",
      "params" : "0,2614,190,140",
      "ofs" : "-55,-52",
      "data" : "_equipment"
    }, {
      "id" : "garden",
      "params" : "0,677,268,180,4",
      "ofs" : "-32,-75",
      "data" : "_blocker,_target",
      "dep" : "10,6",
      "anim" : [ {
        "range" : "0,1,2,3",
        "rhythm" : "2,2,2,2",
        "auto" : true
      } ],
      "frame" : [ {
        "color" : "d7df23"
      } ]
    }, {
      "id" : "garden_upgrade_a",
      "params" : "0,858,268,180",
      "ofs" : "-32,-75",
      "data" : "_blocker"
    }, {
      "id" : "garden_upgrade_b",
      "params" : "0,1039,268,180",
      "ofs" : "-32,-75",
      "data" : "_blocker"
    }, {
      "id" : "garden_upgrade_ab",
      "params" : "0,1220,268,180",
      "ofs" : "-32,-75",
      "data" : "_blocker"
    }, {
      "id" : "plasma_shield",
      "params" : "0,469,240,208",
      "ofs" : "-102,-74",
      "data" : "_decal,_target",
      "dep" : "10,4",
      "frame" : [ {
        "color" : "2e83d5"
      } ]
    }, {
      "id" : "plasma_shield_upgrade",
      "params" : "0,469,240,208,7,1",
      "ofs" : "-102,-74",
      "data" : "_decal",
      "anim" : [ {
        "range" : "0,1,2,3,4,5,6",
        "rhythm" : "33,3,2,1,1,1,2",
        "auto" : true
      } ]
    } ]
  } ]
}