{
  "sheet" : [ {
    "src" : "BmpGfxDev",
    "slice" : [ {
      "id" : "equip_0",
      "params" : "32,32,32,48",
      "ofs" : "0,-10",
      "data" : "_equipment",
      "dep" : "1,1",
      "modulePad" : "1,0",
      "frame" : [ {
        "color" : "000FFF"
      } ]
    }, {
      "id" : "equip_1",
      "params" : "32,96, 32,48",
      "ofs" : "0,-10",
      "data" : "_equipment",
      "dep" : "1,1",
      "modulePad" : "1,0",
      "frame" : [ {
        "color" : "00AFFF"
      } ]
    }, {
      "id" : "equip_2",
      "params" : "32,160, 32,48",
      "ofs" : "0,-10",
      "data" : "_equipment",
      "dep" : "1,1",
      "modulePad" : "1,0",
      "frame" : [ {
        "color" : "00BFFF"
      } ]
    }, {
      "id" : "equip_3",
      "params" : "32,224, 32,48",
      "ofs" : "0,-10",
      "data" : "_equipment",
      "dep" : "1,1",
      "modulePad" : "1,0",
      "frame" : [ {
        "color" : "00CFFF"
      } ]
    } ]
  } ]
}