<?xml version="1.0" encoding="UTF-8"?>
<svg version="1.1" baseProfile="tiny" xmlns="http://www.w3.org/2000/svg" width="200" height="200">
<rect shape-rendering="optimizeSpeed"  x="0" y="0" width="200" height="200" fill="white" />
<rect shape-rendering="optimizeSpeed"  x="10" y="10" width="4" height="4" fill="black" />
<rect shape-rendering="optimizeSpeed"  x="14" y="10" width="4" height="4" fill="black" />
<rect shape-rendering="optimizeSpeed"  x="18" y="10" width="4" height="4" fill="black" />
<rect shape-rendering="optimizeSpeed"  x="22" y="10" width="4" height="4" fill="black" />
<rect shape-rendering="optimizeSpeed"  x="26" y="10" width="4" height="4" fill="black" />
<rect shape-rendering="optimizeSpeed"  x="30" y="10" width="4" height="4" fill="black" />
<rect shape-rendering="optimizeSpeed"  x="34" y="10" width="4" height="4" fill="black" />
<rect shape-rendering="optimizeSpeed"  x="46" y="10" width="4" height="4" fill="black" />
<rect shape-rendering="optimizeSpeed"  x="62" y="10" width="4" height="4" fill="black" />
<rect shape-rendering="optimizeSpeed"  x="66" y="10" width="4" height="4" fill="black" />
<rect shape-rendering="optimizeSpeed"  x="70" y="10" width="4" height="4" fill="black" />
<rect shape-rendering="optimizeSpeed"  x="86" y="10" width="4" height="4" fill="black" />
<rect shape-rendering="optimizeSpeed"  x="94" y="10" width="4" height="4" fill="black" />
<rect shape-rendering="optimizeSpeed"  x="110" y="10" width="4" height="4" fill="black" />
<rect shape-rendering="optimizeSpeed"  x="126" y="10" width="4" height="4" fill="black" />
<rect shape-rendering="optimizeSpeed"  x="130" y="10" width="4" height="4" fill="black" />
<rect shape-rendering="optimizeSpeed"  x="142" y="10" width="4" height="4" fill="black" />
<rect shape-rendering="optimizeSpeed"  x="154" y="10" width="4" height="4" fill="black" />
<rect shape-rendering="optimizeSpeed"  x="162" y="10" width="4" height="4" fill="black" />
<rect shape-rendering="optimizeSpeed"  x="166" y="10" width="4" height="4" fill="black" />
<rect shape-rendering="optimizeSpeed"  x="170" y="10" width="4" height="4" fill="black" />
<rect shape-rendering="optimizeSpeed"  x="174" y="10" width="4" height="4" fill="black" />
<rect shape-rendering="optimizeSpeed"  x="178" y="10" width="4" height="4" fill="black" />
<rect shape-rendering="optimizeSpeed"  x="182" y="10" width="4" height="4" fill="black" />
<rect shape-rendering="optimizeSpeed"  x="186" y="10" width="4" height="4" fill="black" />
<rect shape-rendering="optimizeSpeed"  x="10" y="14" width="4" height="4" fill="black" />
<rect shape-rendering="optimizeSpeed"  x="34" y="14" width="4" height="4" fill="black" />
<rect shape-rendering="optimizeSpeed"  x="42" y="14" width="4" height="4" fill="black" />
<rect shape-rendering="optimizeSpeed"  x="54" y="14" width="4" height="4" fill="black" />
<rect shape-rendering="optimizeSpeed"  x="70" y="14" width="4" height="4" fill="black" />
<rect shape-rendering="optimizeSpeed"  x="74" y="14" width="4" height="4" fill="black" />
<rect shape-rendering="optimizeSpeed"  x="82" y="14" width="4" height="4" fill="black" />
<rect shape-rendering="optimizeSpeed"  x="86" y="14" width="4" height="4" fill="black" />
<rect shape-rendering="optimizeSpeed"  x="94" y="14" width="4" height="4" fill="black" />
<rect shape-rendering="optimizeSpeed"  x="98" y="14" width="4" height="4" fill="black" />
<rect shape-rendering="optimizeSpeed"  x="102" y="14" width="4" height="4" fill="black" />
<rect shape-rendering="optimizeSpeed"  x="106" y="14" width="4" height="4" fill="black" />
<rect shape-rendering="optimizeSpeed"  x="110" y="14" width="4" height="4" fill="black" />
<rect shape-rendering="optimizeSpeed"  x="114" y="14" width="4" height="4" fill="black" />
<rect shape-rendering="optimizeSpeed"  x="126" y="14" width="4" height="4" fill="black" />
<rect shape-rendering="optimizeSpeed"  x="142" y="14" width="4" height="4" fill="black" />
<rect shape-rendering="optimizeSpeed"  x="150" y="14" width="4" height="4" fill="black" />
<rect shape-rendering="optimizeSpeed"  x="162" y="14" width="4" height="4" fill="black" />
<rect shape-rendering="optimizeSpeed"  x="186" y="14" width="4" height="4" fill="black" />
<rect shape-rendering="optimizeSpeed"  x="10" y="18" width="4" height="4" fill="black" />
<rect shape-rendering="optimizeSpeed"  x="18" y="18" width="4" height="4" fill="black" />
<rect shape-rendering="optimizeSpeed"  x="22" y="18" width="4" height="4" fill="black" />
<rect shape-rendering="optimizeSpeed"  x="26" y="18" width="4" height="4" fill="black" />
<rect shape-rendering="optimizeSpeed"  x="34" y="18" width="4" height="4" fill="black" />
<rect shape-rendering="optimizeSpeed"  x="46" y="18" width="4" height="4" fill="black" />
<rect shape-rendering="optimizeSpeed"  x="50" y="18" width="4" height="4" fill="black" />
<rect shape-rendering="optimizeSpeed"  x="54" y="18" width="4" height="4" fill="black" />
<rect shape-rendering="optimizeSpeed"  x="62" y="18" width="4" height="4" fill="black" />
<rect shape-rendering="optimizeSpeed"  x="70" y="18" width="4" height="4" fill="black" />
<rect shape-rendering="optimizeSpeed"  x="90" y="18" width="4" height="4" fill="black" />
<rect shape-rendering="optimizeSpeed"  x="94" y="18" width="4" height="4" fill="black" />
<rect shape-rendering="optimizeSpeed"  x="102" y="18" width="4" height="4" fill="black" />
<rect shape-rendering="optimizeSpeed"  x="106" y="18" width="4" height="4" fill="black" />
<rect shape-rendering="optimizeSpeed"  x="110" y="18" width="4" height="4" fill="black" />
<rect shape-rendering="optimizeSpeed"  x="122" y="18" width="4" height="4" fill="black" />
<rect shape-rendering="optimizeSpeed"  x="130" y="18" width="4" height="4" fill="black" />
<rect shape-rendering="optimizeSpeed"  x="138" y="18" width="4" height="4" fill="black" />
<rect shape-rendering="optimizeSpeed"  x="142" y="18" width="4" height="4" fill="black" />
<rect shape-rendering="optimizeSpeed"  x="150" y="18" width="4" height="4" fill="black" />
<rect shape-rendering="optimizeSpeed"  x="162" y="18" width="4" height="4" fill="black" />
<rect shape-rendering="optimizeSpeed"  x="170" y="18" width="4" height="4" fill="black" />
<rect shape-rendering="optimizeSpeed"  x="174" y="18" width="4" height="4" fill="black" />
<rect shape-rendering="optimizeSpeed"  x="178" y="18" width="4" height="4" fill="black" />
<rect shape-rendering="optimizeSpeed"  x="186" y="18" width="4" height="4" fill="black" />
<rect shape-rendering="optimizeSpeed"  x="10" y="22" width="4" height="4" fill="black" />
<rect shape-rendering="optimizeSpeed"  x="18" y="22" width="4" height="4" fill="black" />
<rect shape-rendering="optimizeSpeed"  x="22" y="22" width="4" height="4" fill="black" />
<rect shape-rendering="optimizeSpeed"  x="26" y="22" width="4" height="4" fill="black" />
<rect shape-rendering="optimizeSpeed"  x="34" y="22" width="4" height="4" fill="black" />
<rect shape-rendering="optimizeSpeed"  x="42" y="22" width="4" height="4" fill="black" />
<rect shape-rendering="optimizeSpeed"  x="46" y="22" width="4" height="4" fill="black" />
<rect shape-rendering="optimizeSpeed"  x="54" y="22" width="4" height="4" fill="black" />
<rect shape-rendering="optimizeSpeed"  x="58" y="22" width="4" height="4" fill="black" />
<rect shape-rendering="optimizeSpeed"  x="74" y="22" width="4" height="4" fill="black" />
<rect shape-rendering="optimizeSpeed"  x="78" y="22" width="4" height="4" fill="black" />
<rect shape-rendering="optimizeSpeed"  x="82" y="22" width="4" height="4" fill="black" />
<rect shape-rendering="optimizeSpeed"  x="86" y="22" width="4" height="4" fill="black" />
<rect shape-rendering="optimizeSpeed"  x="90" y="22" width="4" height="4" fill="black" />
<rect shape-rendering="optimizeSpeed"  x="98" y="22" width="4" height="4" fill="black" />
<rect shape-rendering="optimizeSpeed"  x="106" y="22" width="4" height="4" fill="black" />
<rect shape-rendering="optimizeSpeed"  x="114" y="22" width="4" height="4" fill="black" />
<rect shape-rendering="optimizeSpeed"  x="118" y="22" width="4" height="4" fill="black" />
<rect shape-rendering="optimizeSpeed"  x="126" y="22" width="4" height="4" fill="black" />
<rect shape-rendering="optimizeSpeed"  x="130" y="22" width="4" height="4" fill="black" />
<rect shape-rendering="optimizeSpeed"  x="150" y="22" width="4" height="4" fill="black" />
<rect shape-rendering="optimizeSpeed"  x="154" y="22" width="4" height="4" fill="black" />
<rect shape-rendering="optimizeSpeed"  x="162" y="22" width="4" height="4" fill="black" />
<rect shape-rendering="optimizeSpeed"  x="170" y="22" width="4" height="4" fill="black" />
<rect shape-rendering="optimizeSpeed"  x="174" y="22" width="4" height="4" fill="black" />
<rect shape-rendering="optimizeSpeed"  x="178" y="22" width="4" height="4" fill="black" />
<rect shape-rendering="optimizeSpeed"  x="186" y="22" width="4" height="4" fill="black" />
<rect shape-rendering="optimizeSpeed"  x="10" y="26" width="4" height="4" fill="black" />
<rect shape-rendering="optimizeSpeed"  x="18" y="26" width="4" height="4" fill="black" />
<rect shape-rendering="optimizeSpeed"  x="22" y="26" width="4" height="4" fill="black" />
<rect shape-rendering="optimizeSpeed"  x="26" y="26" width="4" height="4" fill="black" />
<rect shape-rendering="optimizeSpeed"  x="34" y="26" width="4" height="4" fill="black" />
<rect shape-rendering="optimizeSpeed"  x="46" y="26" width="4" height="4" fill="black" />
<rect shape-rendering="optimizeSpeed"  x="50" y="26" width="4" height="4" fill="black" />
<rect shape-rendering="optimizeSpeed"  x="62" y="26" width="4" height="4" fill="black" />
<rect shape-rendering="optimizeSpeed"  x="66" y="26" width="4" height="4" fill="black" />
<rect shape-rendering="optimizeSpeed"  x="70" y="26" width="4" height="4" fill="black" />
<rect shape-rendering="optimizeSpeed"  x="86" y="26" width="4" height="4" fill="black" />
<rect shape-rendering="optimizeSpeed"  x="90" y="26" width="4" height="4" fill="black" />
<rect shape-rendering="optimizeSpeed"  x="94" y="26" width="4" height="4" fill="black" />
<rect shape-rendering="optimizeSpeed"  x="98" y="26" width="4" height="4" fill="black" />
<rect shape-rendering="optimizeSpeed"  x="102" y="26" width="4" height="4" fill="black" />
<rect shape-rendering="optimizeSpeed"  x="106" y="26" width="4" height="4" fill="black" />
<rect shape-rendering="optimizeSpeed"  x="118" y="26" width="4" height="4" fill="black" />
<rect shape-rendering="optimizeSpeed"  x="130" y="26" width="4" height="4" fill="black" />
<rect shape-rendering="optimizeSpeed"  x="134" y="26" width="4" height="4" fill="black" />
<rect shape-rendering="optimizeSpeed"  x="146" y="26" width="4" height="4" fill="black" />
<rect shape-rendering="optimizeSpeed"  x="150" y="26" width="4" height="4" fill="black" />
<rect shape-rendering="optimizeSpeed"  x="154" y="26" width="4" height="4" fill="black" />
<rect shape-rendering="optimizeSpeed"  x="162" y="26" width="4" height="4" fill="black" />
<rect shape-rendering="optimizeSpeed"  x="170" y="26" width="4" height="4" fill="black" />
<rect shape-rendering="optimizeSpeed"  x="174" y="26" width="4" height="4" fill="black" />
<rect shape-rendering="optimizeSpeed"  x="178" y="26" width="4" height="4" fill="black" />
<rect shape-rendering="optimizeSpeed"  x="186" y="26" width="4" height="4" fill="black" />
<rect shape-rendering="optimizeSpeed"  x="10" y="30" width="4" height="4" fill="black" />
<rect shape-rendering="optimizeSpeed"  x="34" y="30" width="4" height="4" fill="black" />
<rect shape-rendering="optimizeSpeed"  x="42" y="30" width="4" height="4" fill="black" />
<rect shape-rendering="optimizeSpeed"  x="46" y="30" width="4" height="4" fill="black" />
<rect shape-rendering="optimizeSpeed"  x="50" y="30" width="4" height="4" fill="black" />
<rect shape-rendering="optimizeSpeed"  x="62" y="30" width="4" height="4" fill="black" />
<rect shape-rendering="optimizeSpeed"  x="66" y="30" width="4" height="4" fill="black" />
<rect shape-rendering="optimizeSpeed"  x="70" y="30" width="4" height="4" fill="black" />
<rect shape-rendering="optimizeSpeed"  x="78" y="30" width="4" height="4" fill="black" />
<rect shape-rendering="optimizeSpeed"  x="82" y="30" width="4" height="4" fill="black" />
<rect shape-rendering="optimizeSpeed"  x="90" y="30" width="4" height="4" fill="black" />
<rect shape-rendering="optimizeSpeed"  x="106" y="30" width="4" height="4" fill="black" />
<rect shape-rendering="optimizeSpeed"  x="110" y="30" width="4" height="4" fill="black" />
<rect shape-rendering="optimizeSpeed"  x="114" y="30" width="4" height="4" fill="black" />
<rect shape-rendering="optimizeSpeed"  x="126" y="30" width="4" height="4" fill="black" />
<rect shape-rendering="optimizeSpeed"  x="142" y="30" width="4" height="4" fill="black" />
<rect shape-rendering="optimizeSpeed"  x="162" y="30" width="4" height="4" fill="black" />
<rect shape-rendering="optimizeSpeed"  x="186" y="30" width="4" height="4" fill="black" />
<rect shape-rendering="optimizeSpeed"  x="10" y="34" width="4" height="4" fill="black" />
<rect shape-rendering="optimizeSpeed"  x="14" y="34" width="4" height="4" fill="black" />
<rect shape-rendering="optimizeSpeed"  x="18" y="34" width="4" height="4" fill="black" />
<rect shape-rendering="optimizeSpeed"  x="22" y="34" width="4" height="4" fill="black" />
<rect shape-rendering="optimizeSpeed"  x="26" y="34" width="4" height="4" fill="black" />
<rect shape-rendering="optimizeSpeed"  x="30" y="34" width="4" height="4" fill="black" />
<rect shape-rendering="optimizeSpeed"  x="34" y="34" width="4" height="4" fill="black" />
<rect shape-rendering="optimizeSpeed"  x="42" y="34" width="4" height="4" fill="black" />
<rect shape-rendering="optimizeSpeed"  x="50" y="34" width="4" height="4" fill="black" />
<rect shape-rendering="optimizeSpeed"  x="58" y="34" width="4" height="4" fill="black" />
<rect shape-rendering="optimizeSpeed"  x="66" y="34" width="4" height="4" fill="black" />
<rect shape-rendering="optimizeSpeed"  x="74" y="34" width="4" height="4" fill="black" />
<rect shape-rendering="optimizeSpeed"  x="82" y="34" width="4" height="4" fill="black" />
<rect shape-rendering="optimizeSpeed"  x="90" y="34" width="4" height="4" fill="black" />
<rect shape-rendering="optimizeSpeed"  x="98" y="34" width="4" height="4" fill="black" />
<rect shape-rendering="optimizeSpeed"  x="106" y="34" width="4" height="4" fill="black" />
<rect shape-rendering="optimizeSpeed"  x="114" y="34" width="4" height="4" fill="black" />
<rect shape-rendering="optimizeSpeed"  x="122" y="34" width="4" height="4" fill="black" />
<rect shape-rendering="optimizeSpeed"  x="130" y="34" width="4" height="4" fill="black" />
<rect shape-rendering="optimizeSpeed"  x="138" y="34" width="4" height="4" fill="black" />
<rect shape-rendering="optimizeSpeed"  x="146" y="34" width="4" height="4" fill="black" />
<rect shape-rendering="optimizeSpeed"  x="154" y="34" width="4" height="4" fill="black" />
<rect shape-rendering="optimizeSpeed"  x="162" y="34" width="4" height="4" fill="black" />
<rect shape-rendering="optimizeSpeed"  x="166" y="34" width="4" height="4" fill="black" />
<rect shape-rendering="optimizeSpeed"  x="170" y="34" width="4" height="4" fill="black" />
<rect shape-rendering="optimizeSpeed"  x="174" y="34" width="4" height="4" fill="black" />
<rect shape-rendering="optimizeSpeed"  x="178" y="34" width="4" height="4" fill="black" />
<rect shape-rendering="optimizeSpeed"  x="182" y="34" width="4" height="4" fill="black" />
<rect shape-rendering="optimizeSpeed"  x="186" y="34" width="4" height="4" fill="black" />
<rect shape-rendering="optimizeSpeed"  x="46" y="38" width="4" height="4" fill="black" />
<rect shape-rendering="optimizeSpeed"  x="62" y="38" width="4" height="4" fill="black" />
<rect shape-rendering="optimizeSpeed"  x="66" y="38" width="4" height="4" fill="black" />
<rect shape-rendering="optimizeSpeed"  x="70" y="38" width="4" height="4" fill="black" />
<rect shape-rendering="optimizeSpeed"  x="74" y="38" width="4" height="4" fill="black" />
<rect shape-rendering="optimizeSpeed"  x="78" y="38" width="4" height="4" fill="black" />
<rect shape-rendering="optimizeSpeed"  x="82" y="38" width="4" height="4" fill="black" />
<rect shape-rendering="optimizeSpeed"  x="86" y="38" width="4" height="4" fill="black" />
<rect shape-rendering="optimizeSpeed"  x="90" y="38" width="4" height="4" fill="black" />
<rect shape-rendering="optimizeSpeed"  x="106" y="38" width="4" height="4" fill="black" />
<rect shape-rendering="optimizeSpeed"  x="114" y="38" width="4" height="4" fill="black" />
<rect shape-rendering="optimizeSpeed"  x="118" y="38" width="4" height="4" fill="black" />
<rect shape-rendering="optimizeSpeed"  x="122" y="38" width="4" height="4" fill="black" />
<rect shape-rendering="optimizeSpeed"  x="130" y="38" width="4" height="4" fill="black" />
<rect shape-rendering="optimizeSpeed"  x="134" y="38" width="4" height="4" fill="black" />
<rect shape-rendering="optimizeSpeed"  x="138" y="38" width="4" height="4" fill="black" />
<rect shape-rendering="optimizeSpeed"  x="146" y="38" width="4" height="4" fill="black" />
<rect shape-rendering="optimizeSpeed"  x="150" y="38" width="4" height="4" fill="black" />
<rect shape-rendering="optimizeSpeed"  x="154" y="38" width="4" height="4" fill="black" />
<rect shape-rendering="optimizeSpeed"  x="10" y="42" width="4" height="4" fill="black" />
<rect shape-rendering="optimizeSpeed"  x="14" y="42" width="4" height="4" fill="black" />
<rect shape-rendering="optimizeSpeed"  x="18" y="42" width="4" height="4" fill="black" />
<rect shape-rendering="optimizeSpeed"  x="22" y="42" width="4" height="4" fill="black" />
<rect shape-rendering="optimizeSpeed"  x="26" y="42" width="4" height="4" fill="black" />
<rect shape-rendering="optimizeSpeed"  x="34" y="42" width="4" height="4" fill="black" />
<rect shape-rendering="optimizeSpeed"  x="38" y="42" width="4" height="4" fill="black" />
<rect shape-rendering="optimizeSpeed"  x="42" y="42" width="4" height="4" fill="black" />
<rect shape-rendering="optimizeSpeed"  x="46" y="42" width="4" height="4" fill="black" />
<rect shape-rendering="optimizeSpeed"  x="62" y="42" width="4" height="4" fill="black" />
<rect shape-rendering="optimizeSpeed"  x="74" y="42" width="4" height="4" fill="black" />
<rect shape-rendering="optimizeSpeed"  x="78" y="42" width="4" height="4" fill="black" />
<rect shape-rendering="optimizeSpeed"  x="82" y="42" width="4" height="4" fill="black" />
<rect shape-rendering="optimizeSpeed"  x="90" y="42" width="4" height="4" fill="black" />
<rect shape-rendering="optimizeSpeed"  x="94" y="42" width="4" height="4" fill="black" />
<rect shape-rendering="optimizeSpeed"  x="98" y="42" width="4" height="4" fill="black" />
<rect shape-rendering="optimizeSpeed"  x="102" y="42" width="4" height="4" fill="black" />
<rect shape-rendering="optimizeSpeed"  x="106" y="42" width="4" height="4" fill="black" />
<rect shape-rendering="optimizeSpeed"  x="126" y="42" width="4" height="4" fill="black" />
<rect shape-rendering="optimizeSpeed"  x="134" y="42" width="4" height="4" fill="black" />
<rect shape-rendering="optimizeSpeed"  x="142" y="42" width="4" height="4" fill="black" />
<rect shape-rendering="optimizeSpeed"  x="146" y="42" width="4" height="4" fill="black" />
<rect shape-rendering="optimizeSpeed"  x="158" y="42" width="4" height="4" fill="black" />
<rect shape-rendering="optimizeSpeed"  x="166" y="42" width="4" height="4" fill="black" />
<rect shape-rendering="optimizeSpeed"  x="174" y="42" width="4" height="4" fill="black" />
<rect shape-rendering="optimizeSpeed"  x="182" y="42" width="4" height="4" fill="black" />
<rect shape-rendering="optimizeSpeed"  x="14" y="46" width="4" height="4" fill="black" />
<rect shape-rendering="optimizeSpeed"  x="22" y="46" width="4" height="4" fill="black" />
<rect shape-rendering="optimizeSpeed"  x="46" y="46" width="4" height="4" fill="black" />
<rect shape-rendering="optimizeSpeed"  x="58" y="46" width="4" height="4" fill="black" />
<rect shape-rendering="optimizeSpeed"  x="66" y="46" width="4" height="4" fill="black" />
<rect shape-rendering="optimizeSpeed"  x="70" y="46" width="4" height="4" fill="black" />
<rect shape-rendering="optimizeSpeed"  x="86" y="46" width="4" height="4" fill="black" />
<rect shape-rendering="optimizeSpeed"  x="110" y="46" width="4" height="4" fill="black" />
<rect shape-rendering="optimizeSpeed"  x="118" y="46" width="4" height="4" fill="black" />
<rect shape-rendering="optimizeSpeed"  x="130" y="46" width="4" height="4" fill="black" />
<rect shape-rendering="optimizeSpeed"  x="134" y="46" width="4" height="4" fill="black" />
<rect shape-rendering="optimizeSpeed"  x="154" y="46" width="4" height="4" fill="black" />
<rect shape-rendering="optimizeSpeed"  x="170" y="46" width="4" height="4" fill="black" />
<rect shape-rendering="optimizeSpeed"  x="174" y="46" width="4" height="4" fill="black" />
<rect shape-rendering="optimizeSpeed"  x="178" y="46" width="4" height="4" fill="black" />
<rect shape-rendering="optimizeSpeed"  x="182" y="46" width="4" height="4" fill="black" />
<rect shape-rendering="optimizeSpeed"  x="186" y="46" width="4" height="4" fill="black" />
<rect shape-rendering="optimizeSpeed"  x="14" y="50" width="4" height="4" fill="black" />
<rect shape-rendering="optimizeSpeed"  x="18" y="50" width="4" height="4" fill="black" />
<rect shape-rendering="optimizeSpeed"  x="30" y="50" width="4" height="4" fill="black" />
<rect shape-rendering="optimizeSpeed"  x="34" y="50" width="4" height="4" fill="black" />
<rect shape-rendering="optimizeSpeed"  x="42" y="50" width="4" height="4" fill="black" />
<rect shape-rendering="optimizeSpeed"  x="50" y="50" width="4" height="4" fill="black" />
<rect shape-rendering="optimizeSpeed"  x="58" y="50" width="4" height="4" fill="black" />
<rect shape-rendering="optimizeSpeed"  x="70" y="50" width="4" height="4" fill="black" />
<rect shape-rendering="optimizeSpeed"  x="74" y="50" width="4" height="4" fill="black" />
<rect shape-rendering="optimizeSpeed"  x="78" y="50" width="4" height="4" fill="black" />
<rect shape-rendering="optimizeSpeed"  x="82" y="50" width="4" height="4" fill="black" />
<rect shape-rendering="optimizeSpeed"  x="86" y="50" width="4" height="4" fill="black" />
<rect shape-rendering="optimizeSpeed"  x="90" y="50" width="4" height="4" fill="black" />
<rect shape-rendering="optimizeSpeed"  x="98" y="50" width="4" height="4" fill="black" />
<rect shape-rendering="optimizeSpeed"  x="102" y="50" width="4" height="4" fill="black" />
<rect shape-rendering="optimizeSpeed"  x="106" y="50" width="4" height="4" fill="black" />
<rect shape-rendering="optimizeSpeed"  x="114" y="50" width="4" height="4" fill="black" />
<rect shape-rendering="optimizeSpeed"  x="122" y="50" width="4" height="4" fill="black" />
<rect shape-rendering="optimizeSpeed"  x="142" y="50" width="4" height="4" fill="black" />
<rect shape-rendering="optimizeSpeed"  x="146" y="50" width="4" height="4" fill="black" />
<rect shape-rendering="optimizeSpeed"  x="150" y="50" width="4" height="4" fill="black" />
<rect shape-rendering="optimizeSpeed"  x="154" y="50" width="4" height="4" fill="black" />
<rect shape-rendering="optimizeSpeed"  x="162" y="50" width="4" height="4" fill="black" />
<rect shape-rendering="optimizeSpeed"  x="174" y="50" width="4" height="4" fill="black" />
<rect shape-rendering="optimizeSpeed"  x="182" y="50" width="4" height="4" fill="black" />
<rect shape-rendering="optimizeSpeed"  x="22" y="54" width="4" height="4" fill="black" />
<rect shape-rendering="optimizeSpeed"  x="26" y="54" width="4" height="4" fill="black" />
<rect shape-rendering="optimizeSpeed"  x="30" y="54" width="4" height="4" fill="black" />
<rect shape-rendering="optimizeSpeed"  x="38" y="54" width="4" height="4" fill="black" />
<rect shape-rendering="optimizeSpeed"  x="50" y="54" width="4" height="4" fill="black" />
<rect shape-rendering="optimizeSpeed"  x="54" y="54" width="4" height="4" fill="black" />
<rect shape-rendering="optimizeSpeed"  x="58" y="54" width="4" height="4" fill="black" />
<rect shape-rendering="optimizeSpeed"  x="66" y="54" width="4" height="4" fill="black" />
<rect shape-rendering="optimizeSpeed"  x="70" y="54" width="4" height="4" fill="black" />
<rect shape-rendering="optimizeSpeed"  x="78" y="54" width="4" height="4" fill="black" />
<rect shape-rendering="optimizeSpeed"  x="82" y="54" width="4" height="4" fill="black" />
<rect shape-rendering="optimizeSpeed"  x="122" y="54" width="4" height="4" fill="black" />
<rect shape-rendering="optimizeSpeed"  x="130" y="54" width="4" height="4" fill="black" />
<rect shape-rendering="optimizeSpeed"  x="134" y="54" width="4" height="4" fill="black" />
<rect shape-rendering="optimizeSpeed"  x="138" y="54" width="4" height="4" fill="black" />
<rect shape-rendering="optimizeSpeed"  x="142" y="54" width="4" height="4" fill="black" />
<rect shape-rendering="optimizeSpeed"  x="150" y="54" width="4" height="4" fill="black" />
<rect shape-rendering="optimizeSpeed"  x="154" y="54" width="4" height="4" fill="black" />
<rect shape-rendering="optimizeSpeed"  x="158" y="54" width="4" height="4" fill="black" />
<rect shape-rendering="optimizeSpeed"  x="162" y="54" width="4" height="4" fill="black" />
<rect shape-rendering="optimizeSpeed"  x="166" y="54" width="4" height="4" fill="black" />
<rect shape-rendering="optimizeSpeed"  x="170" y="54" width="4" height="4" fill="black" />
<rect shape-rendering="optimizeSpeed"  x="178" y="54" width="4" height="4" fill="black" />
<rect shape-rendering="optimizeSpeed"  x="14" y="58" width="4" height="4" fill="black" />
<rect shape-rendering="optimizeSpeed"  x="18" y="58" width="4" height="4" fill="black" />
<rect shape-rendering="optimizeSpeed"  x="22" y="58" width="4" height="4" fill="black" />
<rect shape-rendering="optimizeSpeed"  x="34" y="58" width="4" height="4" fill="black" />
<rect shape-rendering="optimizeSpeed"  x="38" y="58" width="4" height="4" fill="black" />
<rect shape-rendering="optimizeSpeed"  x="50" y="58" width="4" height="4" fill="black" />
<rect shape-rendering="optimizeSpeed"  x="74" y="58" width="4" height="4" fill="black" />
<rect shape-rendering="optimizeSpeed"  x="82" y="58" width="4" height="4" fill="black" />
<rect shape-rendering="optimizeSpeed"  x="90" y="58" width="4" height="4" fill="black" />
<rect shape-rendering="optimizeSpeed"  x="98" y="58" width="4" height="4" fill="black" />
<rect shape-rendering="optimizeSpeed"  x="106" y="58" width="4" height="4" fill="black" />
<rect shape-rendering="optimizeSpeed"  x="110" y="58" width="4" height="4" fill="black" />
<rect shape-rendering="optimizeSpeed"  x="114" y="58" width="4" height="4" fill="black" />
<rect shape-rendering="optimizeSpeed"  x="118" y="58" width="4" height="4" fill="black" />
<rect shape-rendering="optimizeSpeed"  x="126" y="58" width="4" height="4" fill="black" />
<rect shape-rendering="optimizeSpeed"  x="130" y="58" width="4" height="4" fill="black" />
<rect shape-rendering="optimizeSpeed"  x="150" y="58" width="4" height="4" fill="black" />
<rect shape-rendering="optimizeSpeed"  x="162" y="58" width="4" height="4" fill="black" />
<rect shape-rendering="optimizeSpeed"  x="166" y="58" width="4" height="4" fill="black" />
<rect shape-rendering="optimizeSpeed"  x="174" y="58" width="4" height="4" fill="black" />
<rect shape-rendering="optimizeSpeed"  x="182" y="58" width="4" height="4" fill="black" />
<rect shape-rendering="optimizeSpeed"  x="18" y="62" width="4" height="4" fill="black" />
<rect shape-rendering="optimizeSpeed"  x="22" y="62" width="4" height="4" fill="black" />
<rect shape-rendering="optimizeSpeed"  x="42" y="62" width="4" height="4" fill="black" />
<rect shape-rendering="optimizeSpeed"  x="46" y="62" width="4" height="4" fill="black" />
<rect shape-rendering="optimizeSpeed"  x="50" y="62" width="4" height="4" fill="black" />
<rect shape-rendering="optimizeSpeed"  x="62" y="62" width="4" height="4" fill="black" />
<rect shape-rendering="optimizeSpeed"  x="66" y="62" width="4" height="4" fill="black" />
<rect shape-rendering="optimizeSpeed"  x="70" y="62" width="4" height="4" fill="black" />
<rect shape-rendering="optimizeSpeed"  x="94" y="62" width="4" height="4" fill="black" />
<rect shape-rendering="optimizeSpeed"  x="98" y="62" width="4" height="4" fill="black" />
<rect shape-rendering="optimizeSpeed"  x="106" y="62" width="4" height="4" fill="black" />
<rect shape-rendering="optimizeSpeed"  x="110" y="62" width="4" height="4" fill="black" />
<rect shape-rendering="optimizeSpeed"  x="122" y="62" width="4" height="4" fill="black" />
<rect shape-rendering="optimizeSpeed"  x="126" y="62" width="4" height="4" fill="black" />
<rect shape-rendering="optimizeSpeed"  x="130" y="62" width="4" height="4" fill="black" />
<rect shape-rendering="optimizeSpeed"  x="134" y="62" width="4" height="4" fill="black" />
<rect shape-rendering="optimizeSpeed"  x="142" y="62" width="4" height="4" fill="black" />
<rect shape-rendering="optimizeSpeed"  x="150" y="62" width="4" height="4" fill="black" />
<rect shape-rendering="optimizeSpeed"  x="154" y="62" width="4" height="4" fill="black" />
<rect shape-rendering="optimizeSpeed"  x="166" y="62" width="4" height="4" fill="black" />
<rect shape-rendering="optimizeSpeed"  x="170" y="62" width="4" height="4" fill="black" />
<rect shape-rendering="optimizeSpeed"  x="178" y="62" width="4" height="4" fill="black" />
<rect shape-rendering="optimizeSpeed"  x="182" y="62" width="4" height="4" fill="black" />
<rect shape-rendering="optimizeSpeed"  x="186" y="62" width="4" height="4" fill="black" />
<rect shape-rendering="optimizeSpeed"  x="18" y="66" width="4" height="4" fill="black" />
<rect shape-rendering="optimizeSpeed"  x="34" y="66" width="4" height="4" fill="black" />
<rect shape-rendering="optimizeSpeed"  x="50" y="66" width="4" height="4" fill="black" />
<rect shape-rendering="optimizeSpeed"  x="54" y="66" width="4" height="4" fill="black" />
<rect shape-rendering="optimizeSpeed"  x="58" y="66" width="4" height="4" fill="black" />
<rect shape-rendering="optimizeSpeed"  x="66" y="66" width="4" height="4" fill="black" />
<rect shape-rendering="optimizeSpeed"  x="70" y="66" width="4" height="4" fill="black" />
<rect shape-rendering="optimizeSpeed"  x="74" y="66" width="4" height="4" fill="black" />
<rect shape-rendering="optimizeSpeed"  x="78" y="66" width="4" height="4" fill="black" />
<rect shape-rendering="optimizeSpeed"  x="82" y="66" width="4" height="4" fill="black" />
<rect shape-rendering="optimizeSpeed"  x="86" y="66" width="4" height="4" fill="black" />
<rect shape-rendering="optimizeSpeed"  x="90" y="66" width="4" height="4" fill="black" />
<rect shape-rendering="optimizeSpeed"  x="94" y="66" width="4" height="4" fill="black" />
<rect shape-rendering="optimizeSpeed"  x="98" y="66" width="4" height="4" fill="black" />
<rect shape-rendering="optimizeSpeed"  x="102" y="66" width="4" height="4" fill="black" />
<rect shape-rendering="optimizeSpeed"  x="106" y="66" width="4" height="4" fill="black" />
<rect shape-rendering="optimizeSpeed"  x="114" y="66" width="4" height="4" fill="black" />
<rect shape-rendering="optimizeSpeed"  x="118" y="66" width="4" height="4" fill="black" />
<rect shape-rendering="optimizeSpeed"  x="126" y="66" width="4" height="4" fill="black" />
<rect shape-rendering="optimizeSpeed"  x="134" y="66" width="4" height="4" fill="black" />
<rect shape-rendering="optimizeSpeed"  x="138" y="66" width="4" height="4" fill="black" />
<rect shape-rendering="optimizeSpeed"  x="146" y="66" width="4" height="4" fill="black" />
<rect shape-rendering="optimizeSpeed"  x="150" y="66" width="4" height="4" fill="black" />
<rect shape-rendering="optimizeSpeed"  x="154" y="66" width="4" height="4" fill="black" />
<rect shape-rendering="optimizeSpeed"  x="158" y="66" width="4" height="4" fill="black" />
<rect shape-rendering="optimizeSpeed"  x="162" y="66" width="4" height="4" fill="black" />
<rect shape-rendering="optimizeSpeed"  x="178" y="66" width="4" height="4" fill="black" />
<rect shape-rendering="optimizeSpeed"  x="14" y="70" width="4" height="4" fill="black" />
<rect shape-rendering="optimizeSpeed"  x="18" y="70" width="4" height="4" fill="black" />
<rect shape-rendering="optimizeSpeed"  x="22" y="70" width="4" height="4" fill="black" />
<rect shape-rendering="optimizeSpeed"  x="46" y="70" width="4" height="4" fill="black" />
<rect shape-rendering="optimizeSpeed"  x="50" y="70" width="4" height="4" fill="black" />
<rect shape-rendering="optimizeSpeed"  x="74" y="70" width="4" height="4" fill="black" />
<rect shape-rendering="optimizeSpeed"  x="82" y="70" width="4" height="4" fill="black" />
<rect shape-rendering="optimizeSpeed"  x="86" y="70" width="4" height="4" fill="black" />
<rect shape-rendering="optimizeSpeed"  x="94" y="70" width="4" height="4" fill="black" />
<rect shape-rendering="optimizeSpeed"  x="102" y="70" width="4" height="4" fill="black" />
<rect shape-rendering="optimizeSpeed"  x="118" y="70" width="4" height="4" fill="black" />
<rect shape-rendering="optimizeSpeed"  x="122" y="70" width="4" height="4" fill="black" />
<rect shape-rendering="optimizeSpeed"  x="126" y="70" width="4" height="4" fill="black" />
<rect shape-rendering="optimizeSpeed"  x="138" y="70" width="4" height="4" fill="black" />
<rect shape-rendering="optimizeSpeed"  x="142" y="70" width="4" height="4" fill="black" />
<rect shape-rendering="optimizeSpeed"  x="154" y="70" width="4" height="4" fill="black" />
<rect shape-rendering="optimizeSpeed"  x="158" y="70" width="4" height="4" fill="black" />
<rect shape-rendering="optimizeSpeed"  x="162" y="70" width="4" height="4" fill="black" />
<rect shape-rendering="optimizeSpeed"  x="170" y="70" width="4" height="4" fill="black" />
<rect shape-rendering="optimizeSpeed"  x="174" y="70" width="4" height="4" fill="black" />
<rect shape-rendering="optimizeSpeed"  x="178" y="70" width="4" height="4" fill="black" />
<rect shape-rendering="optimizeSpeed"  x="30" y="74" width="4" height="4" fill="black" />
<rect shape-rendering="optimizeSpeed"  x="34" y="74" width="4" height="4" fill="black" />
<rect shape-rendering="optimizeSpeed"  x="42" y="74" width="4" height="4" fill="black" />
<rect shape-rendering="optimizeSpeed"  x="54" y="74" width="4" height="4" fill="black" />
<rect shape-rendering="optimizeSpeed"  x="62" y="74" width="4" height="4" fill="black" />
<rect shape-rendering="optimizeSpeed"  x="74" y="74" width="4" height="4" fill="black" />
<rect shape-rendering="optimizeSpeed"  x="78" y="74" width="4" height="4" fill="black" />
<rect shape-rendering="optimizeSpeed"  x="82" y="74" width="4" height="4" fill="black" />
<rect shape-rendering="optimizeSpeed"  x="98" y="74" width="4" height="4" fill="black" />
<rect shape-rendering="optimizeSpeed"  x="110" y="74" width="4" height="4" fill="black" />
<rect shape-rendering="optimizeSpeed"  x="126" y="74" width="4" height="4" fill="black" />
<rect shape-rendering="optimizeSpeed"  x="134" y="74" width="4" height="4" fill="black" />
<rect shape-rendering="optimizeSpeed"  x="146" y="74" width="4" height="4" fill="black" />
<rect shape-rendering="optimizeSpeed"  x="162" y="74" width="4" height="4" fill="black" />
<rect shape-rendering="optimizeSpeed"  x="174" y="74" width="4" height="4" fill="black" />
<rect shape-rendering="optimizeSpeed"  x="182" y="74" width="4" height="4" fill="black" />
<rect shape-rendering="optimizeSpeed"  x="14" y="78" width="4" height="4" fill="black" />
<rect shape-rendering="optimizeSpeed"  x="18" y="78" width="4" height="4" fill="black" />
<rect shape-rendering="optimizeSpeed"  x="22" y="78" width="4" height="4" fill="black" />
<rect shape-rendering="optimizeSpeed"  x="38" y="78" width="4" height="4" fill="black" />
<rect shape-rendering="optimizeSpeed"  x="42" y="78" width="4" height="4" fill="black" />
<rect shape-rendering="optimizeSpeed"  x="50" y="78" width="4" height="4" fill="black" />
<rect shape-rendering="optimizeSpeed"  x="54" y="78" width="4" height="4" fill="black" />
<rect shape-rendering="optimizeSpeed"  x="58" y="78" width="4" height="4" fill="black" />
<rect shape-rendering="optimizeSpeed"  x="66" y="78" width="4" height="4" fill="black" />
<rect shape-rendering="optimizeSpeed"  x="70" y="78" width="4" height="4" fill="black" />
<rect shape-rendering="optimizeSpeed"  x="86" y="78" width="4" height="4" fill="black" />
<rect shape-rendering="optimizeSpeed"  x="94" y="78" width="4" height="4" fill="black" />
<rect shape-rendering="optimizeSpeed"  x="102" y="78" width="4" height="4" fill="black" />
<rect shape-rendering="optimizeSpeed"  x="110" y="78" width="4" height="4" fill="black" />
<rect shape-rendering="optimizeSpeed"  x="126" y="78" width="4" height="4" fill="black" />
<rect shape-rendering="optimizeSpeed"  x="130" y="78" width="4" height="4" fill="black" />
<rect shape-rendering="optimizeSpeed"  x="134" y="78" width="4" height="4" fill="black" />
<rect shape-rendering="optimizeSpeed"  x="150" y="78" width="4" height="4" fill="black" />
<rect shape-rendering="optimizeSpeed"  x="154" y="78" width="4" height="4" fill="black" />
<rect shape-rendering="optimizeSpeed"  x="158" y="78" width="4" height="4" fill="black" />
<rect shape-rendering="optimizeSpeed"  x="170" y="78" width="4" height="4" fill="black" />
<rect shape-rendering="optimizeSpeed"  x="178" y="78" width="4" height="4" fill="black" />
<rect shape-rendering="optimizeSpeed"  x="182" y="78" width="4" height="4" fill="black" />
<rect shape-rendering="optimizeSpeed"  x="186" y="78" width="4" height="4" fill="black" />
<rect shape-rendering="optimizeSpeed"  x="10" y="82" width="4" height="4" fill="black" />
<rect shape-rendering="optimizeSpeed"  x="18" y="82" width="4" height="4" fill="black" />
<rect shape-rendering="optimizeSpeed"  x="22" y="82" width="4" height="4" fill="black" />
<rect shape-rendering="optimizeSpeed"  x="34" y="82" width="4" height="4" fill="black" />
<rect shape-rendering="optimizeSpeed"  x="38" y="82" width="4" height="4" fill="black" />
<rect shape-rendering="optimizeSpeed"  x="42" y="82" width="4" height="4" fill="black" />
<rect shape-rendering="optimizeSpeed"  x="54" y="82" width="4" height="4" fill="black" />
<rect shape-rendering="optimizeSpeed"  x="58" y="82" width="4" height="4" fill="black" />
<rect shape-rendering="optimizeSpeed"  x="62" y="82" width="4" height="4" fill="black" />
<rect shape-rendering="optimizeSpeed"  x="74" y="82" width="4" height="4" fill="black" />
<rect shape-rendering="optimizeSpeed"  x="86" y="82" width="4" height="4" fill="black" />
<rect shape-rendering="optimizeSpeed"  x="90" y="82" width="4" height="4" fill="black" />
<rect shape-rendering="optimizeSpeed"  x="94" y="82" width="4" height="4" fill="black" />
<rect shape-rendering="optimizeSpeed"  x="98" y="82" width="4" height="4" fill="black" />
<rect shape-rendering="optimizeSpeed"  x="106" y="82" width="4" height="4" fill="black" />
<rect shape-rendering="optimizeSpeed"  x="114" y="82" width="4" height="4" fill="black" />
<rect shape-rendering="optimizeSpeed"  x="118" y="82" width="4" height="4" fill="black" />
<rect shape-rendering="optimizeSpeed"  x="126" y="82" width="4" height="4" fill="black" />
<rect shape-rendering="optimizeSpeed"  x="134" y="82" width="4" height="4" fill="black" />
<rect shape-rendering="optimizeSpeed"  x="138" y="82" width="4" height="4" fill="black" />
<rect shape-rendering="optimizeSpeed"  x="142" y="82" width="4" height="4" fill="black" />
<rect shape-rendering="optimizeSpeed"  x="146" y="82" width="4" height="4" fill="black" />
<rect shape-rendering="optimizeSpeed"  x="154" y="82" width="4" height="4" fill="black" />
<rect shape-rendering="optimizeSpeed"  x="162" y="82" width="4" height="4" fill="black" />
<rect shape-rendering="optimizeSpeed"  x="182" y="82" width="4" height="4" fill="black" />
<rect shape-rendering="optimizeSpeed"  x="10" y="86" width="4" height="4" fill="black" />
<rect shape-rendering="optimizeSpeed"  x="18" y="86" width="4" height="4" fill="black" />
<rect shape-rendering="optimizeSpeed"  x="22" y="86" width="4" height="4" fill="black" />
<rect shape-rendering="optimizeSpeed"  x="54" y="86" width="4" height="4" fill="black" />
<rect shape-rendering="optimizeSpeed"  x="58" y="86" width="4" height="4" fill="black" />
<rect shape-rendering="optimizeSpeed"  x="62" y="86" width="4" height="4" fill="black" />
<rect shape-rendering="optimizeSpeed"  x="66" y="86" width="4" height="4" fill="black" />
<rect shape-rendering="optimizeSpeed"  x="78" y="86" width="4" height="4" fill="black" />
<rect shape-rendering="optimizeSpeed"  x="106" y="86" width="4" height="4" fill="black" />
<rect shape-rendering="optimizeSpeed"  x="122" y="86" width="4" height="4" fill="black" />
<rect shape-rendering="optimizeSpeed"  x="130" y="86" width="4" height="4" fill="black" />
<rect shape-rendering="optimizeSpeed"  x="138" y="86" width="4" height="4" fill="black" />
<rect shape-rendering="optimizeSpeed"  x="146" y="86" width="4" height="4" fill="black" />
<rect shape-rendering="optimizeSpeed"  x="150" y="86" width="4" height="4" fill="black" />
<rect shape-rendering="optimizeSpeed"  x="170" y="86" width="4" height="4" fill="black" />
<rect shape-rendering="optimizeSpeed"  x="178" y="86" width="4" height="4" fill="black" />
<rect shape-rendering="optimizeSpeed"  x="26" y="90" width="4" height="4" fill="black" />
<rect shape-rendering="optimizeSpeed"  x="30" y="90" width="4" height="4" fill="black" />
<rect shape-rendering="optimizeSpeed"  x="34" y="90" width="4" height="4" fill="black" />
<rect shape-rendering="optimizeSpeed"  x="38" y="90" width="4" height="4" fill="black" />
<rect shape-rendering="optimizeSpeed"  x="42" y="90" width="4" height="4" fill="black" />
<rect shape-rendering="optimizeSpeed"  x="46" y="90" width="4" height="4" fill="black" />
<rect shape-rendering="optimizeSpeed"  x="70" y="90" width="4" height="4" fill="black" />
<rect shape-rendering="optimizeSpeed"  x="74" y="90" width="4" height="4" fill="black" />
<rect shape-rendering="optimizeSpeed"  x="78" y="90" width="4" height="4" fill="black" />
<rect shape-rendering="optimizeSpeed"  x="82" y="90" width="4" height="4" fill="black" />
<rect shape-rendering="optimizeSpeed"  x="90" y="90" width="4" height="4" fill="black" />
<rect shape-rendering="optimizeSpeed"  x="94" y="90" width="4" height="4" fill="black" />
<rect shape-rendering="optimizeSpeed"  x="98" y="90" width="4" height="4" fill="black" />
<rect shape-rendering="optimizeSpeed"  x="102" y="90" width="4" height="4" fill="black" />
<rect shape-rendering="optimizeSpeed"  x="106" y="90" width="4" height="4" fill="black" />
<rect shape-rendering="optimizeSpeed"  x="110" y="90" width="4" height="4" fill="black" />
<rect shape-rendering="optimizeSpeed"  x="118" y="90" width="4" height="4" fill="black" />
<rect shape-rendering="optimizeSpeed"  x="126" y="90" width="4" height="4" fill="black" />
<rect shape-rendering="optimizeSpeed"  x="134" y="90" width="4" height="4" fill="black" />
<rect shape-rendering="optimizeSpeed"  x="154" y="90" width="4" height="4" fill="black" />
<rect shape-rendering="optimizeSpeed"  x="158" y="90" width="4" height="4" fill="black" />
<rect shape-rendering="optimizeSpeed"  x="162" y="90" width="4" height="4" fill="black" />
<rect shape-rendering="optimizeSpeed"  x="166" y="90" width="4" height="4" fill="black" />
<rect shape-rendering="optimizeSpeed"  x="170" y="90" width="4" height="4" fill="black" />
<rect shape-rendering="optimizeSpeed"  x="174" y="90" width="4" height="4" fill="black" />
<rect shape-rendering="optimizeSpeed"  x="182" y="90" width="4" height="4" fill="black" />
<rect shape-rendering="optimizeSpeed"  x="10" y="94" width="4" height="4" fill="black" />
<rect shape-rendering="optimizeSpeed"  x="18" y="94" width="4" height="4" fill="black" />
<rect shape-rendering="optimizeSpeed"  x="22" y="94" width="4" height="4" fill="black" />
<rect shape-rendering="optimizeSpeed"  x="26" y="94" width="4" height="4" fill="black" />
<rect shape-rendering="optimizeSpeed"  x="42" y="94" width="4" height="4" fill="black" />
<rect shape-rendering="optimizeSpeed"  x="46" y="94" width="4" height="4" fill="black" />
<rect shape-rendering="optimizeSpeed"  x="58" y="94" width="4" height="4" fill="black" />
<rect shape-rendering="optimizeSpeed"  x="62" y="94" width="4" height="4" fill="black" />
<rect shape-rendering="optimizeSpeed"  x="66" y="94" width="4" height="4" fill="black" />
<rect shape-rendering="optimizeSpeed"  x="70" y="94" width="4" height="4" fill="black" />
<rect shape-rendering="optimizeSpeed"  x="78" y="94" width="4" height="4" fill="black" />
<rect shape-rendering="optimizeSpeed"  x="82" y="94" width="4" height="4" fill="black" />
<rect shape-rendering="optimizeSpeed"  x="86" y="94" width="4" height="4" fill="black" />
<rect shape-rendering="optimizeSpeed"  x="90" y="94" width="4" height="4" fill="black" />
<rect shape-rendering="optimizeSpeed"  x="106" y="94" width="4" height="4" fill="black" />
<rect shape-rendering="optimizeSpeed"  x="118" y="94" width="4" height="4" fill="black" />
<rect shape-rendering="optimizeSpeed"  x="122" y="94" width="4" height="4" fill="black" />
<rect shape-rendering="optimizeSpeed"  x="130" y="94" width="4" height="4" fill="black" />
<rect shape-rendering="optimizeSpeed"  x="134" y="94" width="4" height="4" fill="black" />
<rect shape-rendering="optimizeSpeed"  x="138" y="94" width="4" height="4" fill="black" />
<rect shape-rendering="optimizeSpeed"  x="142" y="94" width="4" height="4" fill="black" />
<rect shape-rendering="optimizeSpeed"  x="150" y="94" width="4" height="4" fill="black" />
<rect shape-rendering="optimizeSpeed"  x="154" y="94" width="4" height="4" fill="black" />
<rect shape-rendering="optimizeSpeed"  x="170" y="94" width="4" height="4" fill="black" />
<rect shape-rendering="optimizeSpeed"  x="178" y="94" width="4" height="4" fill="black" />
<rect shape-rendering="optimizeSpeed"  x="182" y="94" width="4" height="4" fill="black" />
<rect shape-rendering="optimizeSpeed"  x="186" y="94" width="4" height="4" fill="black" />
<rect shape-rendering="optimizeSpeed"  x="14" y="98" width="4" height="4" fill="black" />
<rect shape-rendering="optimizeSpeed"  x="18" y="98" width="4" height="4" fill="black" />
<rect shape-rendering="optimizeSpeed"  x="26" y="98" width="4" height="4" fill="black" />
<rect shape-rendering="optimizeSpeed"  x="34" y="98" width="4" height="4" fill="black" />
<rect shape-rendering="optimizeSpeed"  x="42" y="98" width="4" height="4" fill="black" />
<rect shape-rendering="optimizeSpeed"  x="50" y="98" width="4" height="4" fill="black" />
<rect shape-rendering="optimizeSpeed"  x="54" y="98" width="4" height="4" fill="black" />
<rect shape-rendering="optimizeSpeed"  x="58" y="98" width="4" height="4" fill="black" />
<rect shape-rendering="optimizeSpeed"  x="62" y="98" width="4" height="4" fill="black" />
<rect shape-rendering="optimizeSpeed"  x="66" y="98" width="4" height="4" fill="black" />
<rect shape-rendering="optimizeSpeed"  x="70" y="98" width="4" height="4" fill="black" />
<rect shape-rendering="optimizeSpeed"  x="82" y="98" width="4" height="4" fill="black" />
<rect shape-rendering="optimizeSpeed"  x="90" y="98" width="4" height="4" fill="black" />
<rect shape-rendering="optimizeSpeed"  x="98" y="98" width="4" height="4" fill="black" />
<rect shape-rendering="optimizeSpeed"  x="106" y="98" width="4" height="4" fill="black" />
<rect shape-rendering="optimizeSpeed"  x="110" y="98" width="4" height="4" fill="black" />
<rect shape-rendering="optimizeSpeed"  x="114" y="98" width="4" height="4" fill="black" />
<rect shape-rendering="optimizeSpeed"  x="126" y="98" width="4" height="4" fill="black" />
<rect shape-rendering="optimizeSpeed"  x="142" y="98" width="4" height="4" fill="black" />
<rect shape-rendering="optimizeSpeed"  x="146" y="98" width="4" height="4" fill="black" />
<rect shape-rendering="optimizeSpeed"  x="150" y="98" width="4" height="4" fill="black" />
<rect shape-rendering="optimizeSpeed"  x="154" y="98" width="4" height="4" fill="black" />
<rect shape-rendering="optimizeSpeed"  x="162" y="98" width="4" height="4" fill="black" />
<rect shape-rendering="optimizeSpeed"  x="170" y="98" width="4" height="4" fill="black" />
<rect shape-rendering="optimizeSpeed"  x="174" y="98" width="4" height="4" fill="black" />
<rect shape-rendering="optimizeSpeed"  x="14" y="102" width="4" height="4" fill="black" />
<rect shape-rendering="optimizeSpeed"  x="18" y="102" width="4" height="4" fill="black" />
<rect shape-rendering="optimizeSpeed"  x="26" y="102" width="4" height="4" fill="black" />
<rect shape-rendering="optimizeSpeed"  x="42" y="102" width="4" height="4" fill="black" />
<rect shape-rendering="optimizeSpeed"  x="46" y="102" width="4" height="4" fill="black" />
<rect shape-rendering="optimizeSpeed"  x="50" y="102" width="4" height="4" fill="black" />
<rect shape-rendering="optimizeSpeed"  x="70" y="102" width="4" height="4" fill="black" />
<rect shape-rendering="optimizeSpeed"  x="90" y="102" width="4" height="4" fill="black" />
<rect shape-rendering="optimizeSpeed"  x="106" y="102" width="4" height="4" fill="black" />
<rect shape-rendering="optimizeSpeed"  x="110" y="102" width="4" height="4" fill="black" />
<rect shape-rendering="optimizeSpeed"  x="114" y="102" width="4" height="4" fill="black" />
<rect shape-rendering="optimizeSpeed"  x="118" y="102" width="4" height="4" fill="black" />
<rect shape-rendering="optimizeSpeed"  x="130" y="102" width="4" height="4" fill="black" />
<rect shape-rendering="optimizeSpeed"  x="138" y="102" width="4" height="4" fill="black" />
<rect shape-rendering="optimizeSpeed"  x="146" y="102" width="4" height="4" fill="black" />
<rect shape-rendering="optimizeSpeed"  x="154" y="102" width="4" height="4" fill="black" />
<rect shape-rendering="optimizeSpeed"  x="170" y="102" width="4" height="4" fill="black" />
<rect shape-rendering="optimizeSpeed"  x="178" y="102" width="4" height="4" fill="black" />
<rect shape-rendering="optimizeSpeed"  x="182" y="102" width="4" height="4" fill="black" />
<rect shape-rendering="optimizeSpeed"  x="186" y="102" width="4" height="4" fill="black" />
<rect shape-rendering="optimizeSpeed"  x="10" y="106" width="4" height="4" fill="black" />
<rect shape-rendering="optimizeSpeed"  x="18" y="106" width="4" height="4" fill="black" />
<rect shape-rendering="optimizeSpeed"  x="22" y="106" width="4" height="4" fill="black" />
<rect shape-rendering="optimizeSpeed"  x="26" y="106" width="4" height="4" fill="black" />
<rect shape-rendering="optimizeSpeed"  x="30" y="106" width="4" height="4" fill="black" />
<rect shape-rendering="optimizeSpeed"  x="34" y="106" width="4" height="4" fill="black" />
<rect shape-rendering="optimizeSpeed"  x="38" y="106" width="4" height="4" fill="black" />
<rect shape-rendering="optimizeSpeed"  x="42" y="106" width="4" height="4" fill="black" />
<rect shape-rendering="optimizeSpeed"  x="54" y="106" width="4" height="4" fill="black" />
<rect shape-rendering="optimizeSpeed"  x="58" y="106" width="4" height="4" fill="black" />
<rect shape-rendering="optimizeSpeed"  x="74" y="106" width="4" height="4" fill="black" />
<rect shape-rendering="optimizeSpeed"  x="82" y="106" width="4" height="4" fill="black" />
<rect shape-rendering="optimizeSpeed"  x="86" y="106" width="4" height="4" fill="black" />
<rect shape-rendering="optimizeSpeed"  x="90" y="106" width="4" height="4" fill="black" />
<rect shape-rendering="optimizeSpeed"  x="94" y="106" width="4" height="4" fill="black" />
<rect shape-rendering="optimizeSpeed"  x="98" y="106" width="4" height="4" fill="black" />
<rect shape-rendering="optimizeSpeed"  x="102" y="106" width="4" height="4" fill="black" />
<rect shape-rendering="optimizeSpeed"  x="106" y="106" width="4" height="4" fill="black" />
<rect shape-rendering="optimizeSpeed"  x="114" y="106" width="4" height="4" fill="black" />
<rect shape-rendering="optimizeSpeed"  x="130" y="106" width="4" height="4" fill="black" />
<rect shape-rendering="optimizeSpeed"  x="134" y="106" width="4" height="4" fill="black" />
<rect shape-rendering="optimizeSpeed"  x="146" y="106" width="4" height="4" fill="black" />
<rect shape-rendering="optimizeSpeed"  x="154" y="106" width="4" height="4" fill="black" />
<rect shape-rendering="optimizeSpeed"  x="158" y="106" width="4" height="4" fill="black" />
<rect shape-rendering="optimizeSpeed"  x="162" y="106" width="4" height="4" fill="black" />
<rect shape-rendering="optimizeSpeed"  x="166" y="106" width="4" height="4" fill="black" />
<rect shape-rendering="optimizeSpeed"  x="170" y="106" width="4" height="4" fill="black" />
<rect shape-rendering="optimizeSpeed"  x="174" y="106" width="4" height="4" fill="black" />
<rect shape-rendering="optimizeSpeed"  x="182" y="106" width="4" height="4" fill="black" />
<rect shape-rendering="optimizeSpeed"  x="10" y="110" width="4" height="4" fill="black" />
<rect shape-rendering="optimizeSpeed"  x="14" y="110" width="4" height="4" fill="black" />
<rect shape-rendering="optimizeSpeed"  x="18" y="110" width="4" height="4" fill="black" />
<rect shape-rendering="optimizeSpeed"  x="26" y="110" width="4" height="4" fill="black" />
<rect shape-rendering="optimizeSpeed"  x="30" y="110" width="4" height="4" fill="black" />
<rect shape-rendering="optimizeSpeed"  x="42" y="110" width="4" height="4" fill="black" />
<rect shape-rendering="optimizeSpeed"  x="46" y="110" width="4" height="4" fill="black" />
<rect shape-rendering="optimizeSpeed"  x="50" y="110" width="4" height="4" fill="black" />
<rect shape-rendering="optimizeSpeed"  x="58" y="110" width="4" height="4" fill="black" />
<rect shape-rendering="optimizeSpeed"  x="62" y="110" width="4" height="4" fill="black" />
<rect shape-rendering="optimizeSpeed"  x="66" y="110" width="4" height="4" fill="black" />
<rect shape-rendering="optimizeSpeed"  x="70" y="110" width="4" height="4" fill="black" />
<rect shape-rendering="optimizeSpeed"  x="78" y="110" width="4" height="4" fill="black" />
<rect shape-rendering="optimizeSpeed"  x="86" y="110" width="4" height="4" fill="black" />
<rect shape-rendering="optimizeSpeed"  x="90" y="110" width="4" height="4" fill="black" />
<rect shape-rendering="optimizeSpeed"  x="94" y="110" width="4" height="4" fill="black" />
<rect shape-rendering="optimizeSpeed"  x="98" y="110" width="4" height="4" fill="black" />
<rect shape-rendering="optimizeSpeed"  x="102" y="110" width="4" height="4" fill="black" />
<rect shape-rendering="optimizeSpeed"  x="106" y="110" width="4" height="4" fill="black" />
<rect shape-rendering="optimizeSpeed"  x="110" y="110" width="4" height="4" fill="black" />
<rect shape-rendering="optimizeSpeed"  x="122" y="110" width="4" height="4" fill="black" />
<rect shape-rendering="optimizeSpeed"  x="126" y="110" width="4" height="4" fill="black" />
<rect shape-rendering="optimizeSpeed"  x="130" y="110" width="4" height="4" fill="black" />
<rect shape-rendering="optimizeSpeed"  x="134" y="110" width="4" height="4" fill="black" />
<rect shape-rendering="optimizeSpeed"  x="138" y="110" width="4" height="4" fill="black" />
<rect shape-rendering="optimizeSpeed"  x="162" y="110" width="4" height="4" fill="black" />
<rect shape-rendering="optimizeSpeed"  x="166" y="110" width="4" height="4" fill="black" />
<rect shape-rendering="optimizeSpeed"  x="174" y="110" width="4" height="4" fill="black" />
<rect shape-rendering="optimizeSpeed"  x="178" y="110" width="4" height="4" fill="black" />
<rect shape-rendering="optimizeSpeed"  x="182" y="110" width="4" height="4" fill="black" />
<rect shape-rendering="optimizeSpeed"  x="186" y="110" width="4" height="4" fill="black" />
<rect shape-rendering="optimizeSpeed"  x="10" y="114" width="4" height="4" fill="black" />
<rect shape-rendering="optimizeSpeed"  x="14" y="114" width="4" height="4" fill="black" />
<rect shape-rendering="optimizeSpeed"  x="18" y="114" width="4" height="4" fill="black" />
<rect shape-rendering="optimizeSpeed"  x="22" y="114" width="4" height="4" fill="black" />
<rect shape-rendering="optimizeSpeed"  x="30" y="114" width="4" height="4" fill="black" />
<rect shape-rendering="optimizeSpeed"  x="34" y="114" width="4" height="4" fill="black" />
<rect shape-rendering="optimizeSpeed"  x="38" y="114" width="4" height="4" fill="black" />
<rect shape-rendering="optimizeSpeed"  x="42" y="114" width="4" height="4" fill="black" />
<rect shape-rendering="optimizeSpeed"  x="50" y="114" width="4" height="4" fill="black" />
<rect shape-rendering="optimizeSpeed"  x="54" y="114" width="4" height="4" fill="black" />
<rect shape-rendering="optimizeSpeed"  x="58" y="114" width="4" height="4" fill="black" />
<rect shape-rendering="optimizeSpeed"  x="62" y="114" width="4" height="4" fill="black" />
<rect shape-rendering="optimizeSpeed"  x="70" y="114" width="4" height="4" fill="black" />
<rect shape-rendering="optimizeSpeed"  x="74" y="114" width="4" height="4" fill="black" />
<rect shape-rendering="optimizeSpeed"  x="82" y="114" width="4" height="4" fill="black" />
<rect shape-rendering="optimizeSpeed"  x="94" y="114" width="4" height="4" fill="black" />
<rect shape-rendering="optimizeSpeed"  x="114" y="114" width="4" height="4" fill="black" />
<rect shape-rendering="optimizeSpeed"  x="122" y="114" width="4" height="4" fill="black" />
<rect shape-rendering="optimizeSpeed"  x="134" y="114" width="4" height="4" fill="black" />
<rect shape-rendering="optimizeSpeed"  x="138" y="114" width="4" height="4" fill="black" />
<rect shape-rendering="optimizeSpeed"  x="142" y="114" width="4" height="4" fill="black" />
<rect shape-rendering="optimizeSpeed"  x="146" y="114" width="4" height="4" fill="black" />
<rect shape-rendering="optimizeSpeed"  x="154" y="114" width="4" height="4" fill="black" />
<rect shape-rendering="optimizeSpeed"  x="178" y="114" width="4" height="4" fill="black" />
<rect shape-rendering="optimizeSpeed"  x="182" y="114" width="4" height="4" fill="black" />
<rect shape-rendering="optimizeSpeed"  x="10" y="118" width="4" height="4" fill="black" />
<rect shape-rendering="optimizeSpeed"  x="14" y="118" width="4" height="4" fill="black" />
<rect shape-rendering="optimizeSpeed"  x="22" y="118" width="4" height="4" fill="black" />
<rect shape-rendering="optimizeSpeed"  x="38" y="118" width="4" height="4" fill="black" />
<rect shape-rendering="optimizeSpeed"  x="42" y="118" width="4" height="4" fill="black" />
<rect shape-rendering="optimizeSpeed"  x="58" y="118" width="4" height="4" fill="black" />
<rect shape-rendering="optimizeSpeed"  x="66" y="118" width="4" height="4" fill="black" />
<rect shape-rendering="optimizeSpeed"  x="90" y="118" width="4" height="4" fill="black" />
<rect shape-rendering="optimizeSpeed"  x="94" y="118" width="4" height="4" fill="black" />
<rect shape-rendering="optimizeSpeed"  x="106" y="118" width="4" height="4" fill="black" />
<rect shape-rendering="optimizeSpeed"  x="110" y="118" width="4" height="4" fill="black" />
<rect shape-rendering="optimizeSpeed"  x="122" y="118" width="4" height="4" fill="black" />
<rect shape-rendering="optimizeSpeed"  x="130" y="118" width="4" height="4" fill="black" />
<rect shape-rendering="optimizeSpeed"  x="134" y="118" width="4" height="4" fill="black" />
<rect shape-rendering="optimizeSpeed"  x="138" y="118" width="4" height="4" fill="black" />
<rect shape-rendering="optimizeSpeed"  x="142" y="118" width="4" height="4" fill="black" />
<rect shape-rendering="optimizeSpeed"  x="150" y="118" width="4" height="4" fill="black" />
<rect shape-rendering="optimizeSpeed"  x="158" y="118" width="4" height="4" fill="black" />
<rect shape-rendering="optimizeSpeed"  x="162" y="118" width="4" height="4" fill="black" />
<rect shape-rendering="optimizeSpeed"  x="166" y="118" width="4" height="4" fill="black" />
<rect shape-rendering="optimizeSpeed"  x="178" y="118" width="4" height="4" fill="black" />
<rect shape-rendering="optimizeSpeed"  x="26" y="122" width="4" height="4" fill="black" />
<rect shape-rendering="optimizeSpeed"  x="34" y="122" width="4" height="4" fill="black" />
<rect shape-rendering="optimizeSpeed"  x="38" y="122" width="4" height="4" fill="black" />
<rect shape-rendering="optimizeSpeed"  x="42" y="122" width="4" height="4" fill="black" />
<rect shape-rendering="optimizeSpeed"  x="50" y="122" width="4" height="4" fill="black" />
<rect shape-rendering="optimizeSpeed"  x="54" y="122" width="4" height="4" fill="black" />
<rect shape-rendering="optimizeSpeed"  x="74" y="122" width="4" height="4" fill="black" />
<rect shape-rendering="optimizeSpeed"  x="78" y="122" width="4" height="4" fill="black" />
<rect shape-rendering="optimizeSpeed"  x="82" y="122" width="4" height="4" fill="black" />
<rect shape-rendering="optimizeSpeed"  x="86" y="122" width="4" height="4" fill="black" />
<rect shape-rendering="optimizeSpeed"  x="90" y="122" width="4" height="4" fill="black" />
<rect shape-rendering="optimizeSpeed"  x="102" y="122" width="4" height="4" fill="black" />
<rect shape-rendering="optimizeSpeed"  x="106" y="122" width="4" height="4" fill="black" />
<rect shape-rendering="optimizeSpeed"  x="118" y="122" width="4" height="4" fill="black" />
<rect shape-rendering="optimizeSpeed"  x="130" y="122" width="4" height="4" fill="black" />
<rect shape-rendering="optimizeSpeed"  x="158" y="122" width="4" height="4" fill="black" />
<rect shape-rendering="optimizeSpeed"  x="170" y="122" width="4" height="4" fill="black" />
<rect shape-rendering="optimizeSpeed"  x="174" y="122" width="4" height="4" fill="black" />
<rect shape-rendering="optimizeSpeed"  x="186" y="122" width="4" height="4" fill="black" />
<rect shape-rendering="optimizeSpeed"  x="18" y="126" width="4" height="4" fill="black" />
<rect shape-rendering="optimizeSpeed"  x="22" y="126" width="4" height="4" fill="black" />
<rect shape-rendering="optimizeSpeed"  x="30" y="126" width="4" height="4" fill="black" />
<rect shape-rendering="optimizeSpeed"  x="50" y="126" width="4" height="4" fill="black" />
<rect shape-rendering="optimizeSpeed"  x="58" y="126" width="4" height="4" fill="black" />
<rect shape-rendering="optimizeSpeed"  x="62" y="126" width="4" height="4" fill="black" />
<rect shape-rendering="optimizeSpeed"  x="66" y="126" width="4" height="4" fill="black" />
<rect shape-rendering="optimizeSpeed"  x="70" y="126" width="4" height="4" fill="black" />
<rect shape-rendering="optimizeSpeed"  x="86" y="126" width="4" height="4" fill="black" />
<rect shape-rendering="optimizeSpeed"  x="98" y="126" width="4" height="4" fill="black" />
<rect shape-rendering="optimizeSpeed"  x="106" y="126" width="4" height="4" fill="black" />
<rect shape-rendering="optimizeSpeed"  x="118" y="126" width="4" height="4" fill="black" />
<rect shape-rendering="optimizeSpeed"  x="122" y="126" width="4" height="4" fill="black" />
<rect shape-rendering="optimizeSpeed"  x="126" y="126" width="4" height="4" fill="black" />
<rect shape-rendering="optimizeSpeed"  x="130" y="126" width="4" height="4" fill="black" />
<rect shape-rendering="optimizeSpeed"  x="134" y="126" width="4" height="4" fill="black" />
<rect shape-rendering="optimizeSpeed"  x="142" y="126" width="4" height="4" fill="black" />
<rect shape-rendering="optimizeSpeed"  x="150" y="126" width="4" height="4" fill="black" />
<rect shape-rendering="optimizeSpeed"  x="158" y="126" width="4" height="4" fill="black" />
<rect shape-rendering="optimizeSpeed"  x="162" y="126" width="4" height="4" fill="black" />
<rect shape-rendering="optimizeSpeed"  x="182" y="126" width="4" height="4" fill="black" />
<rect shape-rendering="optimizeSpeed"  x="186" y="126" width="4" height="4" fill="black" />
<rect shape-rendering="optimizeSpeed"  x="10" y="130" width="4" height="4" fill="black" />
<rect shape-rendering="optimizeSpeed"  x="14" y="130" width="4" height="4" fill="black" />
<rect shape-rendering="optimizeSpeed"  x="22" y="130" width="4" height="4" fill="black" />
<rect shape-rendering="optimizeSpeed"  x="34" y="130" width="4" height="4" fill="black" />
<rect shape-rendering="optimizeSpeed"  x="42" y="130" width="4" height="4" fill="black" />
<rect shape-rendering="optimizeSpeed"  x="46" y="130" width="4" height="4" fill="black" />
<rect shape-rendering="optimizeSpeed"  x="54" y="130" width="4" height="4" fill="black" />
<rect shape-rendering="optimizeSpeed"  x="62" y="130" width="4" height="4" fill="black" />
<rect shape-rendering="optimizeSpeed"  x="66" y="130" width="4" height="4" fill="black" />
<rect shape-rendering="optimizeSpeed"  x="74" y="130" width="4" height="4" fill="black" />
<rect shape-rendering="optimizeSpeed"  x="82" y="130" width="4" height="4" fill="black" />
<rect shape-rendering="optimizeSpeed"  x="90" y="130" width="4" height="4" fill="black" />
<rect shape-rendering="optimizeSpeed"  x="94" y="130" width="4" height="4" fill="black" />
<rect shape-rendering="optimizeSpeed"  x="98" y="130" width="4" height="4" fill="black" />
<rect shape-rendering="optimizeSpeed"  x="110" y="130" width="4" height="4" fill="black" />
<rect shape-rendering="optimizeSpeed"  x="114" y="130" width="4" height="4" fill="black" />
<rect shape-rendering="optimizeSpeed"  x="126" y="130" width="4" height="4" fill="black" />
<rect shape-rendering="optimizeSpeed"  x="146" y="130" width="4" height="4" fill="black" />
<rect shape-rendering="optimizeSpeed"  x="154" y="130" width="4" height="4" fill="black" />
<rect shape-rendering="optimizeSpeed"  x="158" y="130" width="4" height="4" fill="black" />
<rect shape-rendering="optimizeSpeed"  x="170" y="130" width="4" height="4" fill="black" />
<rect shape-rendering="optimizeSpeed"  x="10" y="134" width="4" height="4" fill="black" />
<rect shape-rendering="optimizeSpeed"  x="18" y="134" width="4" height="4" fill="black" />
<rect shape-rendering="optimizeSpeed"  x="22" y="134" width="4" height="4" fill="black" />
<rect shape-rendering="optimizeSpeed"  x="30" y="134" width="4" height="4" fill="black" />
<rect shape-rendering="optimizeSpeed"  x="42" y="134" width="4" height="4" fill="black" />
<rect shape-rendering="optimizeSpeed"  x="58" y="134" width="4" height="4" fill="black" />
<rect shape-rendering="optimizeSpeed"  x="62" y="134" width="4" height="4" fill="black" />
<rect shape-rendering="optimizeSpeed"  x="70" y="134" width="4" height="4" fill="black" />
<rect shape-rendering="optimizeSpeed"  x="78" y="134" width="4" height="4" fill="black" />
<rect shape-rendering="optimizeSpeed"  x="82" y="134" width="4" height="4" fill="black" />
<rect shape-rendering="optimizeSpeed"  x="102" y="134" width="4" height="4" fill="black" />
<rect shape-rendering="optimizeSpeed"  x="106" y="134" width="4" height="4" fill="black" />
<rect shape-rendering="optimizeSpeed"  x="110" y="134" width="4" height="4" fill="black" />
<rect shape-rendering="optimizeSpeed"  x="118" y="134" width="4" height="4" fill="black" />
<rect shape-rendering="optimizeSpeed"  x="122" y="134" width="4" height="4" fill="black" />
<rect shape-rendering="optimizeSpeed"  x="126" y="134" width="4" height="4" fill="black" />
<rect shape-rendering="optimizeSpeed"  x="138" y="134" width="4" height="4" fill="black" />
<rect shape-rendering="optimizeSpeed"  x="146" y="134" width="4" height="4" fill="black" />
<rect shape-rendering="optimizeSpeed"  x="150" y="134" width="4" height="4" fill="black" />
<rect shape-rendering="optimizeSpeed"  x="162" y="134" width="4" height="4" fill="black" />
<rect shape-rendering="optimizeSpeed"  x="178" y="134" width="4" height="4" fill="black" />
<rect shape-rendering="optimizeSpeed"  x="186" y="134" width="4" height="4" fill="black" />
<rect shape-rendering="optimizeSpeed"  x="10" y="138" width="4" height="4" fill="black" />
<rect shape-rendering="optimizeSpeed"  x="14" y="138" width="4" height="4" fill="black" />
<rect shape-rendering="optimizeSpeed"  x="22" y="138" width="4" height="4" fill="black" />
<rect shape-rendering="optimizeSpeed"  x="26" y="138" width="4" height="4" fill="black" />
<rect shape-rendering="optimizeSpeed"  x="30" y="138" width="4" height="4" fill="black" />
<rect shape-rendering="optimizeSpeed"  x="34" y="138" width="4" height="4" fill="black" />
<rect shape-rendering="optimizeSpeed"  x="38" y="138" width="4" height="4" fill="black" />
<rect shape-rendering="optimizeSpeed"  x="50" y="138" width="4" height="4" fill="black" />
<rect shape-rendering="optimizeSpeed"  x="58" y="138" width="4" height="4" fill="black" />
<rect shape-rendering="optimizeSpeed"  x="62" y="138" width="4" height="4" fill="black" />
<rect shape-rendering="optimizeSpeed"  x="74" y="138" width="4" height="4" fill="black" />
<rect shape-rendering="optimizeSpeed"  x="78" y="138" width="4" height="4" fill="black" />
<rect shape-rendering="optimizeSpeed"  x="82" y="138" width="4" height="4" fill="black" />
<rect shape-rendering="optimizeSpeed"  x="86" y="138" width="4" height="4" fill="black" />
<rect shape-rendering="optimizeSpeed"  x="102" y="138" width="4" height="4" fill="black" />
<rect shape-rendering="optimizeSpeed"  x="106" y="138" width="4" height="4" fill="black" />
<rect shape-rendering="optimizeSpeed"  x="118" y="138" width="4" height="4" fill="black" />
<rect shape-rendering="optimizeSpeed"  x="130" y="138" width="4" height="4" fill="black" />
<rect shape-rendering="optimizeSpeed"  x="158" y="138" width="4" height="4" fill="black" />
<rect shape-rendering="optimizeSpeed"  x="170" y="138" width="4" height="4" fill="black" />
<rect shape-rendering="optimizeSpeed"  x="182" y="138" width="4" height="4" fill="black" />
<rect shape-rendering="optimizeSpeed"  x="186" y="138" width="4" height="4" fill="black" />
<rect shape-rendering="optimizeSpeed"  x="10" y="142" width="4" height="4" fill="black" />
<rect shape-rendering="optimizeSpeed"  x="14" y="142" width="4" height="4" fill="black" />
<rect shape-rendering="optimizeSpeed"  x="18" y="142" width="4" height="4" fill="black" />
<rect shape-rendering="optimizeSpeed"  x="26" y="142" width="4" height="4" fill="black" />
<rect shape-rendering="optimizeSpeed"  x="30" y="142" width="4" height="4" fill="black" />
<rect shape-rendering="optimizeSpeed"  x="42" y="142" width="4" height="4" fill="black" />
<rect shape-rendering="optimizeSpeed"  x="54" y="142" width="4" height="4" fill="black" />
<rect shape-rendering="optimizeSpeed"  x="66" y="142" width="4" height="4" fill="black" />
<rect shape-rendering="optimizeSpeed"  x="70" y="142" width="4" height="4" fill="black" />
<rect shape-rendering="optimizeSpeed"  x="86" y="142" width="4" height="4" fill="black" />
<rect shape-rendering="optimizeSpeed"  x="90" y="142" width="4" height="4" fill="black" />
<rect shape-rendering="optimizeSpeed"  x="94" y="142" width="4" height="4" fill="black" />
<rect shape-rendering="optimizeSpeed"  x="98" y="142" width="4" height="4" fill="black" />
<rect shape-rendering="optimizeSpeed"  x="110" y="142" width="4" height="4" fill="black" />
<rect shape-rendering="optimizeSpeed"  x="126" y="142" width="4" height="4" fill="black" />
<rect shape-rendering="optimizeSpeed"  x="130" y="142" width="4" height="4" fill="black" />
<rect shape-rendering="optimizeSpeed"  x="134" y="142" width="4" height="4" fill="black" />
<rect shape-rendering="optimizeSpeed"  x="138" y="142" width="4" height="4" fill="black" />
<rect shape-rendering="optimizeSpeed"  x="142" y="142" width="4" height="4" fill="black" />
<rect shape-rendering="optimizeSpeed"  x="150" y="142" width="4" height="4" fill="black" />
<rect shape-rendering="optimizeSpeed"  x="158" y="142" width="4" height="4" fill="black" />
<rect shape-rendering="optimizeSpeed"  x="166" y="142" width="4" height="4" fill="black" />
<rect shape-rendering="optimizeSpeed"  x="186" y="142" width="4" height="4" fill="black" />
<rect shape-rendering="optimizeSpeed"  x="26" y="146" width="4" height="4" fill="black" />
<rect shape-rendering="optimizeSpeed"  x="34" y="146" width="4" height="4" fill="black" />
<rect shape-rendering="optimizeSpeed"  x="38" y="146" width="4" height="4" fill="black" />
<rect shape-rendering="optimizeSpeed"  x="78" y="146" width="4" height="4" fill="black" />
<rect shape-rendering="optimizeSpeed"  x="82" y="146" width="4" height="4" fill="black" />
<rect shape-rendering="optimizeSpeed"  x="90" y="146" width="4" height="4" fill="black" />
<rect shape-rendering="optimizeSpeed"  x="94" y="146" width="4" height="4" fill="black" />
<rect shape-rendering="optimizeSpeed"  x="98" y="146" width="4" height="4" fill="black" />
<rect shape-rendering="optimizeSpeed"  x="110" y="146" width="4" height="4" fill="black" />
<rect shape-rendering="optimizeSpeed"  x="114" y="146" width="4" height="4" fill="black" />
<rect shape-rendering="optimizeSpeed"  x="134" y="146" width="4" height="4" fill="black" />
<rect shape-rendering="optimizeSpeed"  x="142" y="146" width="4" height="4" fill="black" />
<rect shape-rendering="optimizeSpeed"  x="146" y="146" width="4" height="4" fill="black" />
<rect shape-rendering="optimizeSpeed"  x="150" y="146" width="4" height="4" fill="black" />
<rect shape-rendering="optimizeSpeed"  x="154" y="146" width="4" height="4" fill="black" />
<rect shape-rendering="optimizeSpeed"  x="158" y="146" width="4" height="4" fill="black" />
<rect shape-rendering="optimizeSpeed"  x="166" y="146" width="4" height="4" fill="black" />
<rect shape-rendering="optimizeSpeed"  x="174" y="146" width="4" height="4" fill="black" />
<rect shape-rendering="optimizeSpeed"  x="178" y="146" width="4" height="4" fill="black" />
<rect shape-rendering="optimizeSpeed"  x="182" y="146" width="4" height="4" fill="black" />
<rect shape-rendering="optimizeSpeed"  x="14" y="150" width="4" height="4" fill="black" />
<rect shape-rendering="optimizeSpeed"  x="18" y="150" width="4" height="4" fill="black" />
<rect shape-rendering="optimizeSpeed"  x="22" y="150" width="4" height="4" fill="black" />
<rect shape-rendering="optimizeSpeed"  x="26" y="150" width="4" height="4" fill="black" />
<rect shape-rendering="optimizeSpeed"  x="38" y="150" width="4" height="4" fill="black" />
<rect shape-rendering="optimizeSpeed"  x="50" y="150" width="4" height="4" fill="black" />
<rect shape-rendering="optimizeSpeed"  x="54" y="150" width="4" height="4" fill="black" />
<rect shape-rendering="optimizeSpeed"  x="66" y="150" width="4" height="4" fill="black" />
<rect shape-rendering="optimizeSpeed"  x="70" y="150" width="4" height="4" fill="black" />
<rect shape-rendering="optimizeSpeed"  x="82" y="150" width="4" height="4" fill="black" />
<rect shape-rendering="optimizeSpeed"  x="90" y="150" width="4" height="4" fill="black" />
<rect shape-rendering="optimizeSpeed"  x="94" y="150" width="4" height="4" fill="black" />
<rect shape-rendering="optimizeSpeed"  x="102" y="150" width="4" height="4" fill="black" />
<rect shape-rendering="optimizeSpeed"  x="106" y="150" width="4" height="4" fill="black" />
<rect shape-rendering="optimizeSpeed"  x="114" y="150" width="4" height="4" fill="black" />
<rect shape-rendering="optimizeSpeed"  x="118" y="150" width="4" height="4" fill="black" />
<rect shape-rendering="optimizeSpeed"  x="122" y="150" width="4" height="4" fill="black" />
<rect shape-rendering="optimizeSpeed"  x="138" y="150" width="4" height="4" fill="black" />
<rect shape-rendering="optimizeSpeed"  x="150" y="150" width="4" height="4" fill="black" />
<rect shape-rendering="optimizeSpeed"  x="158" y="150" width="4" height="4" fill="black" />
<rect shape-rendering="optimizeSpeed"  x="162" y="150" width="4" height="4" fill="black" />
<rect shape-rendering="optimizeSpeed"  x="170" y="150" width="4" height="4" fill="black" />
<rect shape-rendering="optimizeSpeed"  x="178" y="150" width="4" height="4" fill="black" />
<rect shape-rendering="optimizeSpeed"  x="10" y="154" width="4" height="4" fill="black" />
<rect shape-rendering="optimizeSpeed"  x="22" y="154" width="4" height="4" fill="black" />
<rect shape-rendering="optimizeSpeed"  x="26" y="154" width="4" height="4" fill="black" />
<rect shape-rendering="optimizeSpeed"  x="34" y="154" width="4" height="4" fill="black" />
<rect shape-rendering="optimizeSpeed"  x="38" y="154" width="4" height="4" fill="black" />
<rect shape-rendering="optimizeSpeed"  x="54" y="154" width="4" height="4" fill="black" />
<rect shape-rendering="optimizeSpeed"  x="74" y="154" width="4" height="4" fill="black" />
<rect shape-rendering="optimizeSpeed"  x="82" y="154" width="4" height="4" fill="black" />
<rect shape-rendering="optimizeSpeed"  x="90" y="154" width="4" height="4" fill="black" />
<rect shape-rendering="optimizeSpeed"  x="94" y="154" width="4" height="4" fill="black" />
<rect shape-rendering="optimizeSpeed"  x="98" y="154" width="4" height="4" fill="black" />
<rect shape-rendering="optimizeSpeed"  x="102" y="154" width="4" height="4" fill="black" />
<rect shape-rendering="optimizeSpeed"  x="106" y="154" width="4" height="4" fill="black" />
<rect shape-rendering="optimizeSpeed"  x="110" y="154" width="4" height="4" fill="black" />
<rect shape-rendering="optimizeSpeed"  x="130" y="154" width="4" height="4" fill="black" />
<rect shape-rendering="optimizeSpeed"  x="142" y="154" width="4" height="4" fill="black" />
<rect shape-rendering="optimizeSpeed"  x="154" y="154" width="4" height="4" fill="black" />
<rect shape-rendering="optimizeSpeed"  x="158" y="154" width="4" height="4" fill="black" />
<rect shape-rendering="optimizeSpeed"  x="162" y="154" width="4" height="4" fill="black" />
<rect shape-rendering="optimizeSpeed"  x="166" y="154" width="4" height="4" fill="black" />
<rect shape-rendering="optimizeSpeed"  x="170" y="154" width="4" height="4" fill="black" />
<rect shape-rendering="optimizeSpeed"  x="174" y="154" width="4" height="4" fill="black" />
<rect shape-rendering="optimizeSpeed"  x="186" y="154" width="4" height="4" fill="black" />
<rect shape-rendering="optimizeSpeed"  x="42" y="158" width="4" height="4" fill="black" />
<rect shape-rendering="optimizeSpeed"  x="46" y="158" width="4" height="4" fill="black" />
<rect shape-rendering="optimizeSpeed"  x="50" y="158" width="4" height="4" fill="black" />
<rect shape-rendering="optimizeSpeed"  x="58" y="158" width="4" height="4" fill="black" />
<rect shape-rendering="optimizeSpeed"  x="62" y="158" width="4" height="4" fill="black" />
<rect shape-rendering="optimizeSpeed"  x="66" y="158" width="4" height="4" fill="black" />
<rect shape-rendering="optimizeSpeed"  x="70" y="158" width="4" height="4" fill="black" />
<rect shape-rendering="optimizeSpeed"  x="86" y="158" width="4" height="4" fill="black" />
<rect shape-rendering="optimizeSpeed"  x="90" y="158" width="4" height="4" fill="black" />
<rect shape-rendering="optimizeSpeed"  x="106" y="158" width="4" height="4" fill="black" />
<rect shape-rendering="optimizeSpeed"  x="110" y="158" width="4" height="4" fill="black" />
<rect shape-rendering="optimizeSpeed"  x="118" y="158" width="4" height="4" fill="black" />
<rect shape-rendering="optimizeSpeed"  x="130" y="158" width="4" height="4" fill="black" />
<rect shape-rendering="optimizeSpeed"  x="138" y="158" width="4" height="4" fill="black" />
<rect shape-rendering="optimizeSpeed"  x="150" y="158" width="4" height="4" fill="black" />
<rect shape-rendering="optimizeSpeed"  x="154" y="158" width="4" height="4" fill="black" />
<rect shape-rendering="optimizeSpeed"  x="170" y="158" width="4" height="4" fill="black" />
<rect shape-rendering="optimizeSpeed"  x="174" y="158" width="4" height="4" fill="black" />
<rect shape-rendering="optimizeSpeed"  x="186" y="158" width="4" height="4" fill="black" />
<rect shape-rendering="optimizeSpeed"  x="10" y="162" width="4" height="4" fill="black" />
<rect shape-rendering="optimizeSpeed"  x="14" y="162" width="4" height="4" fill="black" />
<rect shape-rendering="optimizeSpeed"  x="18" y="162" width="4" height="4" fill="black" />
<rect shape-rendering="optimizeSpeed"  x="22" y="162" width="4" height="4" fill="black" />
<rect shape-rendering="optimizeSpeed"  x="26" y="162" width="4" height="4" fill="black" />
<rect shape-rendering="optimizeSpeed"  x="30" y="162" width="4" height="4" fill="black" />
<rect shape-rendering="optimizeSpeed"  x="34" y="162" width="4" height="4" fill="black" />
<rect shape-rendering="optimizeSpeed"  x="42" y="162" width="4" height="4" fill="black" />
<rect shape-rendering="optimizeSpeed"  x="46" y="162" width="4" height="4" fill="black" />
<rect shape-rendering="optimizeSpeed"  x="50" y="162" width="4" height="4" fill="black" />
<rect shape-rendering="optimizeSpeed"  x="58" y="162" width="4" height="4" fill="black" />
<rect shape-rendering="optimizeSpeed"  x="62" y="162" width="4" height="4" fill="black" />
<rect shape-rendering="optimizeSpeed"  x="70" y="162" width="4" height="4" fill="black" />
<rect shape-rendering="optimizeSpeed"  x="82" y="162" width="4" height="4" fill="black" />
<rect shape-rendering="optimizeSpeed"  x="86" y="162" width="4" height="4" fill="black" />
<rect shape-rendering="optimizeSpeed"  x="90" y="162" width="4" height="4" fill="black" />
<rect shape-rendering="optimizeSpeed"  x="98" y="162" width="4" height="4" fill="black" />
<rect shape-rendering="optimizeSpeed"  x="106" y="162" width="4" height="4" fill="black" />
<rect shape-rendering="optimizeSpeed"  x="114" y="162" width="4" height="4" fill="black" />
<rect shape-rendering="optimizeSpeed"  x="126" y="162" width="4" height="4" fill="black" />
<rect shape-rendering="optimizeSpeed"  x="142" y="162" width="4" height="4" fill="black" />
<rect shape-rendering="optimizeSpeed"  x="146" y="162" width="4" height="4" fill="black" />
<rect shape-rendering="optimizeSpeed"  x="150" y="162" width="4" height="4" fill="black" />
<rect shape-rendering="optimizeSpeed"  x="154" y="162" width="4" height="4" fill="black" />
<rect shape-rendering="optimizeSpeed"  x="162" y="162" width="4" height="4" fill="black" />
<rect shape-rendering="optimizeSpeed"  x="170" y="162" width="4" height="4" fill="black" />
<rect shape-rendering="optimizeSpeed"  x="174" y="162" width="4" height="4" fill="black" />
<rect shape-rendering="optimizeSpeed"  x="10" y="166" width="4" height="4" fill="black" />
<rect shape-rendering="optimizeSpeed"  x="34" y="166" width="4" height="4" fill="black" />
<rect shape-rendering="optimizeSpeed"  x="46" y="166" width="4" height="4" fill="black" />
<rect shape-rendering="optimizeSpeed"  x="50" y="166" width="4" height="4" fill="black" />
<rect shape-rendering="optimizeSpeed"  x="54" y="166" width="4" height="4" fill="black" />
<rect shape-rendering="optimizeSpeed"  x="62" y="166" width="4" height="4" fill="black" />
<rect shape-rendering="optimizeSpeed"  x="70" y="166" width="4" height="4" fill="black" />
<rect shape-rendering="optimizeSpeed"  x="78" y="166" width="4" height="4" fill="black" />
<rect shape-rendering="optimizeSpeed"  x="90" y="166" width="4" height="4" fill="black" />
<rect shape-rendering="optimizeSpeed"  x="106" y="166" width="4" height="4" fill="black" />
<rect shape-rendering="optimizeSpeed"  x="118" y="166" width="4" height="4" fill="black" />
<rect shape-rendering="optimizeSpeed"  x="122" y="166" width="4" height="4" fill="black" />
<rect shape-rendering="optimizeSpeed"  x="130" y="166" width="4" height="4" fill="black" />
<rect shape-rendering="optimizeSpeed"  x="138" y="166" width="4" height="4" fill="black" />
<rect shape-rendering="optimizeSpeed"  x="146" y="166" width="4" height="4" fill="black" />
<rect shape-rendering="optimizeSpeed"  x="150" y="166" width="4" height="4" fill="black" />
<rect shape-rendering="optimizeSpeed"  x="154" y="166" width="4" height="4" fill="black" />
<rect shape-rendering="optimizeSpeed"  x="170" y="166" width="4" height="4" fill="black" />
<rect shape-rendering="optimizeSpeed"  x="178" y="166" width="4" height="4" fill="black" />
<rect shape-rendering="optimizeSpeed"  x="10" y="170" width="4" height="4" fill="black" />
<rect shape-rendering="optimizeSpeed"  x="18" y="170" width="4" height="4" fill="black" />
<rect shape-rendering="optimizeSpeed"  x="22" y="170" width="4" height="4" fill="black" />
<rect shape-rendering="optimizeSpeed"  x="26" y="170" width="4" height="4" fill="black" />
<rect shape-rendering="optimizeSpeed"  x="34" y="170" width="4" height="4" fill="black" />
<rect shape-rendering="optimizeSpeed"  x="42" y="170" width="4" height="4" fill="black" />
<rect shape-rendering="optimizeSpeed"  x="50" y="170" width="4" height="4" fill="black" />
<rect shape-rendering="optimizeSpeed"  x="58" y="170" width="4" height="4" fill="black" />
<rect shape-rendering="optimizeSpeed"  x="62" y="170" width="4" height="4" fill="black" />
<rect shape-rendering="optimizeSpeed"  x="70" y="170" width="4" height="4" fill="black" />
<rect shape-rendering="optimizeSpeed"  x="74" y="170" width="4" height="4" fill="black" />
<rect shape-rendering="optimizeSpeed"  x="78" y="170" width="4" height="4" fill="black" />
<rect shape-rendering="optimizeSpeed"  x="82" y="170" width="4" height="4" fill="black" />
<rect shape-rendering="optimizeSpeed"  x="90" y="170" width="4" height="4" fill="black" />
<rect shape-rendering="optimizeSpeed"  x="94" y="170" width="4" height="4" fill="black" />
<rect shape-rendering="optimizeSpeed"  x="98" y="170" width="4" height="4" fill="black" />
<rect shape-rendering="optimizeSpeed"  x="102" y="170" width="4" height="4" fill="black" />
<rect shape-rendering="optimizeSpeed"  x="106" y="170" width="4" height="4" fill="black" />
<rect shape-rendering="optimizeSpeed"  x="114" y="170" width="4" height="4" fill="black" />
<rect shape-rendering="optimizeSpeed"  x="126" y="170" width="4" height="4" fill="black" />
<rect shape-rendering="optimizeSpeed"  x="130" y="170" width="4" height="4" fill="black" />
<rect shape-rendering="optimizeSpeed"  x="134" y="170" width="4" height="4" fill="black" />
<rect shape-rendering="optimizeSpeed"  x="142" y="170" width="4" height="4" fill="black" />
<rect shape-rendering="optimizeSpeed"  x="146" y="170" width="4" height="4" fill="black" />
<rect shape-rendering="optimizeSpeed"  x="150" y="170" width="4" height="4" fill="black" />
<rect shape-rendering="optimizeSpeed"  x="154" y="170" width="4" height="4" fill="black" />
<rect shape-rendering="optimizeSpeed"  x="158" y="170" width="4" height="4" fill="black" />
<rect shape-rendering="optimizeSpeed"  x="162" y="170" width="4" height="4" fill="black" />
<rect shape-rendering="optimizeSpeed"  x="166" y="170" width="4" height="4" fill="black" />
<rect shape-rendering="optimizeSpeed"  x="170" y="170" width="4" height="4" fill="black" />
<rect shape-rendering="optimizeSpeed"  x="10" y="174" width="4" height="4" fill="black" />
<rect shape-rendering="optimizeSpeed"  x="18" y="174" width="4" height="4" fill="black" />
<rect shape-rendering="optimizeSpeed"  x="22" y="174" width="4" height="4" fill="black" />
<rect shape-rendering="optimizeSpeed"  x="26" y="174" width="4" height="4" fill="black" />
<rect shape-rendering="optimizeSpeed"  x="34" y="174" width="4" height="4" fill="black" />
<rect shape-rendering="optimizeSpeed"  x="42" y="174" width="4" height="4" fill="black" />
<rect shape-rendering="optimizeSpeed"  x="58" y="174" width="4" height="4" fill="black" />
<rect shape-rendering="optimizeSpeed"  x="66" y="174" width="4" height="4" fill="black" />
<rect shape-rendering="optimizeSpeed"  x="86" y="174" width="4" height="4" fill="black" />
<rect shape-rendering="optimizeSpeed"  x="90" y="174" width="4" height="4" fill="black" />
<rect shape-rendering="optimizeSpeed"  x="94" y="174" width="4" height="4" fill="black" />
<rect shape-rendering="optimizeSpeed"  x="102" y="174" width="4" height="4" fill="black" />
<rect shape-rendering="optimizeSpeed"  x="106" y="174" width="4" height="4" fill="black" />
<rect shape-rendering="optimizeSpeed"  x="110" y="174" width="4" height="4" fill="black" />
<rect shape-rendering="optimizeSpeed"  x="122" y="174" width="4" height="4" fill="black" />
<rect shape-rendering="optimizeSpeed"  x="126" y="174" width="4" height="4" fill="black" />
<rect shape-rendering="optimizeSpeed"  x="130" y="174" width="4" height="4" fill="black" />
<rect shape-rendering="optimizeSpeed"  x="134" y="174" width="4" height="4" fill="black" />
<rect shape-rendering="optimizeSpeed"  x="158" y="174" width="4" height="4" fill="black" />
<rect shape-rendering="optimizeSpeed"  x="162" y="174" width="4" height="4" fill="black" />
<rect shape-rendering="optimizeSpeed"  x="170" y="174" width="4" height="4" fill="black" />
<rect shape-rendering="optimizeSpeed"  x="174" y="174" width="4" height="4" fill="black" />
<rect shape-rendering="optimizeSpeed"  x="178" y="174" width="4" height="4" fill="black" />
<rect shape-rendering="optimizeSpeed"  x="182" y="174" width="4" height="4" fill="black" />
<rect shape-rendering="optimizeSpeed"  x="10" y="178" width="4" height="4" fill="black" />
<rect shape-rendering="optimizeSpeed"  x="18" y="178" width="4" height="4" fill="black" />
<rect shape-rendering="optimizeSpeed"  x="22" y="178" width="4" height="4" fill="black" />
<rect shape-rendering="optimizeSpeed"  x="26" y="178" width="4" height="4" fill="black" />
<rect shape-rendering="optimizeSpeed"  x="34" y="178" width="4" height="4" fill="black" />
<rect shape-rendering="optimizeSpeed"  x="42" y="178" width="4" height="4" fill="black" />
<rect shape-rendering="optimizeSpeed"  x="46" y="178" width="4" height="4" fill="black" />
<rect shape-rendering="optimizeSpeed"  x="50" y="178" width="4" height="4" fill="black" />
<rect shape-rendering="optimizeSpeed"  x="70" y="178" width="4" height="4" fill="black" />
<rect shape-rendering="optimizeSpeed"  x="74" y="178" width="4" height="4" fill="black" />
<rect shape-rendering="optimizeSpeed"  x="78" y="178" width="4" height="4" fill="black" />
<rect shape-rendering="optimizeSpeed"  x="98" y="178" width="4" height="4" fill="black" />
<rect shape-rendering="optimizeSpeed"  x="114" y="178" width="4" height="4" fill="black" />
<rect shape-rendering="optimizeSpeed"  x="118" y="178" width="4" height="4" fill="black" />
<rect shape-rendering="optimizeSpeed"  x="134" y="178" width="4" height="4" fill="black" />
<rect shape-rendering="optimizeSpeed"  x="142" y="178" width="4" height="4" fill="black" />
<rect shape-rendering="optimizeSpeed"  x="146" y="178" width="4" height="4" fill="black" />
<rect shape-rendering="optimizeSpeed"  x="154" y="178" width="4" height="4" fill="black" />
<rect shape-rendering="optimizeSpeed"  x="158" y="178" width="4" height="4" fill="black" />
<rect shape-rendering="optimizeSpeed"  x="162" y="178" width="4" height="4" fill="black" />
<rect shape-rendering="optimizeSpeed"  x="174" y="178" width="4" height="4" fill="black" />
<rect shape-rendering="optimizeSpeed"  x="186" y="178" width="4" height="4" fill="black" />
<rect shape-rendering="optimizeSpeed"  x="10" y="182" width="4" height="4" fill="black" />
<rect shape-rendering="optimizeSpeed"  x="34" y="182" width="4" height="4" fill="black" />
<rect shape-rendering="optimizeSpeed"  x="42" y="182" width="4" height="4" fill="black" />
<rect shape-rendering="optimizeSpeed"  x="50" y="182" width="4" height="4" fill="black" />
<rect shape-rendering="optimizeSpeed"  x="54" y="182" width="4" height="4" fill="black" />
<rect shape-rendering="optimizeSpeed"  x="62" y="182" width="4" height="4" fill="black" />
<rect shape-rendering="optimizeSpeed"  x="66" y="182" width="4" height="4" fill="black" />
<rect shape-rendering="optimizeSpeed"  x="70" y="182" width="4" height="4" fill="black" />
<rect shape-rendering="optimizeSpeed"  x="78" y="182" width="4" height="4" fill="black" />
<rect shape-rendering="optimizeSpeed"  x="86" y="182" width="4" height="4" fill="black" />
<rect shape-rendering="optimizeSpeed"  x="90" y="182" width="4" height="4" fill="black" />
<rect shape-rendering="optimizeSpeed"  x="94" y="182" width="4" height="4" fill="black" />
<rect shape-rendering="optimizeSpeed"  x="102" y="182" width="4" height="4" fill="black" />
<rect shape-rendering="optimizeSpeed"  x="122" y="182" width="4" height="4" fill="black" />
<rect shape-rendering="optimizeSpeed"  x="130" y="182" width="4" height="4" fill="black" />
<rect shape-rendering="optimizeSpeed"  x="134" y="182" width="4" height="4" fill="black" />
<rect shape-rendering="optimizeSpeed"  x="138" y="182" width="4" height="4" fill="black" />
<rect shape-rendering="optimizeSpeed"  x="146" y="182" width="4" height="4" fill="black" />
<rect shape-rendering="optimizeSpeed"  x="158" y="182" width="4" height="4" fill="black" />
<rect shape-rendering="optimizeSpeed"  x="170" y="182" width="4" height="4" fill="black" />
<rect shape-rendering="optimizeSpeed"  x="178" y="182" width="4" height="4" fill="black" />
<rect shape-rendering="optimizeSpeed"  x="10" y="186" width="4" height="4" fill="black" />
<rect shape-rendering="optimizeSpeed"  x="14" y="186" width="4" height="4" fill="black" />
<rect shape-rendering="optimizeSpeed"  x="18" y="186" width="4" height="4" fill="black" />
<rect shape-rendering="optimizeSpeed"  x="22" y="186" width="4" height="4" fill="black" />
<rect shape-rendering="optimizeSpeed"  x="26" y="186" width="4" height="4" fill="black" />
<rect shape-rendering="optimizeSpeed"  x="30" y="186" width="4" height="4" fill="black" />
<rect shape-rendering="optimizeSpeed"  x="34" y="186" width="4" height="4" fill="black" />
<rect shape-rendering="optimizeSpeed"  x="42" y="186" width="4" height="4" fill="black" />
<rect shape-rendering="optimizeSpeed"  x="50" y="186" width="4" height="4" fill="black" />
<rect shape-rendering="optimizeSpeed"  x="70" y="186" width="4" height="4" fill="black" />
<rect shape-rendering="optimizeSpeed"  x="78" y="186" width="4" height="4" fill="black" />
<rect shape-rendering="optimizeSpeed"  x="82" y="186" width="4" height="4" fill="black" />
<rect shape-rendering="optimizeSpeed"  x="86" y="186" width="4" height="4" fill="black" />
<rect shape-rendering="optimizeSpeed"  x="98" y="186" width="4" height="4" fill="black" />
<rect shape-rendering="optimizeSpeed"  x="106" y="186" width="4" height="4" fill="black" />
<rect shape-rendering="optimizeSpeed"  x="110" y="186" width="4" height="4" fill="black" />
<rect shape-rendering="optimizeSpeed"  x="114" y="186" width="4" height="4" fill="black" />
<rect shape-rendering="optimizeSpeed"  x="118" y="186" width="4" height="4" fill="black" />
<rect shape-rendering="optimizeSpeed"  x="126" y="186" width="4" height="4" fill="black" />
<rect shape-rendering="optimizeSpeed"  x="130" y="186" width="4" height="4" fill="black" />
<rect shape-rendering="optimizeSpeed"  x="162" y="186" width="4" height="4" fill="black" />
<rect shape-rendering="optimizeSpeed"  x="170" y="186" width="4" height="4" fill="black" />
<rect shape-rendering="optimizeSpeed"  x="182" y="186" width="4" height="4" fill="black" /></svg>