<?xml version="1.0" encoding="UTF-8"?>
<!--
Template derived pattern
===========================================
ID: 1.2.40.0.34.6.0.11.0.13
Name: Patientenverfügung
Description: 
-->
<pattern xmlns="http://purl.oclc.org/dsdl/schematron" id="template-1.2.40.0.34.6.0.11.0.13-2020-11-02T121020-closed">
    <title>Patientenverfügung</title>

   <!-- Checking undefined contents for template/element @isClosed="true". Match context that we did not already match -->
    <rule context="/*[not(@xsi:nil = 'true')][not(self::hl7:ClinicalDocument[hl7:templateId[@root = '1.2.40.0.34.6.0.11.0.1'] and hl7:templateId[@root = '1.2.40.0.34.7.26'] and hl7:templateId[@root = '1.2.40.0.34.6.0.11.0.13']])]" id="d141e4-true-d6368e0">
        <assert role="error" see="http://art-decor.org/art-decor/decor-templates--at-pv-?id=1.2.40.0.34.6.0.11.0.13" test="not(.)">(atpv_document_Patientenverfuegung)/d141e4-true-d6368e0: '<value-of select="name(..)"/>' ist als geschlossen definiert und dieses Element '<name/>' ist nicht erlaubt oder nicht mit diesem Inhalt erlaubt. Dies kann templateId, code oder id betreffen. Erwartet:  hl7:ClinicalDocument[hl7:templateId[@root = '1.2.40.0.34.6.0.11.0.1'] and hl7:templateId[@root = '1.2.40.0.34.7.26'] and hl7:templateId[@root = '1.2.40.0.34.6.0.11.0.13']] (rule-reference: d141e4-true-d6368e0)</assert>
    </rule>

   <!-- Checking undefined contents for template/element @isClosed="true". Match context that we did not already match -->
    <rule context="/hl7:ClinicalDocument[hl7:templateId[@root = '1.2.40.0.34.6.0.11.0.1'] and hl7:templateId[@root = '1.2.40.0.34.7.26'] and hl7:templateId[@root = '1.2.40.0.34.6.0.11.0.13']]/*[not(@xsi:nil = 'true')][not(self::hl7:realmCode[@code = 'AT'] | self::hl7:typeId[@root = '2.16.840.1.113883.1.3'][@extension = 'POCD_HD000040'] | self::hl7:templateId[@root = '1.2.40.0.34.6.0.11.0.1'] | self::hl7:templateId[@root = '1.2.40.0.34.7.26'] | self::hl7:templateId[@root = '1.2.40.0.34.6.0.11.0.13'] | self::hl7:id[not(@nullFlavor)] | self::hl7:code[(@code = '42348-3' and @codeSystem = '2.16.840.1.113883.6.1')] | self::hl7:title[not(@nullFlavor)] | self::hl7:statusCode | self::hl7at:terminologyDate | self::hl7at:formatCode[@code = 'urn:hl7-at:patv:2020'] | self::hl7at:practiceSettingCode[(@code = 'F063' and @codeSystem = '1.2.40.0.34.5.12')] | self::hl7:effectiveTime | self::hl7:confidentialityCode | self::hl7:languageCode | self::hl7:setId[not(@nullFlavor)] | self::hl7:versionNumber[not(@nullFlavor)] | self::hl7:recordTarget[hl7:patientRole] | self::hl7:author[hl7:assignedAuthor] | self::hl7:dataEnterer | self::hl7:custodian[hl7:assignedCustodian] | self::hl7:informationRecipient | self::hl7:legalAuthenticator[hl7:signatureCode[@code = 'S']] | self::hl7:participant | self::hl7:inFulfillmentOf | self::hl7:documentationOf | self::hl7:documentationOf[hl7:serviceEvent[hl7:code[(@code = '398295005' and @codeSystem = '2.16.840.1.113883.6.96')]]] | self::hl7:relatedDocument | self::hl7:authorization | self::hl7:componentOf | self::hl7:component[not(@nullFlavor)][hl7:nonXMLBody])]" id="d141e12-true-d6802e0">
        <assert role="error" see="http://art-decor.org/art-decor/decor-templates--at-pv-?id=1.2.40.0.34.6.0.11.0.13" test="not(.)">(atpv_document_Patientenverfuegung)/d141e12-true-d6802e0: '<value-of select="name(..)"/>' ist als geschlossen definiert und dieses Element '<name/>' ist nicht erlaubt oder nicht mit diesem Inhalt erlaubt. Dies kann templateId, code oder id betreffen. Erwartet:  hl7:realmCode[@code = 'AT'] | hl7:typeId[@root = '2.16.840.1.113883.1.3'][@extension = 'POCD_HD000040'] | hl7:templateId[@root = '1.2.40.0.34.6.0.11.0.1'] | hl7:templateId[@root = '1.2.40.0.34.7.26'] | hl7:templateId[@root = '1.2.40.0.34.6.0.11.0.13'] | hl7:id[not(@nullFlavor)] | hl7:code[(@code = '42348-3' and @codeSystem = '2.16.840.1.113883.6.1')] | hl7:title[not(@nullFlavor)] | hl7:statusCode | hl7at:terminologyDate | hl7at:formatCode[@code = 'urn:hl7-at:patv:2020'] | hl7at:practiceSettingCode[(@code = 'F063' and @codeSystem = '1.2.40.0.34.5.12')] | hl7:effectiveTime | hl7:confidentialityCode | hl7:languageCode | hl7:setId[not(@nullFlavor)] | hl7:versionNumber[not(@nullFlavor)] | hl7:recordTarget[hl7:patientRole] | hl7:author[hl7:assignedAuthor] | hl7:dataEnterer | hl7:custodian[hl7:assignedCustodian] | hl7:informationRecipient | hl7:legalAuthenticator[hl7:signatureCode[@code = 'S']] | hl7:participant | hl7:inFulfillmentOf | hl7:documentationOf | hl7:documentationOf[hl7:serviceEvent[hl7:code[(@code = '398295005' and @codeSystem = '2.16.840.1.113883.6.96')]]] | hl7:relatedDocument | hl7:authorization | hl7:componentOf | hl7:component[not(@nullFlavor)][hl7:nonXMLBody] (rule-reference: d141e12-true-d6802e0)</assert>
    </rule>

   <!-- Checking undefined contents for template/element @isClosed="true". Match context that we did not already match -->
    <rule context="/hl7:ClinicalDocument[hl7:templateId[@root = '1.2.40.0.34.6.0.11.0.1'] and hl7:templateId[@root = '1.2.40.0.34.7.26'] and hl7:templateId[@root = '1.2.40.0.34.6.0.11.0.13']]/hl7:code[(@code = '42348-3' and @codeSystem = '2.16.840.1.113883.6.1')]/*[not(@xsi:nil = 'true')][not(self::hl7:translation[(@code = '42348-3' and @codeSystem = '2.16.840.1.113883.6.1')])]" id="d141e53-true-d6853e0">
        <assert role="error" see="http://art-decor.org/art-decor/decor-templates--at-pv-?id=1.2.40.0.34.6.0.11.0.13" test="not(.)">(atpv_document_Patientenverfuegung)/d141e53-true-d6853e0: '<value-of select="name(..)"/>' ist als geschlossen definiert und dieses Element '<name/>' ist nicht erlaubt oder nicht mit diesem Inhalt erlaubt. Dies kann templateId, code oder id betreffen. Erwartet:  hl7:translation[(@code = '42348-3' and @codeSystem = '2.16.840.1.113883.6.1')] (rule-reference: d141e53-true-d6853e0)</assert>
    </rule>

   <!-- Checking undefined contents for template/element @isClosed="true". Match context that we did not already match -->
    <rule context="/hl7:ClinicalDocument[hl7:templateId[@root = '1.2.40.0.34.6.0.11.0.1'] and hl7:templateId[@root = '1.2.40.0.34.7.26'] and hl7:templateId[@root = '1.2.40.0.34.6.0.11.0.13']]/hl7:recordTarget[hl7:patientRole]/*[not(@xsi:nil = 'true')][not(self::hl7:patientRole[not(@nullFlavor)][hl7:patient])]" id="d6912e149-true-d7088e0">
        <assert role="error" see="http://art-decor.org/art-decor/decor-templates--at-pv-?id=1.2.40.0.34.6.0.11.1.3" test="not(.)">(atcdabbr_header_RecordTarget)/d6912e149-true-d7088e0: '<value-of select="name(..)"/>' ist als geschlossen definiert und dieses Element '<name/>' ist nicht erlaubt oder nicht mit diesem Inhalt erlaubt. Dies kann templateId, code oder id betreffen. Erwartet:  hl7:patientRole[not(@nullFlavor)][hl7:patient] (rule-reference: d6912e149-true-d7088e0)</assert>
    </rule>

   <!-- Checking undefined contents for template/element @isClosed="true". Match context that we did not already match -->
    <rule context="/hl7:ClinicalDocument[hl7:templateId[@root = '1.2.40.0.34.6.0.11.0.1'] and hl7:templateId[@root = '1.2.40.0.34.7.26'] and hl7:templateId[@root = '1.2.40.0.34.6.0.11.0.13']]/hl7:recordTarget[hl7:patientRole]/hl7:patientRole[not(@nullFlavor)][hl7:patient]/*[not(@xsi:nil = 'true')][not(self::hl7:id | self::hl7:addr | self::hl7:telecom | self::hl7:patient[not(@nullFlavor)])]" id="d6912e154-true-d7281e0">
        <assert role="error" see="http://art-decor.org/art-decor/decor-templates--at-pv-?id=1.2.40.0.34.6.0.11.1.3" test="not(.)">(atcdabbr_header_RecordTarget)/d6912e154-true-d7281e0: '<value-of select="name(..)"/>' ist als geschlossen definiert und dieses Element '<name/>' ist nicht erlaubt oder nicht mit diesem Inhalt erlaubt. Dies kann templateId, code oder id betreffen. Erwartet:  hl7:id | hl7:addr | hl7:telecom | hl7:patient[not(@nullFlavor)] (rule-reference: d6912e154-true-d7281e0)</assert>
    </rule>

   <!-- Checking undefined contents for template/element @isClosed="true". Match context that we did not already match -->
    <rule context="/hl7:ClinicalDocument[hl7:templateId[@root = '1.2.40.0.34.6.0.11.0.1'] and hl7:templateId[@root = '1.2.40.0.34.7.26'] and hl7:templateId[@root = '1.2.40.0.34.6.0.11.0.13']]/hl7:recordTarget[hl7:patientRole]/hl7:patientRole[not(@nullFlavor)][hl7:patient]/hl7:addr/*[not(@xsi:nil = 'true')][not(self::hl7:streetAddressLine | self::hl7:streetName | self::hl7:houseNumber | self::hl7:postalCode[not(@nullFlavor)] | self::hl7:city[not(@nullFlavor)] | self::hl7:state | self::hl7:country[not(@nullFlavor)] | self::hl7:additionalLocator)]" id="d6912e272-true-d7336e0">
        <assert role="error" see="http://art-decor.org/art-decor/decor-templates--at-pv-?id=1.2.40.0.34.6.0.11.1.3" test="not(.)">(atcdabbr_header_RecordTarget)/d6912e272-true-d7336e0: '<value-of select="name(..)"/>' ist als geschlossen definiert und dieses Element '<name/>' ist nicht erlaubt oder nicht mit diesem Inhalt erlaubt. Dies kann templateId, code oder id betreffen. Erwartet:  hl7:streetAddressLine | hl7:streetName | hl7:houseNumber | hl7:postalCode[not(@nullFlavor)] | hl7:city[not(@nullFlavor)] | hl7:state | hl7:country[not(@nullFlavor)] | hl7:additionalLocator (rule-reference: d6912e272-true-d7336e0)</assert>
    </rule>

   <!-- Checking undefined contents for template/element @isClosed="true". Match context that we did not already match -->
    <rule context="/hl7:ClinicalDocument[hl7:templateId[@root = '1.2.40.0.34.6.0.11.0.1'] and hl7:templateId[@root = '1.2.40.0.34.7.26'] and hl7:templateId[@root = '1.2.40.0.34.6.0.11.0.13']]/hl7:recordTarget[hl7:patientRole]/hl7:patientRole[not(@nullFlavor)][hl7:patient]/hl7:patient[not(@nullFlavor)]/*[not(@xsi:nil = 'true')][not(self::hl7:name[not(@nullFlavor)] | self::hl7:administrativeGenderCode[not(@nullFlavor)] | self::hl7:administrativeGenderCode[@nullFlavor='UNK'] | self::hl7:birthTime | self::hl7:birthTime[@nullFlavor='UNK'] | self::sdtc:deceasedInd | self::sdtc:deceasedTime | self::hl7:maritalStatusCode[@codeSystem = '2.16.840.1.113883.5.2' or concat(@code, @codeSystem) = doc('include/voc-1.2.40.0.34.10.11-DYNAMIC.xml')//valueSet[1]/conceptList/concept/concat(@code, @codeSystem)] | self::hl7:religiousAffiliationCode[@codeSystem = '2.16.840.1.113883.2.16.1.4.1' or concat(@code, @codeSystem) = doc('include/voc-1.2.40.0.34.10.18-DYNAMIC.xml')//valueSet[1]/conceptList/concept/concat(@code, @codeSystem)] | self::hl7:raceCode | self::hl7:ethnicGroupCode | self::hl7:guardian | self::hl7:birthplace[hl7:place] | self::hl7:languageCommunication[hl7:languageCode[@code = doc('include/voc-1.2.40.0.34.10.173-DYNAMIC.xml')//valueSet[1]/conceptList/*/@code]])]" id="d6912e309-true-d7577e0">
        <assert role="error" see="http://art-decor.org/art-decor/decor-templates--at-pv-?id=1.2.40.0.34.6.0.11.1.3" test="not(.)">(atcdabbr_header_RecordTarget)/d6912e309-true-d7577e0: '<value-of select="name(..)"/>' ist als geschlossen definiert und dieses Element '<name/>' ist nicht erlaubt oder nicht mit diesem Inhalt erlaubt. Dies kann templateId, code oder id betreffen. Erwartet:  hl7:name[not(@nullFlavor)] | hl7:administrativeGenderCode[not(@nullFlavor)] | hl7:administrativeGenderCode[@nullFlavor='UNK'] | hl7:birthTime | hl7:birthTime[@nullFlavor='UNK'] | sdtc:deceasedInd | sdtc:deceasedTime | hl7:maritalStatusCode[@codeSystem = '2.16.840.1.113883.5.2' or concat(@code, @codeSystem) = doc('include/voc-1.2.40.0.34.10.11-DYNAMIC.xml')//valueSet[1]/conceptList/concept/concat(@code, @codeSystem)] | hl7:religiousAffiliationCode[@codeSystem = '2.16.840.1.113883.2.16.1.4.1' or concat(@code, @codeSystem) = doc('include/voc-1.2.40.0.34.10.18-DYNAMIC.xml')//valueSet[1]/conceptList/concept/concat(@code, @codeSystem)] | hl7:raceCode | hl7:ethnicGroupCode | hl7:guardian | hl7:birthplace[hl7:place] | hl7:languageCommunication[hl7:languageCode[@code = doc('include/voc-1.2.40.0.34.10.173-DYNAMIC.xml')//valueSet[1]/conceptList/*/@code]] (rule-reference: d6912e309-true-d7577e0)</assert>
    </rule>

   <!-- Checking undefined contents for template/element @isClosed="true". Match context that we did not already match -->
    <rule context="/hl7:ClinicalDocument[hl7:templateId[@root = '1.2.40.0.34.6.0.11.0.1'] and hl7:templateId[@root = '1.2.40.0.34.7.26'] and hl7:templateId[@root = '1.2.40.0.34.6.0.11.0.13']]/hl7:recordTarget[hl7:patientRole]/hl7:patientRole[not(@nullFlavor)][hl7:patient]/hl7:patient[not(@nullFlavor)]/hl7:name[not(@nullFlavor)]/*[not(@xsi:nil = 'true')][not(self::hl7:prefix | self::hl7:family[not(@nullFlavor)] | self::hl7:given[not(@nullFlavor)] | self::hl7:suffix)]" id="d7581e44-true-d7607e0">
        <assert role="error" see="http://art-decor.org/art-decor/decor-templates--at-pv-?id=1.2.40.0.34.6.0.11.9.11" test="not(.)">(atcdabbr_other_PersonNameCompilationG2M)/d7581e44-true-d7607e0: '<value-of select="name(..)"/>' ist als geschlossen definiert und dieses Element '<name/>' ist nicht erlaubt oder nicht mit diesem Inhalt erlaubt. Dies kann templateId, code oder id betreffen. Erwartet:  hl7:prefix | hl7:family[not(@nullFlavor)] | hl7:given[not(@nullFlavor)] | hl7:suffix (rule-reference: d7581e44-true-d7607e0)</assert>
    </rule>

   <!-- Checking undefined contents for template/element @isClosed="true". Match context that we did not already match -->
    <rule context="/hl7:ClinicalDocument[hl7:templateId[@root = '1.2.40.0.34.6.0.11.0.1'] and hl7:templateId[@root = '1.2.40.0.34.7.26'] and hl7:templateId[@root = '1.2.40.0.34.6.0.11.0.13']]/hl7:recordTarget[hl7:patientRole]/hl7:patientRole[not(@nullFlavor)][hl7:patient]/hl7:patient[not(@nullFlavor)]/hl7:administrativeGenderCode[not(@nullFlavor)]/*[not(@xsi:nil = 'true')][not(self::hl7:translation)]" id="d6912e345-true-d7634e0">
        <assert role="error" see="http://art-decor.org/art-decor/decor-templates--at-pv-?id=1.2.40.0.34.6.0.11.1.3" test="not(.)">(atcdabbr_header_RecordTarget)/d6912e345-true-d7634e0: '<value-of select="name(..)"/>' ist als geschlossen definiert und dieses Element '<name/>' ist nicht erlaubt oder nicht mit diesem Inhalt erlaubt. Dies kann templateId, code oder id betreffen. Erwartet:  hl7:translation (rule-reference: d6912e345-true-d7634e0)</assert>
    </rule>

   <!-- Checking undefined contents for template/element @isClosed="true". Match context that we did not already match -->
    <rule context="/hl7:ClinicalDocument[hl7:templateId[@root = '1.2.40.0.34.6.0.11.0.1'] and hl7:templateId[@root = '1.2.40.0.34.7.26'] and hl7:templateId[@root = '1.2.40.0.34.6.0.11.0.13']]/hl7:recordTarget[hl7:patientRole]/hl7:patientRole[not(@nullFlavor)][hl7:patient]/hl7:patient[not(@nullFlavor)]/hl7:guardian/*[not(@xsi:nil = 'true')][not(self::hl7:addr | self::hl7:telecom | self::hl7:guardianPerson | self::hl7:guardianPerson | self::hl7:guardianOrganization)]" id="d6912e412-true-d7751e0">
        <assert role="error" see="http://art-decor.org/art-decor/decor-templates--at-pv-?id=1.2.40.0.34.6.0.11.1.3" test="not(.)">(atcdabbr_header_RecordTarget)/d6912e412-true-d7751e0: '<value-of select="name(..)"/>' ist als geschlossen definiert und dieses Element '<name/>' ist nicht erlaubt oder nicht mit diesem Inhalt erlaubt. Dies kann templateId, code oder id betreffen. Erwartet:  hl7:addr | hl7:telecom | hl7:guardianPerson | hl7:guardianPerson | hl7:guardianOrganization (rule-reference: d6912e412-true-d7751e0)</assert>
    </rule>

   <!-- Checking undefined contents for template/element @isClosed="true". Match context that we did not already match -->
    <rule context="/hl7:ClinicalDocument[hl7:templateId[@root = '1.2.40.0.34.6.0.11.0.1'] and hl7:templateId[@root = '1.2.40.0.34.7.26'] and hl7:templateId[@root = '1.2.40.0.34.6.0.11.0.13']]/hl7:recordTarget[hl7:patientRole]/hl7:patientRole[not(@nullFlavor)][hl7:patient]/hl7:patient[not(@nullFlavor)]/hl7:guardian/hl7:addr/*[not(@xsi:nil = 'true')][not(self::hl7:streetAddressLine | self::hl7:streetName | self::hl7:houseNumber | self::hl7:postalCode[not(@nullFlavor)] | self::hl7:city[not(@nullFlavor)] | self::hl7:state | self::hl7:country[not(@nullFlavor)] | self::hl7:additionalLocator)]" id="d6912e441-true-d7802e0">
        <assert role="error" see="http://art-decor.org/art-decor/decor-templates--at-pv-?id=1.2.40.0.34.6.0.11.1.3" test="not(.)">(atcdabbr_header_RecordTarget)/d6912e441-true-d7802e0: '<value-of select="name(..)"/>' ist als geschlossen definiert und dieses Element '<name/>' ist nicht erlaubt oder nicht mit diesem Inhalt erlaubt. Dies kann templateId, code oder id betreffen. Erwartet:  hl7:streetAddressLine | hl7:streetName | hl7:houseNumber | hl7:postalCode[not(@nullFlavor)] | hl7:city[not(@nullFlavor)] | hl7:state | hl7:country[not(@nullFlavor)] | hl7:additionalLocator (rule-reference: d6912e441-true-d7802e0)</assert>
    </rule>

   <!-- Checking undefined contents for template/element @isClosed="true". Match context that we did not already match -->
    <rule context="/hl7:ClinicalDocument[hl7:templateId[@root = '1.2.40.0.34.6.0.11.0.1'] and hl7:templateId[@root = '1.2.40.0.34.7.26'] and hl7:templateId[@root = '1.2.40.0.34.6.0.11.0.13']]/hl7:recordTarget[hl7:patientRole]/hl7:patientRole[not(@nullFlavor)][hl7:patient]/hl7:patient[not(@nullFlavor)]/hl7:guardian/hl7:guardianPerson/*[not(@xsi:nil = 'true')][not(self::hl7:name[not(@nullFlavor)])]" id="d6912e481-true-d7854e0">
        <assert role="error" see="http://art-decor.org/art-decor/decor-templates--at-pv-?id=1.2.40.0.34.6.0.11.1.3" test="not(.)">(atcdabbr_header_RecordTarget)/d6912e481-true-d7854e0: '<value-of select="name(..)"/>' ist als geschlossen definiert und dieses Element '<name/>' ist nicht erlaubt oder nicht mit diesem Inhalt erlaubt. Dies kann templateId, code oder id betreffen. Erwartet:  hl7:name[not(@nullFlavor)] (rule-reference: d6912e481-true-d7854e0)</assert>
    </rule>

   <!-- Checking undefined contents for template/element @isClosed="true". Match context that we did not already match -->
    <rule context="/hl7:ClinicalDocument[hl7:templateId[@root = '1.2.40.0.34.6.0.11.0.1'] and hl7:templateId[@root = '1.2.40.0.34.7.26'] and hl7:templateId[@root = '1.2.40.0.34.6.0.11.0.13']]/hl7:recordTarget[hl7:patientRole]/hl7:patientRole[not(@nullFlavor)][hl7:patient]/hl7:patient[not(@nullFlavor)]/hl7:guardian/hl7:guardianPerson/*[not(@xsi:nil = 'true')][not(self::hl7:name[not(@nullFlavor)])]" id="d6912e486-true-d7874e0">
        <assert role="error" see="http://art-decor.org/art-decor/decor-templates--at-pv-?id=1.2.40.0.34.6.0.11.1.3" test="not(.)">(atcdabbr_header_RecordTarget)/d6912e486-true-d7874e0: '<value-of select="name(..)"/>' ist als geschlossen definiert und dieses Element '<name/>' ist nicht erlaubt oder nicht mit diesem Inhalt erlaubt. Dies kann templateId, code oder id betreffen. Erwartet:  hl7:name[not(@nullFlavor)] (rule-reference: d6912e486-true-d7874e0)</assert>
    </rule>

   <!-- Checking undefined contents for template/element @isClosed="true". Match context that we did not already match -->
    <rule context="/hl7:ClinicalDocument[hl7:templateId[@root = '1.2.40.0.34.6.0.11.0.1'] and hl7:templateId[@root = '1.2.40.0.34.7.26'] and hl7:templateId[@root = '1.2.40.0.34.6.0.11.0.13']]/hl7:recordTarget[hl7:patientRole]/hl7:patientRole[not(@nullFlavor)][hl7:patient]/hl7:patient[not(@nullFlavor)]/hl7:guardian/hl7:guardianPerson/hl7:name[not(@nullFlavor)]/*[not(@xsi:nil = 'true')][not(self::hl7:prefix | self::hl7:family[not(@nullFlavor)] | self::hl7:given[not(@nullFlavor)] | self::hl7:suffix)]" id="d7863e7-true-d7902e0">
        <assert role="error" see="http://art-decor.org/art-decor/decor-templates--at-pv-?id=1.2.40.0.34.6.0.11.1.3" test="not(.)">(atcdabbr_header_RecordTarget)/d7863e7-true-d7902e0: '<value-of select="name(..)"/>' ist als geschlossen definiert und dieses Element '<name/>' ist nicht erlaubt oder nicht mit diesem Inhalt erlaubt. Dies kann templateId, code oder id betreffen. Erwartet:  hl7:prefix | hl7:family[not(@nullFlavor)] | hl7:given[not(@nullFlavor)] | hl7:suffix (rule-reference: d7863e7-true-d7902e0)</assert>
    </rule>

   <!-- Checking undefined contents for template/element @isClosed="true". Match context that we did not already match -->
    <rule context="/hl7:ClinicalDocument[hl7:templateId[@root = '1.2.40.0.34.6.0.11.0.1'] and hl7:templateId[@root = '1.2.40.0.34.7.26'] and hl7:templateId[@root = '1.2.40.0.34.6.0.11.0.13']]/hl7:recordTarget[hl7:patientRole]/hl7:patientRole[not(@nullFlavor)][hl7:patient]/hl7:patient[not(@nullFlavor)]/hl7:guardian/hl7:guardianOrganization/*[not(@xsi:nil = 'true')][not(self::hl7:name[not(@nullFlavor)])]" id="d6912e491-true-d7934e0">
        <assert role="error" see="http://art-decor.org/art-decor/decor-templates--at-pv-?id=1.2.40.0.34.6.0.11.1.3" test="not(.)">(atcdabbr_header_RecordTarget)/d6912e491-true-d7934e0: '<value-of select="name(..)"/>' ist als geschlossen definiert und dieses Element '<name/>' ist nicht erlaubt oder nicht mit diesem Inhalt erlaubt. Dies kann templateId, code oder id betreffen. Erwartet:  hl7:name[not(@nullFlavor)] (rule-reference: d6912e491-true-d7934e0)</assert>
    </rule>

   <!-- Checking undefined contents for template/element @isClosed="true". Match context that we did not already match -->
    <rule context="/hl7:ClinicalDocument[hl7:templateId[@root = '1.2.40.0.34.6.0.11.0.1'] and hl7:templateId[@root = '1.2.40.0.34.7.26'] and hl7:templateId[@root = '1.2.40.0.34.6.0.11.0.13']]/hl7:recordTarget[hl7:patientRole]/hl7:patientRole[not(@nullFlavor)][hl7:patient]/hl7:patient[not(@nullFlavor)]/hl7:birthplace[hl7:place]/*[not(@xsi:nil = 'true')][not(self::hl7:place[not(@nullFlavor)])]" id="d6912e495-true-d8017e0">
        <assert role="error" see="http://art-decor.org/art-decor/decor-templates--at-pv-?id=1.2.40.0.34.6.0.11.1.3" test="not(.)">(atcdabbr_header_RecordTarget)/d6912e495-true-d8017e0: '<value-of select="name(..)"/>' ist als geschlossen definiert und dieses Element '<name/>' ist nicht erlaubt oder nicht mit diesem Inhalt erlaubt. Dies kann templateId, code oder id betreffen. Erwartet:  hl7:place[not(@nullFlavor)] (rule-reference: d6912e495-true-d8017e0)</assert>
    </rule>

   <!-- Checking undefined contents for template/element @isClosed="true". Match context that we did not already match -->
    <rule context="/hl7:ClinicalDocument[hl7:templateId[@root = '1.2.40.0.34.6.0.11.0.1'] and hl7:templateId[@root = '1.2.40.0.34.7.26'] and hl7:templateId[@root = '1.2.40.0.34.6.0.11.0.13']]/hl7:recordTarget[hl7:patientRole]/hl7:patientRole[not(@nullFlavor)][hl7:patient]/hl7:patient[not(@nullFlavor)]/hl7:birthplace[hl7:place]/hl7:place[not(@nullFlavor)]/*[not(@xsi:nil = 'true')][not(self::hl7:addr | self::hl7:addr)]" id="d6912e499-true-d8073e0">
        <assert role="error" see="http://art-decor.org/art-decor/decor-templates--at-pv-?id=1.2.40.0.34.6.0.11.1.3" test="not(.)">(atcdabbr_header_RecordTarget)/d6912e499-true-d8073e0: '<value-of select="name(..)"/>' ist als geschlossen definiert und dieses Element '<name/>' ist nicht erlaubt oder nicht mit diesem Inhalt erlaubt. Dies kann templateId, code oder id betreffen. Erwartet:  hl7:addr | hl7:addr (rule-reference: d6912e499-true-d8073e0)</assert>
    </rule>

   <!-- Checking undefined contents for template/element @isClosed="true". Match context that we did not already match -->
    <rule context="/hl7:ClinicalDocument[hl7:templateId[@root = '1.2.40.0.34.6.0.11.0.1'] and hl7:templateId[@root = '1.2.40.0.34.7.26'] and hl7:templateId[@root = '1.2.40.0.34.6.0.11.0.13']]/hl7:recordTarget[hl7:patientRole]/hl7:patientRole[not(@nullFlavor)][hl7:patient]/hl7:patient[not(@nullFlavor)]/hl7:birthplace[hl7:place]/hl7:place[not(@nullFlavor)]/hl7:addr/*[not(@xsi:nil = 'true')][not(self::hl7:streetAddressLine | self::hl7:streetName | self::hl7:houseNumber | self::hl7:postalCode | self::hl7:city | self::hl7:state | self::hl7:country | self::hl7:additionalLocator)]" id="d6912e503-true-d8124e0">
        <assert role="error" see="http://art-decor.org/art-decor/decor-templates--at-pv-?id=1.2.40.0.34.6.0.11.1.3" test="not(.)">(atcdabbr_header_RecordTarget)/d6912e503-true-d8124e0: '<value-of select="name(..)"/>' ist als geschlossen definiert und dieses Element '<name/>' ist nicht erlaubt oder nicht mit diesem Inhalt erlaubt. Dies kann templateId, code oder id betreffen. Erwartet:  hl7:streetAddressLine | hl7:streetName | hl7:houseNumber | hl7:postalCode | hl7:city | hl7:state | hl7:country | hl7:additionalLocator (rule-reference: d6912e503-true-d8124e0)</assert>
    </rule>

   <!-- Checking undefined contents for template/element @isClosed="true". Match context that we did not already match -->
    <rule context="/hl7:ClinicalDocument[hl7:templateId[@root = '1.2.40.0.34.6.0.11.0.1'] and hl7:templateId[@root = '1.2.40.0.34.7.26'] and hl7:templateId[@root = '1.2.40.0.34.6.0.11.0.13']]/hl7:recordTarget[hl7:patientRole]/hl7:patientRole[not(@nullFlavor)][hl7:patient]/hl7:patient[not(@nullFlavor)]/hl7:birthplace[hl7:place]/hl7:place[not(@nullFlavor)]/hl7:addr/*[not(@xsi:nil = 'true')][not(self::hl7:streetAddressLine | self::hl7:streetName | self::hl7:houseNumber | self::hl7:postalCode[not(@nullFlavor)] | self::hl7:city[not(@nullFlavor)] | self::hl7:state | self::hl7:country[not(@nullFlavor)] | self::hl7:additionalLocator)]" id="d6912e507-true-d8207e0">
        <assert role="error" see="http://art-decor.org/art-decor/decor-templates--at-pv-?id=1.2.40.0.34.6.0.11.1.3" test="not(.)">(atcdabbr_header_RecordTarget)/d6912e507-true-d8207e0: '<value-of select="name(..)"/>' ist als geschlossen definiert und dieses Element '<name/>' ist nicht erlaubt oder nicht mit diesem Inhalt erlaubt. Dies kann templateId, code oder id betreffen. Erwartet:  hl7:streetAddressLine | hl7:streetName | hl7:houseNumber | hl7:postalCode[not(@nullFlavor)] | hl7:city[not(@nullFlavor)] | hl7:state | hl7:country[not(@nullFlavor)] | hl7:additionalLocator (rule-reference: d6912e507-true-d8207e0)</assert>
    </rule>

   <!-- Checking undefined contents for template/element @isClosed="true". Match context that we did not already match -->
    <rule context="/hl7:ClinicalDocument[hl7:templateId[@root = '1.2.40.0.34.6.0.11.0.1'] and hl7:templateId[@root = '1.2.40.0.34.7.26'] and hl7:templateId[@root = '1.2.40.0.34.6.0.11.0.13']]/hl7:recordTarget[hl7:patientRole]/hl7:patientRole[not(@nullFlavor)][hl7:patient]/hl7:patient[not(@nullFlavor)]/hl7:languageCommunication[hl7:languageCode[@code = doc('include/voc-1.2.40.0.34.10.173-DYNAMIC.xml')//valueSet[1]/conceptList/*/@code]]/*[not(@xsi:nil = 'true')][not(self::hl7:languageCode[@code = doc('include/voc-1.2.40.0.34.10.173-DYNAMIC.xml')//valueSet[1]/conceptList/*/@code] | self::hl7:modeCode[@codeSystem = '2.16.840.1.113883.5.60' or concat(@code, @codeSystem) = doc('include/voc-1.2.40.0.34.10.175-DYNAMIC.xml')//valueSet[1]/conceptList/concept/concat(@code, @codeSystem)] | self::hl7:proficiencyLevelCode[@codeSystem = '2.16.840.1.113883.5.61' or concat(@code, @codeSystem) = doc('include/voc-1.2.40.0.34.10.174-DYNAMIC.xml')//valueSet[1]/conceptList/concept/concat(@code, @codeSystem)] | self::hl7:preferenceInd)]" id="d6912e510-true-d8288e0">
        <assert role="error" see="http://art-decor.org/art-decor/decor-templates--at-pv-?id=1.2.40.0.34.6.0.11.1.3" test="not(.)">(atcdabbr_header_RecordTarget)/d6912e510-true-d8288e0: '<value-of select="name(..)"/>' ist als geschlossen definiert und dieses Element '<name/>' ist nicht erlaubt oder nicht mit diesem Inhalt erlaubt. Dies kann templateId, code oder id betreffen. Erwartet:  hl7:languageCode[@code = doc('include/voc-1.2.40.0.34.10.173-DYNAMIC.xml')//valueSet[1]/conceptList/*/@code] | hl7:modeCode[@codeSystem = '2.16.840.1.113883.5.60' or concat(@code, @codeSystem) = doc('include/voc-1.2.40.0.34.10.175-DYNAMIC.xml')//valueSet[1]/conceptList/concept/concat(@code, @codeSystem)] | hl7:proficiencyLevelCode[@codeSystem = '2.16.840.1.113883.5.61' or concat(@code, @codeSystem) = doc('include/voc-1.2.40.0.34.10.174-DYNAMIC.xml')//valueSet[1]/conceptList/concept/concat(@code, @codeSystem)] | hl7:preferenceInd (rule-reference: d6912e510-true-d8288e0)</assert>
    </rule>

   <!-- Checking undefined contents for template/element @isClosed="true". Match context that we did not already match -->
    <rule context="/hl7:ClinicalDocument[hl7:templateId[@root = '1.2.40.0.34.6.0.11.0.1'] and hl7:templateId[@root = '1.2.40.0.34.7.26'] and hl7:templateId[@root = '1.2.40.0.34.6.0.11.0.13']]/hl7:author[hl7:assignedAuthor]/*[not(@xsi:nil = 'true')][not(self::hl7:functionCode | self::hl7:time[not(@nullFlavor)] | self::hl7:time[@nullFlavor='UNK'] | self::hl7:assignedAuthor[not(@nullFlavor)][hl7:representedOrganization])]" id="d8317e82-true-d8403e0">
        <assert role="error" see="http://art-decor.org/art-decor/decor-templates--at-pv-?id=1.2.40.0.34.6.0.11.1.2" test="not(.)">(atcdabbr_header_Author)/d8317e82-true-d8403e0: '<value-of select="name(..)"/>' ist als geschlossen definiert und dieses Element '<name/>' ist nicht erlaubt oder nicht mit diesem Inhalt erlaubt. Dies kann templateId, code oder id betreffen. Erwartet:  hl7:functionCode | hl7:time[not(@nullFlavor)] | hl7:time[@nullFlavor='UNK'] | hl7:assignedAuthor[not(@nullFlavor)][hl7:representedOrganization] (rule-reference: d8317e82-true-d8403e0)</assert>
    </rule>

   <!-- Checking undefined contents for template/element @isClosed="true". Match context that we did not already match -->
    <rule context="/hl7:ClinicalDocument[hl7:templateId[@root = '1.2.40.0.34.6.0.11.0.1'] and hl7:templateId[@root = '1.2.40.0.34.7.26'] and hl7:templateId[@root = '1.2.40.0.34.6.0.11.0.13']]/hl7:author[hl7:assignedAuthor]/hl7:assignedAuthor[not(@nullFlavor)][hl7:representedOrganization]/*[not(@xsi:nil = 'true')][not(self::hl7:id[not(@nullFlavor)] | self::hl7:id[@nullFlavor='NI'] | self::hl7:id[@nullFlavor='UNK'] | self::hl7:code[concat(@code, @codeSystem) = doc('include/voc-1.2.40.0.34.10.6-DYNAMIC.xml')//valueSet[1]/conceptList/concept/concat(@code, @codeSystem)] | self::hl7:telecom[not(@nullFlavor)] | self::hl7:assignedPerson | self::hl7:assignedAuthoringDevice | self::hl7:representedOrganization[not(@nullFlavor)])]" id="d8317e105-true-d8505e0">
        <assert role="error" see="http://art-decor.org/art-decor/decor-templates--at-pv-?id=1.2.40.0.34.6.0.11.1.2" test="not(.)">(atcdabbr_header_Author)/d8317e105-true-d8505e0: '<value-of select="name(..)"/>' ist als geschlossen definiert und dieses Element '<name/>' ist nicht erlaubt oder nicht mit diesem Inhalt erlaubt. Dies kann templateId, code oder id betreffen. Erwartet:  hl7:id[not(@nullFlavor)] | hl7:id[@nullFlavor='NI'] | hl7:id[@nullFlavor='UNK'] | hl7:code[concat(@code, @codeSystem) = doc('include/voc-1.2.40.0.34.10.6-DYNAMIC.xml')//valueSet[1]/conceptList/concept/concat(@code, @codeSystem)] | hl7:telecom[not(@nullFlavor)] | hl7:assignedPerson | hl7:assignedAuthoringDevice | hl7:representedOrganization[not(@nullFlavor)] (rule-reference: d8317e105-true-d8505e0)</assert>
    </rule>

   <!-- Checking undefined contents for template/element @isClosed="true". Match context that we did not already match -->
    <rule context="/hl7:ClinicalDocument[hl7:templateId[@root = '1.2.40.0.34.6.0.11.0.1'] and hl7:templateId[@root = '1.2.40.0.34.7.26'] and hl7:templateId[@root = '1.2.40.0.34.6.0.11.0.13']]/hl7:author[hl7:assignedAuthor]/hl7:assignedAuthor[not(@nullFlavor)][hl7:representedOrganization]/hl7:assignedPerson/*[not(@xsi:nil = 'true')][not(self::hl7:name[not(@nullFlavor)])]" id="d8317e164-true-d8536e0">
        <assert role="error" see="http://art-decor.org/art-decor/decor-templates--at-pv-?id=1.2.40.0.34.6.0.11.1.2" test="not(.)">(atcdabbr_header_Author)/d8317e164-true-d8536e0: '<value-of select="name(..)"/>' ist als geschlossen definiert und dieses Element '<name/>' ist nicht erlaubt oder nicht mit diesem Inhalt erlaubt. Dies kann templateId, code oder id betreffen. Erwartet:  hl7:name[not(@nullFlavor)] (rule-reference: d8317e164-true-d8536e0)</assert>
    </rule>

   <!-- Checking undefined contents for template/element @isClosed="true". Match context that we did not already match -->
    <rule context="/hl7:ClinicalDocument[hl7:templateId[@root = '1.2.40.0.34.6.0.11.0.1'] and hl7:templateId[@root = '1.2.40.0.34.7.26'] and hl7:templateId[@root = '1.2.40.0.34.6.0.11.0.13']]/hl7:author[hl7:assignedAuthor]/hl7:assignedAuthor[not(@nullFlavor)][hl7:representedOrganization]/hl7:assignedPerson/hl7:name[not(@nullFlavor)]/*[not(@xsi:nil = 'true')][not(self::hl7:prefix | self::hl7:family[not(@nullFlavor)] | self::hl7:given[not(@nullFlavor)] | self::hl7:suffix)]" id="d8525e8-true-d8564e0">
        <assert role="error" see="http://art-decor.org/art-decor/decor-templates--at-pv-?id=1.2.40.0.34.6.0.11.1.2" test="not(.)">(atcdabbr_header_Author)/d8525e8-true-d8564e0: '<value-of select="name(..)"/>' ist als geschlossen definiert und dieses Element '<name/>' ist nicht erlaubt oder nicht mit diesem Inhalt erlaubt. Dies kann templateId, code oder id betreffen. Erwartet:  hl7:prefix | hl7:family[not(@nullFlavor)] | hl7:given[not(@nullFlavor)] | hl7:suffix (rule-reference: d8525e8-true-d8564e0)</assert>
    </rule>

   <!-- Checking undefined contents for template/element @isClosed="true". Match context that we did not already match -->
    <rule context="/hl7:ClinicalDocument[hl7:templateId[@root = '1.2.40.0.34.6.0.11.0.1'] and hl7:templateId[@root = '1.2.40.0.34.7.26'] and hl7:templateId[@root = '1.2.40.0.34.6.0.11.0.13']]/hl7:author[hl7:assignedAuthor]/hl7:assignedAuthor[not(@nullFlavor)][hl7:representedOrganization]/hl7:assignedAuthoringDevice/*[not(@xsi:nil = 'true')][not(self::hl7:manufacturerModelName[not(@nullFlavor)] | self::hl7:softwareName[not(@nullFlavor)])]" id="d8317e170-true-d8601e0">
        <assert role="error" see="http://art-decor.org/art-decor/decor-templates--at-pv-?id=1.2.40.0.34.6.0.11.1.2" test="not(.)">(atcdabbr_header_Author)/d8317e170-true-d8601e0: '<value-of select="name(..)"/>' ist als geschlossen definiert und dieses Element '<name/>' ist nicht erlaubt oder nicht mit diesem Inhalt erlaubt. Dies kann templateId, code oder id betreffen. Erwartet:  hl7:manufacturerModelName[not(@nullFlavor)] | hl7:softwareName[not(@nullFlavor)] (rule-reference: d8317e170-true-d8601e0)</assert>
    </rule>

   <!-- Checking undefined contents for template/element @isClosed="true". Match context that we did not already match -->
    <rule context="/hl7:ClinicalDocument[hl7:templateId[@root = '1.2.40.0.34.6.0.11.0.1'] and hl7:templateId[@root = '1.2.40.0.34.7.26'] and hl7:templateId[@root = '1.2.40.0.34.6.0.11.0.13']]/hl7:author[hl7:assignedAuthor]/hl7:assignedAuthor[not(@nullFlavor)][hl7:representedOrganization]/hl7:representedOrganization[not(@nullFlavor)]/*[not(@xsi:nil = 'true')][not(self::hl7:id[not(@nullFlavor)] | self::hl7:name[not(@nullFlavor)] | self::hl7:telecom[not(@nullFlavor)] | self::hl7:addr[not(@nullFlavor)])]" id="d8317e173-true-d8643e0">
        <assert role="error" see="http://art-decor.org/art-decor/decor-templates--at-pv-?id=1.2.40.0.34.6.0.11.1.2" test="not(.)">(atcdabbr_header_Author)/d8317e173-true-d8643e0: '<value-of select="name(..)"/>' ist als geschlossen definiert und dieses Element '<name/>' ist nicht erlaubt oder nicht mit diesem Inhalt erlaubt. Dies kann templateId, code oder id betreffen. Erwartet:  hl7:id[not(@nullFlavor)] | hl7:name[not(@nullFlavor)] | hl7:telecom[not(@nullFlavor)] | hl7:addr[not(@nullFlavor)] (rule-reference: d8317e173-true-d8643e0)</assert>
    </rule>

   <!-- Checking undefined contents for template/element @isClosed="true". Match context that we did not already match -->
    <rule context="/hl7:ClinicalDocument[hl7:templateId[@root = '1.2.40.0.34.6.0.11.0.1'] and hl7:templateId[@root = '1.2.40.0.34.7.26'] and hl7:templateId[@root = '1.2.40.0.34.6.0.11.0.13']]/hl7:author[hl7:assignedAuthor]/hl7:assignedAuthor[not(@nullFlavor)][hl7:representedOrganization]/hl7:representedOrganization[not(@nullFlavor)]/hl7:addr[not(@nullFlavor)]/*[not(@xsi:nil = 'true')][not(self::hl7:streetAddressLine | self::hl7:streetName | self::hl7:houseNumber | self::hl7:postalCode[not(@nullFlavor)] | self::hl7:city[not(@nullFlavor)] | self::hl7:state | self::hl7:country[not(@nullFlavor)] | self::hl7:additionalLocator)]" id="d8614e75-true-d8702e0">
        <assert role="error" see="http://art-decor.org/art-decor/decor-templates--at-pv-?id=1.2.40.0.34.6.0.11.1.2" test="not(.)">(atcdabbr_header_Author)/d8614e75-true-d8702e0: '<value-of select="name(..)"/>' ist als geschlossen definiert und dieses Element '<name/>' ist nicht erlaubt oder nicht mit diesem Inhalt erlaubt. Dies kann templateId, code oder id betreffen. Erwartet:  hl7:streetAddressLine | hl7:streetName | hl7:houseNumber | hl7:postalCode[not(@nullFlavor)] | hl7:city[not(@nullFlavor)] | hl7:state | hl7:country[not(@nullFlavor)] | hl7:additionalLocator (rule-reference: d8614e75-true-d8702e0)</assert>
    </rule>

   <!-- Checking undefined contents for template/element @isClosed="true". Match context that we did not already match -->
    <rule context="/hl7:ClinicalDocument[hl7:templateId[@root = '1.2.40.0.34.6.0.11.0.1'] and hl7:templateId[@root = '1.2.40.0.34.7.26'] and hl7:templateId[@root = '1.2.40.0.34.6.0.11.0.13']]/hl7:custodian[hl7:assignedCustodian]/*[not(@xsi:nil = 'true')][not(self::hl7:assignedCustodian[not(@nullFlavor)][hl7:representedCustodianOrganization])]" id="d8742e23-true-d8786e0">
        <assert role="error" see="http://art-decor.org/art-decor/decor-templates--at-pv-?id=1.2.40.0.34.6.0.11.1.4" test="not(.)">(atcdabbr_header_Custodian)/d8742e23-true-d8786e0: '<value-of select="name(..)"/>' ist als geschlossen definiert und dieses Element '<name/>' ist nicht erlaubt oder nicht mit diesem Inhalt erlaubt. Dies kann templateId, code oder id betreffen. Erwartet:  hl7:assignedCustodian[not(@nullFlavor)][hl7:representedCustodianOrganization] (rule-reference: d8742e23-true-d8786e0)</assert>
    </rule>

   <!-- Checking undefined contents for template/element @isClosed="true". Match context that we did not already match -->
    <rule context="/hl7:ClinicalDocument[hl7:templateId[@root = '1.2.40.0.34.6.0.11.0.1'] and hl7:templateId[@root = '1.2.40.0.34.7.26'] and hl7:templateId[@root = '1.2.40.0.34.6.0.11.0.13']]/hl7:custodian[hl7:assignedCustodian]/hl7:assignedCustodian[not(@nullFlavor)][hl7:representedCustodianOrganization]/*[not(@xsi:nil = 'true')][not(self::hl7:representedCustodianOrganization[not(@nullFlavor)])]" id="d8742e27-true-d8832e0">
        <assert role="error" see="http://art-decor.org/art-decor/decor-templates--at-pv-?id=1.2.40.0.34.6.0.11.1.4" test="not(.)">(atcdabbr_header_Custodian)/d8742e27-true-d8832e0: '<value-of select="name(..)"/>' ist als geschlossen definiert und dieses Element '<name/>' ist nicht erlaubt oder nicht mit diesem Inhalt erlaubt. Dies kann templateId, code oder id betreffen. Erwartet:  hl7:representedCustodianOrganization[not(@nullFlavor)] (rule-reference: d8742e27-true-d8832e0)</assert>
    </rule>

   <!-- Checking undefined contents for template/element @isClosed="true". Match context that we did not already match -->
    <rule context="/hl7:ClinicalDocument[hl7:templateId[@root = '1.2.40.0.34.6.0.11.0.1'] and hl7:templateId[@root = '1.2.40.0.34.7.26'] and hl7:templateId[@root = '1.2.40.0.34.6.0.11.0.13']]/hl7:custodian[hl7:assignedCustodian]/hl7:assignedCustodian[not(@nullFlavor)][hl7:representedCustodianOrganization]/hl7:representedCustodianOrganization[not(@nullFlavor)]/*[not(@xsi:nil = 'true')][not(self::hl7:id[not(@nullFlavor)] | self::hl7:name[not(@nullFlavor)] | self::hl7:telecom[not(@nullFlavor)] | self::hl7:addr[not(@nullFlavor)])]" id="d8742e29-true-d8889e0">
        <assert role="error" see="http://art-decor.org/art-decor/decor-templates--at-pv-?id=1.2.40.0.34.6.0.11.1.4" test="not(.)">(atcdabbr_header_Custodian)/d8742e29-true-d8889e0: '<value-of select="name(..)"/>' ist als geschlossen definiert und dieses Element '<name/>' ist nicht erlaubt oder nicht mit diesem Inhalt erlaubt. Dies kann templateId, code oder id betreffen. Erwartet:  hl7:id[not(@nullFlavor)] | hl7:name[not(@nullFlavor)] | hl7:telecom[not(@nullFlavor)] | hl7:addr[not(@nullFlavor)] (rule-reference: d8742e29-true-d8889e0)</assert>
    </rule>

   <!-- Checking undefined contents for template/element @isClosed="true". Match context that we did not already match -->
    <rule context="/hl7:ClinicalDocument[hl7:templateId[@root = '1.2.40.0.34.6.0.11.0.1'] and hl7:templateId[@root = '1.2.40.0.34.7.26'] and hl7:templateId[@root = '1.2.40.0.34.6.0.11.0.13']]/hl7:custodian[hl7:assignedCustodian]/hl7:assignedCustodian[not(@nullFlavor)][hl7:representedCustodianOrganization]/hl7:representedCustodianOrganization[not(@nullFlavor)]/hl7:addr[not(@nullFlavor)]/*[not(@xsi:nil = 'true')][not(self::hl7:streetAddressLine | self::hl7:streetName | self::hl7:houseNumber | self::hl7:postalCode[not(@nullFlavor)] | self::hl7:city[not(@nullFlavor)] | self::hl7:state | self::hl7:country[not(@nullFlavor)] | self::hl7:additionalLocator)]" id="d8742e50-true-d8950e0">
        <assert role="error" see="http://art-decor.org/art-decor/decor-templates--at-pv-?id=1.2.40.0.34.6.0.11.1.4" test="not(.)">(atcdabbr_header_Custodian)/d8742e50-true-d8950e0: '<value-of select="name(..)"/>' ist als geschlossen definiert und dieses Element '<name/>' ist nicht erlaubt oder nicht mit diesem Inhalt erlaubt. Dies kann templateId, code oder id betreffen. Erwartet:  hl7:streetAddressLine | hl7:streetName | hl7:houseNumber | hl7:postalCode[not(@nullFlavor)] | hl7:city[not(@nullFlavor)] | hl7:state | hl7:country[not(@nullFlavor)] | hl7:additionalLocator (rule-reference: d8742e50-true-d8950e0)</assert>
    </rule>

   <!-- Checking undefined contents for template/element @isClosed="true". Match context that we did not already match -->
    <rule context="/hl7:ClinicalDocument[hl7:templateId[@root = '1.2.40.0.34.6.0.11.0.1'] and hl7:templateId[@root = '1.2.40.0.34.7.26'] and hl7:templateId[@root = '1.2.40.0.34.6.0.11.0.13']]/hl7:legalAuthenticator[hl7:signatureCode[@code = 'S']]/*[not(@xsi:nil = 'true')][not(self::hl7:time[not(@nullFlavor)] | self::hl7:time[@nullFlavor='UNK'] | self::hl7:signatureCode[@code = 'S'] | self::hl7:assignedEntity[not(@nullFlavor)][hl7:assignedPerson])]" id="d8990e50-true-d9126e0">
        <assert role="error" see="http://art-decor.org/art-decor/decor-templates--at-pv-?id=1.2.40.0.34.6.0.11.1.5" test="not(.)">(atcdabbr_header_LegalAuthenticator)/d8990e50-true-d9126e0: '<value-of select="name(..)"/>' ist als geschlossen definiert und dieses Element '<name/>' ist nicht erlaubt oder nicht mit diesem Inhalt erlaubt. Dies kann templateId, code oder id betreffen. Erwartet:  hl7:time[not(@nullFlavor)] | hl7:time[@nullFlavor='UNK'] | hl7:signatureCode[@code = 'S'] | hl7:assignedEntity[not(@nullFlavor)][hl7:assignedPerson] (rule-reference: d8990e50-true-d9126e0)</assert>
    </rule>

   <!-- Checking undefined contents for template/element @isClosed="true". Match context that we did not already match -->
    <rule context="/hl7:ClinicalDocument[hl7:templateId[@root = '1.2.40.0.34.6.0.11.0.1'] and hl7:templateId[@root = '1.2.40.0.34.7.26'] and hl7:templateId[@root = '1.2.40.0.34.6.0.11.0.13']]/hl7:legalAuthenticator[hl7:signatureCode[@code = 'S']]/hl7:assignedEntity[not(@nullFlavor)][hl7:assignedPerson]/*[not(@xsi:nil = 'true')][not(self::hl7:id[not(@nullFlavor)] | self::hl7:id[@nullFlavor='NI'] | self::hl7:id[@nullFlavor='UNK'] | self::hl7:addr[not(@nullFlavor)] | self::hl7:addr[@nullFlavor='UNK'] | self::hl7:telecom[not(@nullFlavor)] | self::hl7:assignedPerson[not(@nullFlavor)] | self::hl7:representedOrganization)]" id="d8990e68-true-d9228e0">
        <assert role="error" see="http://art-decor.org/art-decor/decor-templates--at-pv-?id=1.2.40.0.34.6.0.11.1.5" test="not(.)">(atcdabbr_header_LegalAuthenticator)/d8990e68-true-d9228e0: '<value-of select="name(..)"/>' ist als geschlossen definiert und dieses Element '<name/>' ist nicht erlaubt oder nicht mit diesem Inhalt erlaubt. Dies kann templateId, code oder id betreffen. Erwartet:  hl7:id[not(@nullFlavor)] | hl7:id[@nullFlavor='NI'] | hl7:id[@nullFlavor='UNK'] | hl7:addr[not(@nullFlavor)] | hl7:addr[@nullFlavor='UNK'] | hl7:telecom[not(@nullFlavor)] | hl7:assignedPerson[not(@nullFlavor)] | hl7:representedOrganization (rule-reference: d8990e68-true-d9228e0)</assert>
    </rule>

   <!-- Checking undefined contents for template/element @isClosed="true". Match context that we did not already match -->
    <rule context="/hl7:ClinicalDocument[hl7:templateId[@root = '1.2.40.0.34.6.0.11.0.1'] and hl7:templateId[@root = '1.2.40.0.34.7.26'] and hl7:templateId[@root = '1.2.40.0.34.6.0.11.0.13']]/hl7:legalAuthenticator[hl7:signatureCode[@code = 'S']]/hl7:assignedEntity[not(@nullFlavor)][hl7:assignedPerson]/hl7:addr[not(@nullFlavor)]/*[not(@xsi:nil = 'true')][not(self::hl7:streetAddressLine | self::hl7:streetName | self::hl7:houseNumber | self::hl7:postalCode[not(@nullFlavor)] | self::hl7:city[not(@nullFlavor)] | self::hl7:state | self::hl7:country[not(@nullFlavor)] | self::hl7:additionalLocator)]" id="d9140e31-true-d9283e0">
        <assert role="error" see="http://art-decor.org/art-decor/decor-templates--at-pv-?id=1.2.40.0.34.6.0.11.1.5" test="not(.)">(atcdabbr_header_LegalAuthenticator)/d9140e31-true-d9283e0: '<value-of select="name(..)"/>' ist als geschlossen definiert und dieses Element '<name/>' ist nicht erlaubt oder nicht mit diesem Inhalt erlaubt. Dies kann templateId, code oder id betreffen. Erwartet:  hl7:streetAddressLine | hl7:streetName | hl7:houseNumber | hl7:postalCode[not(@nullFlavor)] | hl7:city[not(@nullFlavor)] | hl7:state | hl7:country[not(@nullFlavor)] | hl7:additionalLocator (rule-reference: d9140e31-true-d9283e0)</assert>
    </rule>

   <!-- Checking undefined contents for template/element @isClosed="true". Match context that we did not already match -->
    <rule context="/hl7:ClinicalDocument[hl7:templateId[@root = '1.2.40.0.34.6.0.11.0.1'] and hl7:templateId[@root = '1.2.40.0.34.7.26'] and hl7:templateId[@root = '1.2.40.0.34.6.0.11.0.13']]/hl7:legalAuthenticator[hl7:signatureCode[@code = 'S']]/hl7:assignedEntity[not(@nullFlavor)][hl7:assignedPerson]/hl7:assignedPerson[not(@nullFlavor)]/*[not(@xsi:nil = 'true')][not(self::hl7:name[not(@nullFlavor)])]" id="d9140e57-true-d9335e0">
        <assert role="error" see="http://art-decor.org/art-decor/decor-templates--at-pv-?id=1.2.40.0.34.6.0.11.1.5" test="not(.)">(atcdabbr_header_LegalAuthenticator)/d9140e57-true-d9335e0: '<value-of select="name(..)"/>' ist als geschlossen definiert und dieses Element '<name/>' ist nicht erlaubt oder nicht mit diesem Inhalt erlaubt. Dies kann templateId, code oder id betreffen. Erwartet:  hl7:name[not(@nullFlavor)] (rule-reference: d9140e57-true-d9335e0)</assert>
    </rule>

   <!-- Checking undefined contents for template/element @isClosed="true". Match context that we did not already match -->
    <rule context="/hl7:ClinicalDocument[hl7:templateId[@root = '1.2.40.0.34.6.0.11.0.1'] and hl7:templateId[@root = '1.2.40.0.34.7.26'] and hl7:templateId[@root = '1.2.40.0.34.6.0.11.0.13']]/hl7:legalAuthenticator[hl7:signatureCode[@code = 'S']]/hl7:assignedEntity[not(@nullFlavor)][hl7:assignedPerson]/hl7:assignedPerson[not(@nullFlavor)]/hl7:name[not(@nullFlavor)]/*[not(@xsi:nil = 'true')][not(self::hl7:prefix | self::hl7:family[not(@nullFlavor)] | self::hl7:given[not(@nullFlavor)] | self::hl7:suffix)]" id="d9324e8-true-d9363e0">
        <assert role="error" see="http://art-decor.org/art-decor/decor-templates--at-pv-?id=1.2.40.0.34.6.0.11.1.5" test="not(.)">(atcdabbr_header_LegalAuthenticator)/d9324e8-true-d9363e0: '<value-of select="name(..)"/>' ist als geschlossen definiert und dieses Element '<name/>' ist nicht erlaubt oder nicht mit diesem Inhalt erlaubt. Dies kann templateId, code oder id betreffen. Erwartet:  hl7:prefix | hl7:family[not(@nullFlavor)] | hl7:given[not(@nullFlavor)] | hl7:suffix (rule-reference: d9324e8-true-d9363e0)</assert>
    </rule>

   <!-- Checking undefined contents for template/element @isClosed="true". Match context that we did not already match -->
    <rule context="/hl7:ClinicalDocument[hl7:templateId[@root = '1.2.40.0.34.6.0.11.0.1'] and hl7:templateId[@root = '1.2.40.0.34.7.26'] and hl7:templateId[@root = '1.2.40.0.34.6.0.11.0.13']]/hl7:legalAuthenticator[hl7:signatureCode[@code = 'S']]/hl7:assignedEntity[not(@nullFlavor)][hl7:assignedPerson]/hl7:representedOrganization/*[not(@xsi:nil = 'true')][not(self::hl7:id[not(@nullFlavor)] | self::hl7:name[not(@nullFlavor)] | self::hl7:telecom[not(@nullFlavor)] | self::hl7:addr[not(@nullFlavor)])]" id="d9140e63-true-d9409e0">
        <assert role="error" see="http://art-decor.org/art-decor/decor-templates--at-pv-?id=1.2.40.0.34.6.0.11.1.5" test="not(.)">(atcdabbr_header_LegalAuthenticator)/d9140e63-true-d9409e0: '<value-of select="name(..)"/>' ist als geschlossen definiert und dieses Element '<name/>' ist nicht erlaubt oder nicht mit diesem Inhalt erlaubt. Dies kann templateId, code oder id betreffen. Erwartet:  hl7:id[not(@nullFlavor)] | hl7:name[not(@nullFlavor)] | hl7:telecom[not(@nullFlavor)] | hl7:addr[not(@nullFlavor)] (rule-reference: d9140e63-true-d9409e0)</assert>
    </rule>

   <!-- Checking undefined contents for template/element @isClosed="true". Match context that we did not already match -->
    <rule context="/hl7:ClinicalDocument[hl7:templateId[@root = '1.2.40.0.34.6.0.11.0.1'] and hl7:templateId[@root = '1.2.40.0.34.7.26'] and hl7:templateId[@root = '1.2.40.0.34.6.0.11.0.13']]/hl7:legalAuthenticator[hl7:signatureCode[@code = 'S']]/hl7:assignedEntity[not(@nullFlavor)][hl7:assignedPerson]/hl7:representedOrganization/hl7:addr[not(@nullFlavor)]/*[not(@xsi:nil = 'true')][not(self::hl7:streetAddressLine | self::hl7:streetName | self::hl7:houseNumber | self::hl7:postalCode[not(@nullFlavor)] | self::hl7:city[not(@nullFlavor)] | self::hl7:state | self::hl7:country[not(@nullFlavor)] | self::hl7:additionalLocator)]" id="d9384e40-true-d9466e0">
        <assert role="error" see="http://art-decor.org/art-decor/decor-templates--at-pv-?id=1.2.40.0.34.6.0.11.1.5" test="not(.)">(atcdabbr_header_LegalAuthenticator)/d9384e40-true-d9466e0: '<value-of select="name(..)"/>' ist als geschlossen definiert und dieses Element '<name/>' ist nicht erlaubt oder nicht mit diesem Inhalt erlaubt. Dies kann templateId, code oder id betreffen. Erwartet:  hl7:streetAddressLine | hl7:streetName | hl7:houseNumber | hl7:postalCode[not(@nullFlavor)] | hl7:city[not(@nullFlavor)] | hl7:state | hl7:country[not(@nullFlavor)] | hl7:additionalLocator (rule-reference: d9384e40-true-d9466e0)</assert>
    </rule>

   <!-- Checking undefined contents for template/element @isClosed="true". Match context that we did not already match -->
    <rule context="/hl7:ClinicalDocument[hl7:templateId[@root = '1.2.40.0.34.6.0.11.0.1'] and hl7:templateId[@root = '1.2.40.0.34.7.26'] and hl7:templateId[@root = '1.2.40.0.34.6.0.11.0.13']]/hl7:documentationOf[hl7:serviceEvent[hl7:code[(@code = '398295005' and @codeSystem = '2.16.840.1.113883.6.96')]]]/*[not(@xsi:nil = 'true')][not(self::hl7:serviceEvent[hl7:code[(@code = '398295005' and @codeSystem = '2.16.840.1.113883.6.96')]])]" id="d141e473-true-d9526e0">
        <assert role="error" see="http://art-decor.org/art-decor/decor-templates--at-pv-?id=1.2.40.0.34.6.0.11.0.13" test="not(.)">(atpv_document_Patientenverfuegung)/d141e473-true-d9526e0: '<value-of select="name(..)"/>' ist als geschlossen definiert und dieses Element '<name/>' ist nicht erlaubt oder nicht mit diesem Inhalt erlaubt. Dies kann templateId, code oder id betreffen. Erwartet:  hl7:serviceEvent[hl7:code[(@code = '398295005' and @codeSystem = '2.16.840.1.113883.6.96')]] (rule-reference: d141e473-true-d9526e0)</assert>
    </rule>

   <!-- Checking undefined contents for template/element @isClosed="true". Match context that we did not already match -->
    <rule context="/hl7:ClinicalDocument[hl7:templateId[@root = '1.2.40.0.34.6.0.11.0.1'] and hl7:templateId[@root = '1.2.40.0.34.7.26'] and hl7:templateId[@root = '1.2.40.0.34.6.0.11.0.13']]/hl7:documentationOf[hl7:serviceEvent[hl7:code[(@code = '398295005' and @codeSystem = '2.16.840.1.113883.6.96')]]]/hl7:serviceEvent[hl7:code[(@code = '398295005' and @codeSystem = '2.16.840.1.113883.6.96')]]/*[not(@xsi:nil = 'true')][not(self::hl7:code[(@code = '398295005' and @codeSystem = '2.16.840.1.113883.6.96')] | self::hl7:effectiveTime[not(@nullFlavor)])]" id="d141e503-true-d9547e0">
        <assert role="error" see="http://art-decor.org/art-decor/decor-templates--at-pv-?id=1.2.40.0.34.6.0.11.0.13" test="not(.)">(atpv_document_Patientenverfuegung)/d141e503-true-d9547e0: '<value-of select="name(..)"/>' ist als geschlossen definiert und dieses Element '<name/>' ist nicht erlaubt oder nicht mit diesem Inhalt erlaubt. Dies kann templateId, code oder id betreffen. Erwartet:  hl7:code[(@code = '398295005' and @codeSystem = '2.16.840.1.113883.6.96')] | hl7:effectiveTime[not(@nullFlavor)] (rule-reference: d141e503-true-d9547e0)</assert>
    </rule>

   <!-- Checking undefined contents for template/element @isClosed="true". Match context that we did not already match -->
    <rule context="/hl7:ClinicalDocument[hl7:templateId[@root = '1.2.40.0.34.6.0.11.0.1'] and hl7:templateId[@root = '1.2.40.0.34.7.26'] and hl7:templateId[@root = '1.2.40.0.34.6.0.11.0.13']]/hl7:documentationOf[hl7:serviceEvent[hl7:code[(@code = '398295005' and @codeSystem = '2.16.840.1.113883.6.96')]]]/hl7:serviceEvent[hl7:code[(@code = '398295005' and @codeSystem = '2.16.840.1.113883.6.96')]]/hl7:effectiveTime[not(@nullFlavor)]/*[not(@xsi:nil = 'true')][not(self::hl7:low[not(@nullFlavor)] | self::hl7:high[not(@nullFlavor)])]" id="d141e540-true-d9570e0">
        <assert role="error" see="http://art-decor.org/art-decor/decor-templates--at-pv-?id=1.2.40.0.34.6.0.11.0.13" test="not(.)">(atpv_document_Patientenverfuegung)/d141e540-true-d9570e0: '<value-of select="name(..)"/>' ist als geschlossen definiert und dieses Element '<name/>' ist nicht erlaubt oder nicht mit diesem Inhalt erlaubt. Dies kann templateId, code oder id betreffen. Erwartet:  hl7:low[not(@nullFlavor)] | hl7:high[not(@nullFlavor)] (rule-reference: d141e540-true-d9570e0)</assert>
    </rule>

   <!-- Checking undefined contents for template/element @isClosed="true". Match context that we did not already match -->
    <rule context="/hl7:ClinicalDocument[hl7:templateId[@root = '1.2.40.0.34.6.0.11.0.1'] and hl7:templateId[@root = '1.2.40.0.34.7.26'] and hl7:templateId[@root = '1.2.40.0.34.6.0.11.0.13']]/hl7:component[not(@nullFlavor)][hl7:nonXMLBody]/*[not(@xsi:nil = 'true')][not(self::hl7:nonXMLBody[not(@nullFlavor)])]" id="d141e621-true-d9603e0">
        <assert role="error" see="http://art-decor.org/art-decor/decor-templates--at-pv-?id=1.2.40.0.34.6.0.11.0.13" test="not(.)">(atpv_document_Patientenverfuegung)/d141e621-true-d9603e0: '<value-of select="name(..)"/>' ist als geschlossen definiert und dieses Element '<name/>' ist nicht erlaubt oder nicht mit diesem Inhalt erlaubt. Dies kann templateId, code oder id betreffen. Erwartet:  hl7:nonXMLBody[not(@nullFlavor)] (rule-reference: d141e621-true-d9603e0)</assert>
    </rule>

   <!-- Checking undefined contents for template/element @isClosed="true". Match context that we did not already match -->
    <rule context="/hl7:ClinicalDocument[hl7:templateId[@root = '1.2.40.0.34.6.0.11.0.1'] and hl7:templateId[@root = '1.2.40.0.34.7.26'] and hl7:templateId[@root = '1.2.40.0.34.6.0.11.0.13']]/hl7:component[not(@nullFlavor)][hl7:nonXMLBody]/hl7:nonXMLBody[not(@nullFlavor)]/*[not(@xsi:nil = 'true')][not(self::hl7:text[not(@nullFlavor)])]" id="d141e627-true-d9616e0">
        <assert role="error" see="http://art-decor.org/art-decor/decor-templates--at-pv-?id=1.2.40.0.34.6.0.11.0.13" test="not(.)">(atpv_document_Patientenverfuegung)/d141e627-true-d9616e0: '<value-of select="name(..)"/>' ist als geschlossen definiert und dieses Element '<name/>' ist nicht erlaubt oder nicht mit diesem Inhalt erlaubt. Dies kann templateId, code oder id betreffen. Erwartet:  hl7:text[not(@nullFlavor)] (rule-reference: d141e627-true-d9616e0)</assert>
    </rule>
</pattern>