<?xml version="1.0" encoding="UTF-8"?>
<!-- 
    DTR1 EIVL.event - Event Related Interval of Timestamps event part
    Status: draft
-->
<rule xmlns="http://purl.oclc.org/dsdl/schematron"
      abstract="true"
      id="EIVL.event"
      see="https://docs.art-decor.org/documentation/datatypes/DTr1_EIVL.event">
    <extends rule="CE"/>
</rule>
