<?xml version="1.0" encoding="UTF-8"?>
<!-- 
    DTr1 IVXB_TS - TS
    Status: draft
-->
<rule xmlns="http://purl.oclc.org/dsdl/schematron"
      abstract="true"
      id="IVXB_TS">
    <extends rule="TS"/>
    <assert role="error"
           test="not(@nullFlavor and @inclusive) or @inclusive = 'true'"
           see="https://docs.art-decor.org/documentation/datatypes/DTr1_IVXB_TS">dtr1-1-IVXB_TS: not inclusive if null</assert>
</rule>
