<?xml version="1.0" encoding="UTF-8"?>
<!-- 
    DTR1 GLIST_TS - Generated Sequence of Timestamp
    Status: draft
-->
<rule xmlns="http://purl.oclc.org/dsdl/schematron"
      abstract="true"
      id="GLIST_TS"
      see="https://docs.art-decor.org/documentation/datatypes/DTr1_GLIST_TS">
    <extends rule="GLIST"/>
</rule>
