<?xml version="1.0" encoding="UTF-8"?>
<!--
Template derived pattern
===========================================
ID: 1.2.40.0.34.6.0.11.3.53
Name: Logo Entry
Description: 
-->
<pattern xmlns="http://purl.oclc.org/dsdl/schematron"
         id="template-1.2.40.0.34.6.0.11.3.53-2021-06-28T110849-closed">
   <title>Logo Entry</title>

   <!-- Checking undefined contents for template/element @isClosed="true". Match context that we did not already match -->
   <rule fpi="RUL-QQQ"
         context="*[hl7:observationMedia[hl7:templateId[@root = '1.2.40.0.34.6.0.11.3.53']]]/*[not(@xsi:nil = 'true')][not(self::hl7:observationMedia[hl7:templateId[@root = '1.2.40.0.34.6.0.11.3.53']])]"
         id="d42e34703-true-d1773806e0">
      <assert role="error"
              see="https://elga.art-decor.org/at-lab-html-20250116T124017/tmp-1.2.40.0.34.6.0.11.3.53-2021-06-28T110849.html"
              test="not(.)">(atcdabbr_entry_Logo)/d42e34703-true-d1773806e0: '<value-of select="name(..)"/>' ist als geschlossen definiert und dieses Element '<name/>' ist nicht erlaubt oder nicht mit diesem Inhalt erlaubt. Dies kann templateId, code oder id betreffen. Erwartet:  hl7:observationMedia[hl7:templateId[@root = '1.2.40.0.34.6.0.11.3.53']] (rule-reference: d42e34703-true-d1773806e0)</assert>
   </rule>

   <!-- Checking undefined contents for template/element @isClosed="true". Match context that we did not already match -->
   <rule fpi="RUL-QQQ"
         context="*[hl7:observationMedia[hl7:templateId[@root = '1.2.40.0.34.6.0.11.3.53']]]/hl7:observationMedia[hl7:templateId[@root = '1.2.40.0.34.6.0.11.3.53']]/*[not(@xsi:nil = 'true')][not(self::hl7:templateId[@root = '1.2.40.0.34.6.0.11.3.53'] | self::hl7:value[not(@nullFlavor)] | self::hl7:performer[hl7:templateId[@root = '1.2.40.0.34.6.0.11.9.17']] | self::hl7:author[hl7:assignedAuthor] | self::hl7:informant | self::hl7:participant[@typeCode][hl7:participantRole])]"
         id="d42e34736-true-d1774294e0">
      <assert role="error"
              see="https://elga.art-decor.org/at-lab-html-20250116T124017/tmp-1.2.40.0.34.6.0.11.3.53-2021-06-28T110849.html"
              test="not(.)">(atcdabbr_entry_Logo)/d42e34736-true-d1774294e0: '<value-of select="name(..)"/>' ist als geschlossen definiert und dieses Element '<name/>' ist nicht erlaubt oder nicht mit diesem Inhalt erlaubt. Dies kann templateId, code oder id betreffen. Erwartet:  hl7:templateId[@root = '1.2.40.0.34.6.0.11.3.53'] | hl7:value[not(@nullFlavor)] | hl7:performer[hl7:templateId[@root = '1.2.40.0.34.6.0.11.9.17']] | hl7:author[hl7:assignedAuthor] | hl7:informant | hl7:participant[@typeCode][hl7:participantRole] (rule-reference: d42e34736-true-d1774294e0)</assert>
   </rule>

   <!-- Checking undefined contents for template/element @isClosed="true". Match context that we did not already match -->
   <rule fpi="RUL-QQQ"
         context="*[hl7:observationMedia[hl7:templateId[@root = '1.2.40.0.34.6.0.11.3.53']]]/hl7:observationMedia[hl7:templateId[@root = '1.2.40.0.34.6.0.11.3.53']]/hl7:performer[hl7:templateId[@root = '1.2.40.0.34.6.0.11.9.17']]/*[not(@xsi:nil = 'true')][not(self::hl7:templateId[@root = '1.2.40.0.34.6.0.11.9.17'] | self::hl7:time | self::hl7:assignedEntity[not(@nullFlavor)])]"
         id="d42e34781-true-d1774449e0">
      <assert role="error"
              see="https://elga.art-decor.org/at-lab-html-20250116T124017/tmp-1.2.40.0.34.6.0.11.3.53-2021-06-28T110849.html"
              test="not(.)">(atcdabbr_entry_Logo)/d42e34781-true-d1774449e0: '<value-of select="name(..)"/>' ist als geschlossen definiert und dieses Element '<name/>' ist nicht erlaubt oder nicht mit diesem Inhalt erlaubt. Dies kann templateId, code oder id betreffen. Erwartet:  hl7:templateId[@root = '1.2.40.0.34.6.0.11.9.17'] | hl7:time | hl7:assignedEntity[not(@nullFlavor)] (rule-reference: d42e34781-true-d1774449e0)</assert>
   </rule>

   <!-- Checking undefined contents for template/element @isClosed="true". Match context that we did not already match -->
   <rule fpi="RUL-QQQ"
         context="*[hl7:observationMedia[hl7:templateId[@root = '1.2.40.0.34.6.0.11.3.53']]]/hl7:observationMedia[hl7:templateId[@root = '1.2.40.0.34.6.0.11.3.53']]/hl7:performer[hl7:templateId[@root = '1.2.40.0.34.6.0.11.9.17']]/hl7:assignedEntity[not(@nullFlavor)]/*[not(@xsi:nil = 'true')][not(self::hl7:id[not(@nullFlavor)] | self::hl7:id[@nullFlavor='NI'] | self::hl7:id[@nullFlavor='UNK'] | self::hl7:code | self::hl7:addr | self::hl7:telecom | self::hl7:assignedPerson | self::hl7:assignedPerson | self::hl7:representedOrganization)]"
         id="d1774310e14-true-d1774555e0">
      <assert role="error"
              see="https://elga.art-decor.org/at-lab-html-20250116T124017/tmp-1.2.40.0.34.6.0.11.3.53-2021-06-28T110849.html"
              test="not(.)">(atcdabbr_entry_Logo)/d1774310e14-true-d1774555e0: '<value-of select="name(..)"/>' ist als geschlossen definiert und dieses Element '<name/>' ist nicht erlaubt oder nicht mit diesem Inhalt erlaubt. Dies kann templateId, code oder id betreffen. Erwartet:  hl7:id[not(@nullFlavor)] | hl7:id[@nullFlavor='NI'] | hl7:id[@nullFlavor='UNK'] | hl7:code | hl7:addr | hl7:telecom | hl7:assignedPerson | hl7:assignedPerson | hl7:representedOrganization (rule-reference: d1774310e14-true-d1774555e0)</assert>
   </rule>

   <!-- Checking undefined contents for template/element @isClosed="true". Match context that we did not already match -->
   <rule fpi="RUL-QQQ"
         context="*[hl7:observationMedia[hl7:templateId[@root = '1.2.40.0.34.6.0.11.3.53']]]/hl7:observationMedia[hl7:templateId[@root = '1.2.40.0.34.6.0.11.3.53']]/hl7:performer[hl7:templateId[@root = '1.2.40.0.34.6.0.11.9.17']]/hl7:assignedEntity[not(@nullFlavor)]/hl7:addr/*[not(@xsi:nil = 'true')][not(self::hl7:streetAddressLine | self::hl7:streetName | self::hl7:houseNumber | self::hl7:postalCode | self::hl7:city | self::hl7:state | self::hl7:country | self::hl7:additionalLocator)]"
         id="d1774559e101-true-d1774628e0">
      <assert role="error"
              see="https://elga.art-decor.org/at-lab-html-20250116T124017/tmp-1.2.40.0.34.6.0.11.3.53-2021-06-28T110849.html"
              test="not(.)">(atcdabbr_entry_Logo)/d1774559e101-true-d1774628e0: '<value-of select="name(..)"/>' ist als geschlossen definiert und dieses Element '<name/>' ist nicht erlaubt oder nicht mit diesem Inhalt erlaubt. Dies kann templateId, code oder id betreffen. Erwartet:  hl7:streetAddressLine | hl7:streetName | hl7:houseNumber | hl7:postalCode | hl7:city | hl7:state | hl7:country | hl7:additionalLocator (rule-reference: d1774559e101-true-d1774628e0)</assert>
   </rule>

   <!-- Checking undefined contents for template/element @isClosed="true". Match context that we did not already match -->
   <rule fpi="RUL-QQQ"
         context="*[hl7:observationMedia[hl7:templateId[@root = '1.2.40.0.34.6.0.11.3.53']]]/hl7:observationMedia[hl7:templateId[@root = '1.2.40.0.34.6.0.11.3.53']]/hl7:performer[hl7:templateId[@root = '1.2.40.0.34.6.0.11.9.17']]/hl7:assignedEntity[not(@nullFlavor)]/hl7:assignedPerson/*[not(@xsi:nil = 'true')][not(self::hl7:name[not(@nullFlavor)])]"
         id="d1774559e174-true-d1774704e0">
      <assert role="error"
              see="https://elga.art-decor.org/at-lab-html-20250116T124017/tmp-1.2.40.0.34.6.0.11.9.16-2021-05-26T140421.html"
              test="not(.)">( atcdabbr_other_AssignedEntityBody)/d1774559e174-true-d1774704e0: '<value-of select="name(..)"/>' ist als geschlossen definiert und dieses Element '<name/>' ist nicht erlaubt oder nicht mit diesem Inhalt erlaubt. Dies kann templateId, code oder id betreffen. Erwartet:  hl7:name[not(@nullFlavor)] (rule-reference: d1774559e174-true-d1774704e0)</assert>
   </rule>

   <!-- Checking undefined contents for template/element @isClosed="true". Match context that we did not already match -->
   <rule fpi="RUL-QQQ"
         context="*[hl7:observationMedia[hl7:templateId[@root = '1.2.40.0.34.6.0.11.3.53']]]/hl7:observationMedia[hl7:templateId[@root = '1.2.40.0.34.6.0.11.3.53']]/hl7:performer[hl7:templateId[@root = '1.2.40.0.34.6.0.11.9.17']]/hl7:assignedEntity[not(@nullFlavor)]/hl7:assignedPerson/*[not(@xsi:nil = 'true')][not(self::hl7:name[not(@nullFlavor)])]"
         id="d1774559e186-true-d1774726e0">
      <assert role="error"
              see="https://elga.art-decor.org/at-lab-html-20250116T124017/tmp-1.2.40.0.34.6.0.11.9.16-2021-05-26T140421.html"
              test="not(.)">( atcdabbr_other_AssignedEntityBody)/d1774559e186-true-d1774726e0: '<value-of select="name(..)"/>' ist als geschlossen definiert und dieses Element '<name/>' ist nicht erlaubt oder nicht mit diesem Inhalt erlaubt. Dies kann templateId, code oder id betreffen. Erwartet:  hl7:name[not(@nullFlavor)] (rule-reference: d1774559e186-true-d1774726e0)</assert>
   </rule>

   <!-- Checking undefined contents for template/element @isClosed="true". Match context that we did not already match -->
   <rule fpi="RUL-QQQ"
         context="*[hl7:observationMedia[hl7:templateId[@root = '1.2.40.0.34.6.0.11.3.53']]]/hl7:observationMedia[hl7:templateId[@root = '1.2.40.0.34.6.0.11.3.53']]/hl7:performer[hl7:templateId[@root = '1.2.40.0.34.6.0.11.9.17']]/hl7:assignedEntity[not(@nullFlavor)]/hl7:assignedPerson/hl7:name[not(@nullFlavor)]/*[not(@xsi:nil = 'true')][not(self::hl7:prefix | self::hl7:family[not(@nullFlavor)] | self::hl7:given[not(@nullFlavor)] | self::hl7:suffix)]"
         id="d1774714e12-true-d1774755e0">
      <assert role="error"
              see="https://elga.art-decor.org/at-lab-html-20250116T124017/tmp-1.2.40.0.34.6.0.11.9.16-2021-05-26T140421.html"
              test="not(.)">( atcdabbr_other_AssignedEntityBody)/d1774714e12-true-d1774755e0: '<value-of select="name(..)"/>' ist als geschlossen definiert und dieses Element '<name/>' ist nicht erlaubt oder nicht mit diesem Inhalt erlaubt. Dies kann templateId, code oder id betreffen. Erwartet:  hl7:prefix | hl7:family[not(@nullFlavor)] | hl7:given[not(@nullFlavor)] | hl7:suffix (rule-reference: d1774714e12-true-d1774755e0)</assert>
   </rule>

   <!-- Checking undefined contents for template/element @isClosed="true". Match context that we did not already match -->
   <rule fpi="RUL-QQQ"
         context="*[hl7:observationMedia[hl7:templateId[@root = '1.2.40.0.34.6.0.11.3.53']]]/hl7:observationMedia[hl7:templateId[@root = '1.2.40.0.34.6.0.11.3.53']]/hl7:performer[hl7:templateId[@root = '1.2.40.0.34.6.0.11.9.17']]/hl7:assignedEntity[not(@nullFlavor)]/hl7:representedOrganization/*[not(@xsi:nil = 'true')][not(self::hl7:id[not(@nullFlavor)] | self::hl7:name[not(@nullFlavor)] | self::hl7:telecom[not(@nullFlavor)] | self::hl7:addr[not(@nullFlavor)])]"
         id="d1774559e198-true-d1774806e0">
      <assert role="error"
              see="https://elga.art-decor.org/at-lab-html-20250116T124017/tmp-1.2.40.0.34.6.0.11.3.53-2021-06-28T110849.html"
              test="not(.)">(atcdabbr_entry_Logo)/d1774559e198-true-d1774806e0: '<value-of select="name(..)"/>' ist als geschlossen definiert und dieses Element '<name/>' ist nicht erlaubt oder nicht mit diesem Inhalt erlaubt. Dies kann templateId, code oder id betreffen. Erwartet:  hl7:id[not(@nullFlavor)] | hl7:name[not(@nullFlavor)] | hl7:telecom[not(@nullFlavor)] | hl7:addr[not(@nullFlavor)] (rule-reference: d1774559e198-true-d1774806e0)</assert>
   </rule>

   <!-- Checking undefined contents for template/element @isClosed="true". Match context that we did not already match -->
   <rule fpi="RUL-QQQ"
         context="*[hl7:observationMedia[hl7:templateId[@root = '1.2.40.0.34.6.0.11.3.53']]]/hl7:observationMedia[hl7:templateId[@root = '1.2.40.0.34.6.0.11.3.53']]/hl7:performer[hl7:templateId[@root = '1.2.40.0.34.6.0.11.9.17']]/hl7:assignedEntity[not(@nullFlavor)]/hl7:representedOrganization/hl7:addr[not(@nullFlavor)]/*[not(@xsi:nil = 'true')][not(self::hl7:streetAddressLine | self::hl7:streetName | self::hl7:houseNumber | self::hl7:postalCode | self::hl7:city | self::hl7:state | self::hl7:country | self::hl7:additionalLocator)]"
         id="d1774780e58-true-d1774867e0">
      <assert role="error"
              see="https://elga.art-decor.org/at-lab-html-20250116T124017/tmp-1.2.40.0.34.6.0.11.3.53-2021-06-28T110849.html"
              test="not(.)">(atcdabbr_entry_Logo)/d1774780e58-true-d1774867e0: '<value-of select="name(..)"/>' ist als geschlossen definiert und dieses Element '<name/>' ist nicht erlaubt oder nicht mit diesem Inhalt erlaubt. Dies kann templateId, code oder id betreffen. Erwartet:  hl7:streetAddressLine | hl7:streetName | hl7:houseNumber | hl7:postalCode | hl7:city | hl7:state | hl7:country | hl7:additionalLocator (rule-reference: d1774780e58-true-d1774867e0)</assert>
   </rule>

   <!-- Checking undefined contents for template/element @isClosed="true". Match context that we did not already match -->
   <rule fpi="RUL-QQQ"
         context="*[hl7:observationMedia[hl7:templateId[@root = '1.2.40.0.34.6.0.11.3.53']]]/hl7:observationMedia[hl7:templateId[@root = '1.2.40.0.34.6.0.11.3.53']]/hl7:author[hl7:assignedAuthor]/*[not(@xsi:nil = 'true')][not(self::hl7:functionCode | self::hl7:time[not(@nullFlavor)] | self::hl7:time[@nullFlavor='UNK'] | self::hl7:assignedAuthor)]"
         id="d42e34784-true-d1775034e0">
      <assert role="error"
              see="https://elga.art-decor.org/at-lab-html-20250116T124017/tmp-1.2.40.0.34.6.0.11.3.53-2021-06-28T110849.html"
              test="not(.)">(atcdabbr_entry_Logo)/d42e34784-true-d1775034e0: '<value-of select="name(..)"/>' ist als geschlossen definiert und dieses Element '<name/>' ist nicht erlaubt oder nicht mit diesem Inhalt erlaubt. Dies kann templateId, code oder id betreffen. Erwartet:  hl7:functionCode | hl7:time[not(@nullFlavor)] | hl7:time[@nullFlavor='UNK'] | hl7:assignedAuthor (rule-reference: d42e34784-true-d1775034e0)</assert>
   </rule>

   <!-- Checking undefined contents for template/element @isClosed="true". Match context that we did not already match -->
   <rule fpi="RUL-QQQ"
         context="*[hl7:observationMedia[hl7:templateId[@root = '1.2.40.0.34.6.0.11.3.53']]]/hl7:observationMedia[hl7:templateId[@root = '1.2.40.0.34.6.0.11.3.53']]/hl7:author[hl7:assignedAuthor]/hl7:assignedAuthor/*[not(@xsi:nil = 'true')][not(self::hl7:id[not(@nullFlavor)] | self::hl7:id[@nullFlavor='UNK'] | self::hl7:code[not(@nullFlavor)] | self::hl7:addr[not(@nullFlavor)] | self::hl7:telecom[not(@nullFlavor)] | self::hl7:assignedPerson | self::hl7:assignedAuthoringDevice | self::hl7:representedOrganization)]"
         id="d1774912e41-true-d1775142e0">
      <assert role="error"
              see="https://elga.art-decor.org/at-lab-html-20250116T124017/tmp-1.2.40.0.34.6.0.11.3.53-2021-06-28T110849.html"
              test="not(.)">(atcdabbr_entry_Logo)/d1774912e41-true-d1775142e0: '<value-of select="name(..)"/>' ist als geschlossen definiert und dieses Element '<name/>' ist nicht erlaubt oder nicht mit diesem Inhalt erlaubt. Dies kann templateId, code oder id betreffen. Erwartet:  hl7:id[not(@nullFlavor)] | hl7:id[@nullFlavor='UNK'] | hl7:code[not(@nullFlavor)] | hl7:addr[not(@nullFlavor)] | hl7:telecom[not(@nullFlavor)] | hl7:assignedPerson | hl7:assignedAuthoringDevice | hl7:representedOrganization (rule-reference: d1774912e41-true-d1775142e0)</assert>
   </rule>

   <!-- Checking undefined contents for template/element @isClosed="true". Match context that we did not already match -->
   <rule fpi="RUL-QQQ"
         context="*[hl7:observationMedia[hl7:templateId[@root = '1.2.40.0.34.6.0.11.3.53']]]/hl7:observationMedia[hl7:templateId[@root = '1.2.40.0.34.6.0.11.3.53']]/hl7:author[hl7:assignedAuthor]/hl7:assignedAuthor/hl7:addr[not(@nullFlavor)]/*[not(@xsi:nil = 'true')][not(self::hl7:streetAddressLine | self::hl7:streetName | self::hl7:houseNumber | self::hl7:postalCode[not(@nullFlavor)] | self::hl7:city[not(@nullFlavor)] | self::hl7:state | self::hl7:country[not(@nullFlavor)] | self::hl7:additionalLocator)]"
         id="d1774912e60-true-d1775201e0">
      <assert role="error"
              see="https://elga.art-decor.org/at-lab-html-20250116T124017/tmp-1.2.40.0.34.6.0.11.3.53-2021-06-28T110849.html"
              test="not(.)">(atcdabbr_entry_Logo)/d1774912e60-true-d1775201e0: '<value-of select="name(..)"/>' ist als geschlossen definiert und dieses Element '<name/>' ist nicht erlaubt oder nicht mit diesem Inhalt erlaubt. Dies kann templateId, code oder id betreffen. Erwartet:  hl7:streetAddressLine | hl7:streetName | hl7:houseNumber | hl7:postalCode[not(@nullFlavor)] | hl7:city[not(@nullFlavor)] | hl7:state | hl7:country[not(@nullFlavor)] | hl7:additionalLocator (rule-reference: d1774912e60-true-d1775201e0)</assert>
   </rule>

   <!-- Checking undefined contents for template/element @isClosed="true". Match context that we did not already match -->
   <rule fpi="RUL-QQQ"
         context="*[hl7:observationMedia[hl7:templateId[@root = '1.2.40.0.34.6.0.11.3.53']]]/hl7:observationMedia[hl7:templateId[@root = '1.2.40.0.34.6.0.11.3.53']]/hl7:author[hl7:assignedAuthor]/hl7:assignedAuthor/hl7:assignedPerson/*[not(@xsi:nil = 'true')][not(self::hl7:name[not(@nullFlavor)] | self::hl7:name[@nullFlavor='UNK'] | self::hl7:name[@nullFlavor='MSK'])]"
         id="d1774912e106-true-d1775258e0">
      <assert role="error"
              see="https://elga.art-decor.org/at-lab-html-20250116T124017/tmp-1.2.40.0.34.6.0.11.3.53-2021-06-28T110849.html"
              test="not(.)">(atcdabbr_entry_Logo)/d1774912e106-true-d1775258e0: '<value-of select="name(..)"/>' ist als geschlossen definiert und dieses Element '<name/>' ist nicht erlaubt oder nicht mit diesem Inhalt erlaubt. Dies kann templateId, code oder id betreffen. Erwartet:  hl7:name[not(@nullFlavor)] | hl7:name[@nullFlavor='UNK'] | hl7:name[@nullFlavor='MSK'] (rule-reference: d1774912e106-true-d1775258e0)</assert>
   </rule>

   <!-- Checking undefined contents for template/element @isClosed="true". Match context that we did not already match -->
   <rule fpi="RUL-QQQ"
         context="*[hl7:observationMedia[hl7:templateId[@root = '1.2.40.0.34.6.0.11.3.53']]]/hl7:observationMedia[hl7:templateId[@root = '1.2.40.0.34.6.0.11.3.53']]/hl7:author[hl7:assignedAuthor]/hl7:assignedAuthor/hl7:assignedPerson/hl7:name[not(@nullFlavor)]/*[not(@xsi:nil = 'true')][not(self::hl7:prefix | self::hl7:family[not(@nullFlavor)] | self::hl7:given[not(@nullFlavor)] | self::hl7:suffix)]"
         id="d1775262e92-true-d1775292e0">
      <assert role="error"
              see="https://elga.art-decor.org/at-lab-html-20250116T124017/tmp-1.2.40.0.34.6.0.11.9.6-2023-03-31T111555.html"
              test="not(.)">(atcdabbr_other_PersonNameCompilationG2)/d1775262e92-true-d1775292e0: '<value-of select="name(..)"/>' ist als geschlossen definiert und dieses Element '<name/>' ist nicht erlaubt oder nicht mit diesem Inhalt erlaubt. Dies kann templateId, code oder id betreffen. Erwartet:  hl7:prefix | hl7:family[not(@nullFlavor)] | hl7:given[not(@nullFlavor)] | hl7:suffix (rule-reference: d1775262e92-true-d1775292e0)</assert>
   </rule>

   <!-- Checking undefined contents for template/element @isClosed="true". Match context that we did not already match -->
   <rule fpi="RUL-QQQ"
         context="*[hl7:observationMedia[hl7:templateId[@root = '1.2.40.0.34.6.0.11.3.53']]]/hl7:observationMedia[hl7:templateId[@root = '1.2.40.0.34.6.0.11.3.53']]/hl7:author[hl7:assignedAuthor]/hl7:assignedAuthor/hl7:assignedAuthoringDevice/*[not(@xsi:nil = 'true')][not(self::hl7:manufacturerModelName[not(@nullFlavor)] | self::hl7:softwareName[not(@nullFlavor)])]"
         id="d1774912e129-true-d1775340e0">
      <assert role="error"
              see="https://elga.art-decor.org/at-lab-html-20250116T124017/tmp-1.2.40.0.34.6.0.11.3.53-2021-06-28T110849.html"
              test="not(.)">(atcdabbr_entry_Logo)/d1774912e129-true-d1775340e0: '<value-of select="name(..)"/>' ist als geschlossen definiert und dieses Element '<name/>' ist nicht erlaubt oder nicht mit diesem Inhalt erlaubt. Dies kann templateId, code oder id betreffen. Erwartet:  hl7:manufacturerModelName[not(@nullFlavor)] | hl7:softwareName[not(@nullFlavor)] (rule-reference: d1774912e129-true-d1775340e0)</assert>
   </rule>

   <!-- Checking undefined contents for template/element @isClosed="true". Match context that we did not already match -->
   <rule fpi="RUL-QQQ"
         context="*[hl7:observationMedia[hl7:templateId[@root = '1.2.40.0.34.6.0.11.3.53']]]/hl7:observationMedia[hl7:templateId[@root = '1.2.40.0.34.6.0.11.3.53']]/hl7:author[hl7:assignedAuthor]/hl7:assignedAuthor/hl7:representedOrganization/*[not(@xsi:nil = 'true')][not(self::hl7:id[not(@nullFlavor)] | self::hl7:name[not(@nullFlavor)] | self::hl7:telecom[not(@nullFlavor)] | self::hl7:addr[not(@nullFlavor)])]"
         id="d1774912e145-true-d1775385e0">
      <assert role="error"
              see="https://elga.art-decor.org/at-lab-html-20250116T124017/tmp-1.2.40.0.34.6.0.11.3.53-2021-06-28T110849.html"
              test="not(.)">(atcdabbr_entry_Logo)/d1774912e145-true-d1775385e0: '<value-of select="name(..)"/>' ist als geschlossen definiert und dieses Element '<name/>' ist nicht erlaubt oder nicht mit diesem Inhalt erlaubt. Dies kann templateId, code oder id betreffen. Erwartet:  hl7:id[not(@nullFlavor)] | hl7:name[not(@nullFlavor)] | hl7:telecom[not(@nullFlavor)] | hl7:addr[not(@nullFlavor)] (rule-reference: d1774912e145-true-d1775385e0)</assert>
   </rule>

   <!-- Checking undefined contents for template/element @isClosed="true". Match context that we did not already match -->
   <rule fpi="RUL-QQQ"
         context="*[hl7:observationMedia[hl7:templateId[@root = '1.2.40.0.34.6.0.11.3.53']]]/hl7:observationMedia[hl7:templateId[@root = '1.2.40.0.34.6.0.11.3.53']]/hl7:author[hl7:assignedAuthor]/hl7:assignedAuthor/hl7:representedOrganization/hl7:addr[not(@nullFlavor)]/*[not(@xsi:nil = 'true')][not(self::hl7:streetAddressLine | self::hl7:streetName | self::hl7:houseNumber | self::hl7:postalCode[not(@nullFlavor)] | self::hl7:city[not(@nullFlavor)] | self::hl7:state | self::hl7:country[not(@nullFlavor)] | self::hl7:additionalLocator)]"
         id="d1775355e67-true-d1775448e0">
      <assert role="error"
              see="https://elga.art-decor.org/at-lab-html-20250116T124017/tmp-1.2.40.0.34.6.0.11.3.53-2021-06-28T110849.html"
              test="not(.)">(atcdabbr_entry_Logo)/d1775355e67-true-d1775448e0: '<value-of select="name(..)"/>' ist als geschlossen definiert und dieses Element '<name/>' ist nicht erlaubt oder nicht mit diesem Inhalt erlaubt. Dies kann templateId, code oder id betreffen. Erwartet:  hl7:streetAddressLine | hl7:streetName | hl7:houseNumber | hl7:postalCode[not(@nullFlavor)] | hl7:city[not(@nullFlavor)] | hl7:state | hl7:country[not(@nullFlavor)] | hl7:additionalLocator (rule-reference: d1775355e67-true-d1775448e0)</assert>
   </rule>

   <!-- Checking undefined contents for template/element @isClosed="true". Match context that we did not already match -->
   <rule fpi="RUL-QQQ"
         context="*[hl7:observationMedia[hl7:templateId[@root = '1.2.40.0.34.6.0.11.3.53']]]/hl7:observationMedia[hl7:templateId[@root = '1.2.40.0.34.6.0.11.3.53']]/hl7:informant/*[not(@xsi:nil = 'true')][not(self::hl7:assignedEntity | self::hl7:relatedEntity[@classCode = 'PRS'])]"
         id="d42e34786-true-d1775616e0">
      <assert role="error"
              see="https://elga.art-decor.org/at-lab-html-20250116T124017/tmp-1.2.40.0.34.6.0.11.3.53-2021-06-28T110849.html"
              test="not(.)">(atcdabbr_entry_Logo)/d42e34786-true-d1775616e0: '<value-of select="name(..)"/>' ist als geschlossen definiert und dieses Element '<name/>' ist nicht erlaubt oder nicht mit diesem Inhalt erlaubt. Dies kann templateId, code oder id betreffen. Erwartet:  hl7:assignedEntity | hl7:relatedEntity[@classCode = 'PRS'] (rule-reference: d42e34786-true-d1775616e0)</assert>
   </rule>

   <!-- Checking undefined contents for template/element @isClosed="true". Match context that we did not already match -->
   <rule fpi="RUL-QQQ"
         context="*[hl7:observationMedia[hl7:templateId[@root = '1.2.40.0.34.6.0.11.3.53']]]/hl7:observationMedia[hl7:templateId[@root = '1.2.40.0.34.6.0.11.3.53']]/hl7:informant/hl7:assignedEntity/*[not(@xsi:nil = 'true')][not(self::hl7:id[not(@nullFlavor)] | self::hl7:id[@nullFlavor='NI'] | self::hl7:id[@nullFlavor='UNK'] | self::hl7:code | self::hl7:addr | self::hl7:telecom | self::hl7:assignedPerson | self::hl7:assignedPerson | self::hl7:representedOrganization)]"
         id="d1775493e5-true-d1775748e0">
      <assert role="error"
              see="https://elga.art-decor.org/at-lab-html-20250116T124017/tmp-1.2.40.0.34.6.0.11.3.53-2021-06-28T110849.html"
              test="not(.)">(atcdabbr_entry_Logo)/d1775493e5-true-d1775748e0: '<value-of select="name(..)"/>' ist als geschlossen definiert und dieses Element '<name/>' ist nicht erlaubt oder nicht mit diesem Inhalt erlaubt. Dies kann templateId, code oder id betreffen. Erwartet:  hl7:id[not(@nullFlavor)] | hl7:id[@nullFlavor='NI'] | hl7:id[@nullFlavor='UNK'] | hl7:code | hl7:addr | hl7:telecom | hl7:assignedPerson | hl7:assignedPerson | hl7:representedOrganization (rule-reference: d1775493e5-true-d1775748e0)</assert>
   </rule>

   <!-- Checking undefined contents for template/element @isClosed="true". Match context that we did not already match -->
   <rule fpi="RUL-QQQ"
         context="*[hl7:observationMedia[hl7:templateId[@root = '1.2.40.0.34.6.0.11.3.53']]]/hl7:observationMedia[hl7:templateId[@root = '1.2.40.0.34.6.0.11.3.53']]/hl7:informant/hl7:assignedEntity/hl7:addr/*[not(@xsi:nil = 'true')][not(self::hl7:streetAddressLine | self::hl7:streetName | self::hl7:houseNumber | self::hl7:postalCode | self::hl7:city | self::hl7:state | self::hl7:country | self::hl7:additionalLocator)]"
         id="d1775621e50-true-d1775814e0">
      <assert role="error"
              see="https://elga.art-decor.org/at-lab-html-20250116T124017/tmp-1.2.40.0.34.6.0.11.3.53-2021-06-28T110849.html"
              test="not(.)">(atcdabbr_entry_Logo)/d1775621e50-true-d1775814e0: '<value-of select="name(..)"/>' ist als geschlossen definiert und dieses Element '<name/>' ist nicht erlaubt oder nicht mit diesem Inhalt erlaubt. Dies kann templateId, code oder id betreffen. Erwartet:  hl7:streetAddressLine | hl7:streetName | hl7:houseNumber | hl7:postalCode | hl7:city | hl7:state | hl7:country | hl7:additionalLocator (rule-reference: d1775621e50-true-d1775814e0)</assert>
   </rule>

   <!-- Checking undefined contents for template/element @isClosed="true". Match context that we did not already match -->
   <rule fpi="RUL-QQQ"
         context="*[hl7:observationMedia[hl7:templateId[@root = '1.2.40.0.34.6.0.11.3.53']]]/hl7:observationMedia[hl7:templateId[@root = '1.2.40.0.34.6.0.11.3.53']]/hl7:informant/hl7:assignedEntity/hl7:assignedPerson/*[not(@xsi:nil = 'true')][not(self::hl7:name[not(@nullFlavor)])]"
         id="d1775621e120-true-d1775876e0">
      <assert role="error"
              see="https://elga.art-decor.org/at-lab-html-20250116T124017/tmp-1.2.40.0.34.6.0.11.3.53-2021-06-28T110849.html"
              test="not(.)">(atcdabbr_entry_Logo)/d1775621e120-true-d1775876e0: '<value-of select="name(..)"/>' ist als geschlossen definiert und dieses Element '<name/>' ist nicht erlaubt oder nicht mit diesem Inhalt erlaubt. Dies kann templateId, code oder id betreffen. Erwartet:  hl7:name[not(@nullFlavor)] (rule-reference: d1775621e120-true-d1775876e0)</assert>
   </rule>

   <!-- Checking undefined contents for template/element @isClosed="true". Match context that we did not already match -->
   <rule fpi="RUL-QQQ"
         context="*[hl7:observationMedia[hl7:templateId[@root = '1.2.40.0.34.6.0.11.3.53']]]/hl7:observationMedia[hl7:templateId[@root = '1.2.40.0.34.6.0.11.3.53']]/hl7:informant/hl7:assignedEntity/hl7:assignedPerson/*[not(@xsi:nil = 'true')][not(self::hl7:name[not(@nullFlavor)])]"
         id="d1775621e132-true-d1775898e0">
      <assert role="error"
              see="https://elga.art-decor.org/at-lab-html-20250116T124017/tmp-1.2.40.0.34.6.0.11.3.53-2021-06-28T110849.html"
              test="not(.)">(atcdabbr_entry_Logo)/d1775621e132-true-d1775898e0: '<value-of select="name(..)"/>' ist als geschlossen definiert und dieses Element '<name/>' ist nicht erlaubt oder nicht mit diesem Inhalt erlaubt. Dies kann templateId, code oder id betreffen. Erwartet:  hl7:name[not(@nullFlavor)] (rule-reference: d1775621e132-true-d1775898e0)</assert>
   </rule>

   <!-- Checking undefined contents for template/element @isClosed="true". Match context that we did not already match -->
   <rule fpi="RUL-QQQ"
         context="*[hl7:observationMedia[hl7:templateId[@root = '1.2.40.0.34.6.0.11.3.53']]]/hl7:observationMedia[hl7:templateId[@root = '1.2.40.0.34.6.0.11.3.53']]/hl7:informant/hl7:assignedEntity/hl7:assignedPerson/hl7:name[not(@nullFlavor)]/*[not(@xsi:nil = 'true')][not(self::hl7:prefix | self::hl7:family[not(@nullFlavor)] | self::hl7:given[not(@nullFlavor)] | self::hl7:suffix)]"
         id="d1775886e12-true-d1775927e0">
      <assert role="error"
              see="https://elga.art-decor.org/at-lab-html-20250116T124017/tmp-1.2.40.0.34.6.0.11.3.53-2021-06-28T110849.html"
              test="not(.)">(atcdabbr_entry_Logo)/d1775886e12-true-d1775927e0: '<value-of select="name(..)"/>' ist als geschlossen definiert und dieses Element '<name/>' ist nicht erlaubt oder nicht mit diesem Inhalt erlaubt. Dies kann templateId, code oder id betreffen. Erwartet:  hl7:prefix | hl7:family[not(@nullFlavor)] | hl7:given[not(@nullFlavor)] | hl7:suffix (rule-reference: d1775886e12-true-d1775927e0)</assert>
   </rule>

   <!-- Checking undefined contents for template/element @isClosed="true". Match context that we did not already match -->
   <rule fpi="RUL-QQQ"
         context="*[hl7:observationMedia[hl7:templateId[@root = '1.2.40.0.34.6.0.11.3.53']]]/hl7:observationMedia[hl7:templateId[@root = '1.2.40.0.34.6.0.11.3.53']]/hl7:informant/hl7:assignedEntity/hl7:representedOrganization/*[not(@xsi:nil = 'true')][not(self::hl7:id[not(@nullFlavor)] | self::hl7:name[not(@nullFlavor)] | self::hl7:telecom[not(@nullFlavor)] | self::hl7:addr[not(@nullFlavor)])]"
         id="d1775621e143-true-d1775978e0">
      <assert role="error"
              see="https://elga.art-decor.org/at-lab-html-20250116T124017/tmp-1.2.40.0.34.6.0.11.3.53-2021-06-28T110849.html"
              test="not(.)">(atcdabbr_entry_Logo)/d1775621e143-true-d1775978e0: '<value-of select="name(..)"/>' ist als geschlossen definiert und dieses Element '<name/>' ist nicht erlaubt oder nicht mit diesem Inhalt erlaubt. Dies kann templateId, code oder id betreffen. Erwartet:  hl7:id[not(@nullFlavor)] | hl7:name[not(@nullFlavor)] | hl7:telecom[not(@nullFlavor)] | hl7:addr[not(@nullFlavor)] (rule-reference: d1775621e143-true-d1775978e0)</assert>
   </rule>

   <!-- Checking undefined contents for template/element @isClosed="true". Match context that we did not already match -->
   <rule fpi="RUL-QQQ"
         context="*[hl7:observationMedia[hl7:templateId[@root = '1.2.40.0.34.6.0.11.3.53']]]/hl7:observationMedia[hl7:templateId[@root = '1.2.40.0.34.6.0.11.3.53']]/hl7:informant/hl7:assignedEntity/hl7:representedOrganization/hl7:addr[not(@nullFlavor)]/*[not(@xsi:nil = 'true')][not(self::hl7:streetAddressLine | self::hl7:streetName | self::hl7:houseNumber | self::hl7:postalCode | self::hl7:city | self::hl7:state | self::hl7:country | self::hl7:additionalLocator)]"
         id="d1775952e58-true-d1776039e0">
      <assert role="error"
              see="https://elga.art-decor.org/at-lab-html-20250116T124017/tmp-1.2.40.0.34.6.0.11.3.53-2021-06-28T110849.html"
              test="not(.)">(atcdabbr_entry_Logo)/d1775952e58-true-d1776039e0: '<value-of select="name(..)"/>' ist als geschlossen definiert und dieses Element '<name/>' ist nicht erlaubt oder nicht mit diesem Inhalt erlaubt. Dies kann templateId, code oder id betreffen. Erwartet:  hl7:streetAddressLine | hl7:streetName | hl7:houseNumber | hl7:postalCode | hl7:city | hl7:state | hl7:country | hl7:additionalLocator (rule-reference: d1775952e58-true-d1776039e0)</assert>
   </rule>

   <!-- Checking undefined contents for template/element @isClosed="true". Match context that we did not already match -->
   <rule fpi="RUL-QQQ"
         context="*[hl7:observationMedia[hl7:templateId[@root = '1.2.40.0.34.6.0.11.3.53']]]/hl7:observationMedia[hl7:templateId[@root = '1.2.40.0.34.6.0.11.3.53']]/hl7:informant/hl7:relatedEntity[@classCode = 'PRS']/*[not(@xsi:nil = 'true')][not(self::hl7:code[not(@nullFlavor)] | self::hl7:addr[not(@nullFlavor)] | self::hl7:telecom[not(@nullFlavor)] | self::hl7:relatedPerson)]"
         id="d1775493e7-true-d1776116e0">
      <assert role="error"
              see="https://elga.art-decor.org/at-lab-html-20250116T124017/tmp-1.2.40.0.34.6.0.11.3.53-2021-06-28T110849.html"
              test="not(.)">(atcdabbr_entry_Logo)/d1775493e7-true-d1776116e0: '<value-of select="name(..)"/>' ist als geschlossen definiert und dieses Element '<name/>' ist nicht erlaubt oder nicht mit diesem Inhalt erlaubt. Dies kann templateId, code oder id betreffen. Erwartet:  hl7:code[not(@nullFlavor)] | hl7:addr[not(@nullFlavor)] | hl7:telecom[not(@nullFlavor)] | hl7:relatedPerson (rule-reference: d1775493e7-true-d1776116e0)</assert>
   </rule>

   <!-- Checking undefined contents for template/element @isClosed="true". Match context that we did not already match -->
   <rule fpi="RUL-QQQ"
         context="*[hl7:observationMedia[hl7:templateId[@root = '1.2.40.0.34.6.0.11.3.53']]]/hl7:observationMedia[hl7:templateId[@root = '1.2.40.0.34.6.0.11.3.53']]/hl7:informant/hl7:relatedEntity[@classCode = 'PRS']/hl7:addr[not(@nullFlavor)]/*[not(@xsi:nil = 'true')][not(self::hl7:streetAddressLine | self::hl7:streetName | self::hl7:houseNumber | self::hl7:postalCode | self::hl7:city | self::hl7:state | self::hl7:country | self::hl7:additionalLocator)]"
         id="d1775493e16-true-d1776169e0">
      <assert role="error"
              see="https://elga.art-decor.org/at-lab-html-20250116T124017/tmp-1.2.40.0.34.6.0.11.3.53-2021-06-28T110849.html"
              test="not(.)">(atcdabbr_entry_Logo)/d1775493e16-true-d1776169e0: '<value-of select="name(..)"/>' ist als geschlossen definiert und dieses Element '<name/>' ist nicht erlaubt oder nicht mit diesem Inhalt erlaubt. Dies kann templateId, code oder id betreffen. Erwartet:  hl7:streetAddressLine | hl7:streetName | hl7:houseNumber | hl7:postalCode | hl7:city | hl7:state | hl7:country | hl7:additionalLocator (rule-reference: d1775493e16-true-d1776169e0)</assert>
   </rule>

   <!-- Checking undefined contents for template/element @isClosed="true". Match context that we did not already match -->
   <rule fpi="RUL-QQQ"
         context="*[hl7:observationMedia[hl7:templateId[@root = '1.2.40.0.34.6.0.11.3.53']]]/hl7:observationMedia[hl7:templateId[@root = '1.2.40.0.34.6.0.11.3.53']]/hl7:informant/hl7:relatedEntity[@classCode = 'PRS']/hl7:relatedPerson/*[not(@xsi:nil = 'true')][not(self::hl7:name[not(@nullFlavor)] | self::hl7:name[@nullFlavor='UNK'] | self::hl7:name[@nullFlavor='MSK'])]"
         id="d1775493e20-true-d1776224e0">
      <assert role="error"
              see="https://elga.art-decor.org/at-lab-html-20250116T124017/tmp-1.2.40.0.34.6.0.11.3.53-2021-06-28T110849.html"
              test="not(.)">(atcdabbr_entry_Logo)/d1775493e20-true-d1776224e0: '<value-of select="name(..)"/>' ist als geschlossen definiert und dieses Element '<name/>' ist nicht erlaubt oder nicht mit diesem Inhalt erlaubt. Dies kann templateId, code oder id betreffen. Erwartet:  hl7:name[not(@nullFlavor)] | hl7:name[@nullFlavor='UNK'] | hl7:name[@nullFlavor='MSK'] (rule-reference: d1775493e20-true-d1776224e0)</assert>
   </rule>

   <!-- Checking undefined contents for template/element @isClosed="true". Match context that we did not already match -->
   <rule fpi="RUL-QQQ"
         context="*[hl7:observationMedia[hl7:templateId[@root = '1.2.40.0.34.6.0.11.3.53']]]/hl7:observationMedia[hl7:templateId[@root = '1.2.40.0.34.6.0.11.3.53']]/hl7:informant/hl7:relatedEntity[@classCode = 'PRS']/hl7:relatedPerson/hl7:name[not(@nullFlavor)]/*[not(@xsi:nil = 'true')][not(self::hl7:prefix | self::hl7:family[not(@nullFlavor)] | self::hl7:given[not(@nullFlavor)] | self::hl7:suffix)]"
         id="d1776217e10-true-d1776251e0">
      <assert role="error"
              see="https://elga.art-decor.org/at-lab-html-20250116T124017/tmp-1.2.40.0.34.6.0.11.3.53-2021-06-28T110849.html"
              test="not(.)">(atcdabbr_entry_Logo)/d1776217e10-true-d1776251e0: '<value-of select="name(..)"/>' ist als geschlossen definiert und dieses Element '<name/>' ist nicht erlaubt oder nicht mit diesem Inhalt erlaubt. Dies kann templateId, code oder id betreffen. Erwartet:  hl7:prefix | hl7:family[not(@nullFlavor)] | hl7:given[not(@nullFlavor)] | hl7:suffix (rule-reference: d1776217e10-true-d1776251e0)</assert>
   </rule>

   <!-- Checking undefined contents for template/element @isClosed="true". Match context that we did not already match -->
   <rule fpi="RUL-QQQ"
         context="*[hl7:observationMedia[hl7:templateId[@root = '1.2.40.0.34.6.0.11.3.53']]]/hl7:observationMedia[hl7:templateId[@root = '1.2.40.0.34.6.0.11.3.53']]/hl7:participant[@typeCode][hl7:participantRole]/*[not(@xsi:nil = 'true')][not(self::hl7:time | self::hl7:awarenessCode[concat(@code, @codeSystem) = doc('include/voc-2.16.840.1.113883.1.11.10310-DYNAMIC.xml')//valueSet[1]/conceptList/concept/concat(@code, @codeSystem) or @nullFlavor] | self::hl7:participantRole)]"
         id="d42e34788-true-d1776379e0">
      <assert role="error"
              see="https://elga.art-decor.org/at-lab-html-20250116T124017/tmp-1.2.40.0.34.6.0.11.3.53-2021-06-28T110849.html"
              test="not(.)">(atcdabbr_entry_Logo)/d42e34788-true-d1776379e0: '<value-of select="name(..)"/>' ist als geschlossen definiert und dieses Element '<name/>' ist nicht erlaubt oder nicht mit diesem Inhalt erlaubt. Dies kann templateId, code oder id betreffen. Erwartet:  hl7:time | hl7:awarenessCode[concat(@code, @codeSystem) = doc('include/voc-2.16.840.1.113883.1.11.10310-DYNAMIC.xml')//valueSet[1]/conceptList/concept/concat(@code, @codeSystem) or @nullFlavor] | hl7:participantRole (rule-reference: d42e34788-true-d1776379e0)</assert>
   </rule>

   <!-- Checking undefined contents for template/element @isClosed="true". Match context that we did not already match -->
   <rule fpi="RUL-QQQ"
         context="*[hl7:observationMedia[hl7:templateId[@root = '1.2.40.0.34.6.0.11.3.53']]]/hl7:observationMedia[hl7:templateId[@root = '1.2.40.0.34.6.0.11.3.53']]/hl7:participant[@typeCode][hl7:participantRole]/hl7:participantRole/*[not(@xsi:nil = 'true')][not(self::hl7:id | self::hl7:code | self::hl7:addr | self::hl7:telecom | self::hl7:playingDevice | self::hl7:playingEntity | self::hl7:scopingEntity)]"
         id="d1776282e11-true-d1776487e0">
      <assert role="error"
              see="https://elga.art-decor.org/at-lab-html-20250116T124017/tmp-1.2.40.0.34.6.0.11.3.53-2021-06-28T110849.html"
              test="not(.)">(atcdabbr_entry_Logo)/d1776282e11-true-d1776487e0: '<value-of select="name(..)"/>' ist als geschlossen definiert und dieses Element '<name/>' ist nicht erlaubt oder nicht mit diesem Inhalt erlaubt. Dies kann templateId, code oder id betreffen. Erwartet:  hl7:id | hl7:code | hl7:addr | hl7:telecom | hl7:playingDevice | hl7:playingEntity | hl7:scopingEntity (rule-reference: d1776282e11-true-d1776487e0)</assert>
   </rule>

   <!-- Checking undefined contents for template/element @isClosed="true". Match context that we did not already match -->
   <rule fpi="RUL-QQQ"
         context="*[hl7:observationMedia[hl7:templateId[@root = '1.2.40.0.34.6.0.11.3.53']]]/hl7:observationMedia[hl7:templateId[@root = '1.2.40.0.34.6.0.11.3.53']]/hl7:participant[@typeCode][hl7:participantRole]/hl7:participantRole/hl7:addr/*[not(@xsi:nil = 'true')][not(self::hl7:streetAddressLine | self::hl7:streetName | self::hl7:houseNumber | self::hl7:postalCode[not(@nullFlavor)] | self::hl7:city[not(@nullFlavor)] | self::hl7:state | self::hl7:country[not(@nullFlavor)] | self::hl7:additionalLocator)]"
         id="d1776282e22-true-d1776549e0">
      <assert role="error"
              see="https://elga.art-decor.org/at-lab-html-20250116T124017/tmp-1.2.40.0.34.6.0.11.3.53-2021-06-28T110849.html"
              test="not(.)">(atcdabbr_entry_Logo)/d1776282e22-true-d1776549e0: '<value-of select="name(..)"/>' ist als geschlossen definiert und dieses Element '<name/>' ist nicht erlaubt oder nicht mit diesem Inhalt erlaubt. Dies kann templateId, code oder id betreffen. Erwartet:  hl7:streetAddressLine | hl7:streetName | hl7:houseNumber | hl7:postalCode[not(@nullFlavor)] | hl7:city[not(@nullFlavor)] | hl7:state | hl7:country[not(@nullFlavor)] | hl7:additionalLocator (rule-reference: d1776282e22-true-d1776549e0)</assert>
   </rule>

   <!-- Checking undefined contents for template/element @isClosed="true". Match context that we did not already match -->
   <rule fpi="RUL-QQQ"
         context="*[hl7:observationMedia[hl7:templateId[@root = '1.2.40.0.34.6.0.11.3.53']]]/hl7:observationMedia[hl7:templateId[@root = '1.2.40.0.34.6.0.11.3.53']]/hl7:participant[@typeCode][hl7:participantRole]/hl7:participantRole/hl7:playingDevice/*[not(@xsi:nil = 'true')][not(self::hl7:code | self::hl7:manufacturerModelName | self::hl7:softwareName)]"
         id="d1776282e78-true-d1776627e0">
      <assert role="error"
              see="https://elga.art-decor.org/at-lab-html-20250116T124017/tmp-1.2.40.0.34.6.0.11.3.53-2021-06-28T110849.html"
              test="not(.)">(atcdabbr_entry_Logo)/d1776282e78-true-d1776627e0: '<value-of select="name(..)"/>' ist als geschlossen definiert und dieses Element '<name/>' ist nicht erlaubt oder nicht mit diesem Inhalt erlaubt. Dies kann templateId, code oder id betreffen. Erwartet:  hl7:code | hl7:manufacturerModelName | hl7:softwareName (rule-reference: d1776282e78-true-d1776627e0)</assert>
   </rule>

   <!-- Checking undefined contents for template/element @isClosed="true". Match context that we did not already match -->
   <rule fpi="RUL-QQQ"
         context="*[hl7:observationMedia[hl7:templateId[@root = '1.2.40.0.34.6.0.11.3.53']]]/hl7:observationMedia[hl7:templateId[@root = '1.2.40.0.34.6.0.11.3.53']]/hl7:participant[@typeCode][hl7:participantRole]/hl7:participantRole/hl7:playingEntity/*[not(@xsi:nil = 'true')][not(self::hl7:code | self::hl7:quantity | self::hl7:name | self::sdtc:birthTime | self::hl7:desc)]"
         id="d1776282e80-true-d1776688e0">
      <assert role="error"
              see="https://elga.art-decor.org/at-lab-html-20250116T124017/tmp-1.2.40.0.34.6.0.11.3.53-2021-06-28T110849.html"
              test="not(.)">(atcdabbr_entry_Logo)/d1776282e80-true-d1776688e0: '<value-of select="name(..)"/>' ist als geschlossen definiert und dieses Element '<name/>' ist nicht erlaubt oder nicht mit diesem Inhalt erlaubt. Dies kann templateId, code oder id betreffen. Erwartet:  hl7:code | hl7:quantity | hl7:name | sdtc:birthTime | hl7:desc (rule-reference: d1776282e80-true-d1776688e0)</assert>
   </rule>

   <!-- Checking undefined contents for template/element @isClosed="true". Match context that we did not already match -->
   <rule fpi="RUL-QQQ"
         context="*[hl7:observationMedia[hl7:templateId[@root = '1.2.40.0.34.6.0.11.3.53']]]/hl7:observationMedia[hl7:templateId[@root = '1.2.40.0.34.6.0.11.3.53']]/hl7:participant[@typeCode][hl7:participantRole]/hl7:participantRole/hl7:scopingEntity/*[not(@xsi:nil = 'true')][not(self::hl7:id | self::hl7:code | self::hl7:desc)]"
         id="d1776282e83-true-d1776746e0">
      <assert role="error"
              see="https://elga.art-decor.org/at-lab-html-20250116T124017/tmp-1.2.40.0.34.6.0.11.3.53-2021-06-28T110849.html"
              test="not(.)">(atcdabbr_entry_Logo)/d1776282e83-true-d1776746e0: '<value-of select="name(..)"/>' ist als geschlossen definiert und dieses Element '<name/>' ist nicht erlaubt oder nicht mit diesem Inhalt erlaubt. Dies kann templateId, code oder id betreffen. Erwartet:  hl7:id | hl7:code | hl7:desc (rule-reference: d1776282e83-true-d1776746e0)</assert>
   </rule>
</pattern>
