<?xml version="1.0" encoding="UTF-8"?>
<!--
Template derived pattern
===========================================
ID: 1.2.40.0.34.6.0.11.2.8
Name: Übersetzung
Description: 
-->
<pattern xmlns="http://purl.oclc.org/dsdl/schematron"
         id="template-1.2.40.0.34.6.0.11.2.8-2023-04-13T110152-closed">
   <title>Übersetzung</title>

   <!-- Checking undefined contents for template/element @isClosed="true". Match context that we did not already match -->
   <rule fpi="RUL-QQQ"
         context="*[hl7:section[hl7:templateId[@root = '1.2.40.0.34.6.0.11.2.8']]]/*[not(@xsi:nil = 'true')][not(self::hl7:section[hl7:templateId[@root = '1.2.40.0.34.6.0.11.2.8']])]"
         id="d42e19002-true-d1326099e0">
      <assert role="error"
              see="https://elga.art-decor.org/at-lab-html-20250116T124017/tmp-1.2.40.0.34.6.0.11.2.8-2023-04-13T110152.html"
              test="not(.)">(atcdabbr_section_Uebersetzung)/d42e19002-true-d1326099e0: '<value-of select="name(..)"/>' ist als geschlossen definiert und dieses Element '<name/>' ist nicht erlaubt oder nicht mit diesem Inhalt erlaubt. Dies kann templateId, code oder id betreffen. Erwartet:  hl7:section[hl7:templateId[@root = '1.2.40.0.34.6.0.11.2.8']] (rule-reference: d42e19002-true-d1326099e0)</assert>
   </rule>

   <!-- Checking undefined contents for template/element @isClosed="true". Match context that we did not already match -->
   <rule fpi="RUL-QQQ"
         context="*[hl7:section[hl7:templateId[@root = '1.2.40.0.34.6.0.11.2.8']]]/hl7:section[hl7:templateId[@root = '1.2.40.0.34.6.0.11.2.8']]/*[not(@xsi:nil = 'true')][not(self::hl7:templateId[@root = '1.2.40.0.34.6.0.11.2.8'] | self::hl7:id[not(@nullFlavor)] | self::hl7:title[not(@nullFlavor)] | self::hl7:text[not(@nullFlavor)] | self::hl7:languageCode[@code = doc('include/voc-1.2.40.0.34.10.173-DYNAMIC.xml')//valueSet[1]/conceptList/*/@code] | self::hl7:author[hl7:assignedAuthor] | self::hl7:informant)]"
         id="d42e19212-true-d1326412e0">
      <assert role="error"
              see="https://elga.art-decor.org/at-lab-html-20250116T124017/tmp-1.2.40.0.34.6.0.11.2.8-2023-04-13T110152.html"
              test="not(.)">(atcdabbr_section_Uebersetzung)/d42e19212-true-d1326412e0: '<value-of select="name(..)"/>' ist als geschlossen definiert und dieses Element '<name/>' ist nicht erlaubt oder nicht mit diesem Inhalt erlaubt. Dies kann templateId, code oder id betreffen. Erwartet:  hl7:templateId[@root = '1.2.40.0.34.6.0.11.2.8'] | hl7:id[not(@nullFlavor)] | hl7:title[not(@nullFlavor)] | hl7:text[not(@nullFlavor)] | hl7:languageCode[@code = doc('include/voc-1.2.40.0.34.10.173-DYNAMIC.xml')//valueSet[1]/conceptList/*/@code] | hl7:author[hl7:assignedAuthor] | hl7:informant (rule-reference: d42e19212-true-d1326412e0)</assert>
   </rule>

   <!-- Checking undefined contents for template/element @isClosed="true". Match context that we did not already match -->
   <rule fpi="RUL-QQQ"
         context="*[hl7:section[hl7:templateId[@root = '1.2.40.0.34.6.0.11.2.8']]]/hl7:section[hl7:templateId[@root = '1.2.40.0.34.6.0.11.2.8']]/hl7:author[hl7:assignedAuthor]/*[not(@xsi:nil = 'true')][not(self::hl7:functionCode | self::hl7:time[not(@nullFlavor)] | self::hl7:time[@nullFlavor='UNK'] | self::hl7:assignedAuthor)]"
         id="d42e19263-true-d1326566e0">
      <assert role="error"
              see="https://elga.art-decor.org/at-lab-html-20250116T124017/tmp-1.2.40.0.34.6.0.11.2.8-2023-04-13T110152.html"
              test="not(.)">(atcdabbr_section_Uebersetzung)/d42e19263-true-d1326566e0: '<value-of select="name(..)"/>' ist als geschlossen definiert und dieses Element '<name/>' ist nicht erlaubt oder nicht mit diesem Inhalt erlaubt. Dies kann templateId, code oder id betreffen. Erwartet:  hl7:functionCode | hl7:time[not(@nullFlavor)] | hl7:time[@nullFlavor='UNK'] | hl7:assignedAuthor (rule-reference: d42e19263-true-d1326566e0)</assert>
   </rule>

   <!-- Checking undefined contents for template/element @isClosed="true". Match context that we did not already match -->
   <rule fpi="RUL-QQQ"
         context="*[hl7:section[hl7:templateId[@root = '1.2.40.0.34.6.0.11.2.8']]]/hl7:section[hl7:templateId[@root = '1.2.40.0.34.6.0.11.2.8']]/hl7:author[hl7:assignedAuthor]/hl7:assignedAuthor/*[not(@xsi:nil = 'true')][not(self::hl7:id[not(@nullFlavor)] | self::hl7:id[@nullFlavor='UNK'] | self::hl7:code[not(@nullFlavor)] | self::hl7:addr[not(@nullFlavor)] | self::hl7:telecom[not(@nullFlavor)] | self::hl7:assignedPerson | self::hl7:assignedAuthoringDevice | self::hl7:representedOrganization)]"
         id="d1326444e45-true-d1326674e0">
      <assert role="error"
              see="https://elga.art-decor.org/at-lab-html-20250116T124017/tmp-1.2.40.0.34.6.0.11.2.8-2023-04-13T110152.html"
              test="not(.)">(atcdabbr_section_Uebersetzung)/d1326444e45-true-d1326674e0: '<value-of select="name(..)"/>' ist als geschlossen definiert und dieses Element '<name/>' ist nicht erlaubt oder nicht mit diesem Inhalt erlaubt. Dies kann templateId, code oder id betreffen. Erwartet:  hl7:id[not(@nullFlavor)] | hl7:id[@nullFlavor='UNK'] | hl7:code[not(@nullFlavor)] | hl7:addr[not(@nullFlavor)] | hl7:telecom[not(@nullFlavor)] | hl7:assignedPerson | hl7:assignedAuthoringDevice | hl7:representedOrganization (rule-reference: d1326444e45-true-d1326674e0)</assert>
   </rule>

   <!-- Checking undefined contents for template/element @isClosed="true". Match context that we did not already match -->
   <rule fpi="RUL-QQQ"
         context="*[hl7:section[hl7:templateId[@root = '1.2.40.0.34.6.0.11.2.8']]]/hl7:section[hl7:templateId[@root = '1.2.40.0.34.6.0.11.2.8']]/hl7:author[hl7:assignedAuthor]/hl7:assignedAuthor/hl7:addr[not(@nullFlavor)]/*[not(@xsi:nil = 'true')][not(self::hl7:streetAddressLine | self::hl7:streetName | self::hl7:houseNumber | self::hl7:postalCode[not(@nullFlavor)] | self::hl7:city[not(@nullFlavor)] | self::hl7:state | self::hl7:country[not(@nullFlavor)] | self::hl7:additionalLocator)]"
         id="d1326444e64-true-d1326733e0">
      <assert role="error"
              see="https://elga.art-decor.org/at-lab-html-20250116T124017/tmp-1.2.40.0.34.6.0.11.2.8-2023-04-13T110152.html"
              test="not(.)">(atcdabbr_section_Uebersetzung)/d1326444e64-true-d1326733e0: '<value-of select="name(..)"/>' ist als geschlossen definiert und dieses Element '<name/>' ist nicht erlaubt oder nicht mit diesem Inhalt erlaubt. Dies kann templateId, code oder id betreffen. Erwartet:  hl7:streetAddressLine | hl7:streetName | hl7:houseNumber | hl7:postalCode[not(@nullFlavor)] | hl7:city[not(@nullFlavor)] | hl7:state | hl7:country[not(@nullFlavor)] | hl7:additionalLocator (rule-reference: d1326444e64-true-d1326733e0)</assert>
   </rule>

   <!-- Checking undefined contents for template/element @isClosed="true". Match context that we did not already match -->
   <rule fpi="RUL-QQQ"
         context="*[hl7:section[hl7:templateId[@root = '1.2.40.0.34.6.0.11.2.8']]]/hl7:section[hl7:templateId[@root = '1.2.40.0.34.6.0.11.2.8']]/hl7:author[hl7:assignedAuthor]/hl7:assignedAuthor/hl7:assignedPerson/*[not(@xsi:nil = 'true')][not(self::hl7:name[not(@nullFlavor)] | self::hl7:name[@nullFlavor='UNK'] | self::hl7:name[@nullFlavor='MSK'])]"
         id="d1326444e110-true-d1326790e0">
      <assert role="error"
              see="https://elga.art-decor.org/at-lab-html-20250116T124017/tmp-1.2.40.0.34.6.0.11.2.8-2023-04-13T110152.html"
              test="not(.)">(atcdabbr_section_Uebersetzung)/d1326444e110-true-d1326790e0: '<value-of select="name(..)"/>' ist als geschlossen definiert und dieses Element '<name/>' ist nicht erlaubt oder nicht mit diesem Inhalt erlaubt. Dies kann templateId, code oder id betreffen. Erwartet:  hl7:name[not(@nullFlavor)] | hl7:name[@nullFlavor='UNK'] | hl7:name[@nullFlavor='MSK'] (rule-reference: d1326444e110-true-d1326790e0)</assert>
   </rule>

   <!-- Checking undefined contents for template/element @isClosed="true". Match context that we did not already match -->
   <rule fpi="RUL-QQQ"
         context="*[hl7:section[hl7:templateId[@root = '1.2.40.0.34.6.0.11.2.8']]]/hl7:section[hl7:templateId[@root = '1.2.40.0.34.6.0.11.2.8']]/hl7:author[hl7:assignedAuthor]/hl7:assignedAuthor/hl7:assignedPerson/hl7:name[not(@nullFlavor)]/*[not(@xsi:nil = 'true')][not(self::hl7:prefix | self::hl7:family[not(@nullFlavor)] | self::hl7:given[not(@nullFlavor)] | self::hl7:suffix)]"
         id="d1326794e92-true-d1326824e0">
      <assert role="error"
              see="https://elga.art-decor.org/at-lab-html-20250116T124017/tmp-1.2.40.0.34.6.0.11.9.6-2023-03-31T111555.html"
              test="not(.)">(atcdabbr_other_PersonNameCompilationG2)/d1326794e92-true-d1326824e0: '<value-of select="name(..)"/>' ist als geschlossen definiert und dieses Element '<name/>' ist nicht erlaubt oder nicht mit diesem Inhalt erlaubt. Dies kann templateId, code oder id betreffen. Erwartet:  hl7:prefix | hl7:family[not(@nullFlavor)] | hl7:given[not(@nullFlavor)] | hl7:suffix (rule-reference: d1326794e92-true-d1326824e0)</assert>
   </rule>

   <!-- Checking undefined contents for template/element @isClosed="true". Match context that we did not already match -->
   <rule fpi="RUL-QQQ"
         context="*[hl7:section[hl7:templateId[@root = '1.2.40.0.34.6.0.11.2.8']]]/hl7:section[hl7:templateId[@root = '1.2.40.0.34.6.0.11.2.8']]/hl7:author[hl7:assignedAuthor]/hl7:assignedAuthor/hl7:assignedAuthoringDevice/*[not(@xsi:nil = 'true')][not(self::hl7:manufacturerModelName[not(@nullFlavor)] | self::hl7:softwareName[not(@nullFlavor)])]"
         id="d1326444e133-true-d1326872e0">
      <assert role="error"
              see="https://elga.art-decor.org/at-lab-html-20250116T124017/tmp-1.2.40.0.34.6.0.11.2.8-2023-04-13T110152.html"
              test="not(.)">(atcdabbr_section_Uebersetzung)/d1326444e133-true-d1326872e0: '<value-of select="name(..)"/>' ist als geschlossen definiert und dieses Element '<name/>' ist nicht erlaubt oder nicht mit diesem Inhalt erlaubt. Dies kann templateId, code oder id betreffen. Erwartet:  hl7:manufacturerModelName[not(@nullFlavor)] | hl7:softwareName[not(@nullFlavor)] (rule-reference: d1326444e133-true-d1326872e0)</assert>
   </rule>

   <!-- Checking undefined contents for template/element @isClosed="true". Match context that we did not already match -->
   <rule fpi="RUL-QQQ"
         context="*[hl7:section[hl7:templateId[@root = '1.2.40.0.34.6.0.11.2.8']]]/hl7:section[hl7:templateId[@root = '1.2.40.0.34.6.0.11.2.8']]/hl7:author[hl7:assignedAuthor]/hl7:assignedAuthor/hl7:representedOrganization/*[not(@xsi:nil = 'true')][not(self::hl7:id[not(@nullFlavor)] | self::hl7:name[not(@nullFlavor)] | self::hl7:telecom[not(@nullFlavor)] | self::hl7:addr[not(@nullFlavor)])]"
         id="d1326444e149-true-d1326917e0">
      <assert role="error"
              see="https://elga.art-decor.org/at-lab-html-20250116T124017/tmp-1.2.40.0.34.6.0.11.2.8-2023-04-13T110152.html"
              test="not(.)">(atcdabbr_section_Uebersetzung)/d1326444e149-true-d1326917e0: '<value-of select="name(..)"/>' ist als geschlossen definiert und dieses Element '<name/>' ist nicht erlaubt oder nicht mit diesem Inhalt erlaubt. Dies kann templateId, code oder id betreffen. Erwartet:  hl7:id[not(@nullFlavor)] | hl7:name[not(@nullFlavor)] | hl7:telecom[not(@nullFlavor)] | hl7:addr[not(@nullFlavor)] (rule-reference: d1326444e149-true-d1326917e0)</assert>
   </rule>

   <!-- Checking undefined contents for template/element @isClosed="true". Match context that we did not already match -->
   <rule fpi="RUL-QQQ"
         context="*[hl7:section[hl7:templateId[@root = '1.2.40.0.34.6.0.11.2.8']]]/hl7:section[hl7:templateId[@root = '1.2.40.0.34.6.0.11.2.8']]/hl7:author[hl7:assignedAuthor]/hl7:assignedAuthor/hl7:representedOrganization/hl7:addr[not(@nullFlavor)]/*[not(@xsi:nil = 'true')][not(self::hl7:streetAddressLine | self::hl7:streetName | self::hl7:houseNumber | self::hl7:postalCode[not(@nullFlavor)] | self::hl7:city[not(@nullFlavor)] | self::hl7:state | self::hl7:country[not(@nullFlavor)] | self::hl7:additionalLocator)]"
         id="d1326887e67-true-d1326980e0">
      <assert role="error"
              see="https://elga.art-decor.org/at-lab-html-20250116T124017/tmp-1.2.40.0.34.6.0.11.2.8-2023-04-13T110152.html"
              test="not(.)">(atcdabbr_section_Uebersetzung)/d1326887e67-true-d1326980e0: '<value-of select="name(..)"/>' ist als geschlossen definiert und dieses Element '<name/>' ist nicht erlaubt oder nicht mit diesem Inhalt erlaubt. Dies kann templateId, code oder id betreffen. Erwartet:  hl7:streetAddressLine | hl7:streetName | hl7:houseNumber | hl7:postalCode[not(@nullFlavor)] | hl7:city[not(@nullFlavor)] | hl7:state | hl7:country[not(@nullFlavor)] | hl7:additionalLocator (rule-reference: d1326887e67-true-d1326980e0)</assert>
   </rule>

   <!-- Checking undefined contents for template/element @isClosed="true". Match context that we did not already match -->
   <rule fpi="RUL-QQQ"
         context="*[hl7:section[hl7:templateId[@root = '1.2.40.0.34.6.0.11.2.8']]]/hl7:section[hl7:templateId[@root = '1.2.40.0.34.6.0.11.2.8']]/hl7:informant/*[not(@xsi:nil = 'true')][not(self::hl7:assignedEntity | self::hl7:relatedEntity[@classCode = 'PRS'])]"
         id="d42e19269-true-d1327148e0">
      <assert role="error"
              see="https://elga.art-decor.org/at-lab-html-20250116T124017/tmp-1.2.40.0.34.6.0.11.2.8-2023-04-13T110152.html"
              test="not(.)">(atcdabbr_section_Uebersetzung)/d42e19269-true-d1327148e0: '<value-of select="name(..)"/>' ist als geschlossen definiert und dieses Element '<name/>' ist nicht erlaubt oder nicht mit diesem Inhalt erlaubt. Dies kann templateId, code oder id betreffen. Erwartet:  hl7:assignedEntity | hl7:relatedEntity[@classCode = 'PRS'] (rule-reference: d42e19269-true-d1327148e0)</assert>
   </rule>

   <!-- Checking undefined contents for template/element @isClosed="true". Match context that we did not already match -->
   <rule fpi="RUL-QQQ"
         context="*[hl7:section[hl7:templateId[@root = '1.2.40.0.34.6.0.11.2.8']]]/hl7:section[hl7:templateId[@root = '1.2.40.0.34.6.0.11.2.8']]/hl7:informant/hl7:assignedEntity/*[not(@xsi:nil = 'true')][not(self::hl7:id[not(@nullFlavor)] | self::hl7:id[@nullFlavor='NI'] | self::hl7:id[@nullFlavor='UNK'] | self::hl7:code | self::hl7:addr | self::hl7:telecom | self::hl7:assignedPerson | self::hl7:assignedPerson | self::hl7:representedOrganization)]"
         id="d1327025e5-true-d1327280e0">
      <assert role="error"
              see="https://elga.art-decor.org/at-lab-html-20250116T124017/tmp-1.2.40.0.34.6.0.11.2.8-2023-04-13T110152.html"
              test="not(.)">(atcdabbr_section_Uebersetzung)/d1327025e5-true-d1327280e0: '<value-of select="name(..)"/>' ist als geschlossen definiert und dieses Element '<name/>' ist nicht erlaubt oder nicht mit diesem Inhalt erlaubt. Dies kann templateId, code oder id betreffen. Erwartet:  hl7:id[not(@nullFlavor)] | hl7:id[@nullFlavor='NI'] | hl7:id[@nullFlavor='UNK'] | hl7:code | hl7:addr | hl7:telecom | hl7:assignedPerson | hl7:assignedPerson | hl7:representedOrganization (rule-reference: d1327025e5-true-d1327280e0)</assert>
   </rule>

   <!-- Checking undefined contents for template/element @isClosed="true". Match context that we did not already match -->
   <rule fpi="RUL-QQQ"
         context="*[hl7:section[hl7:templateId[@root = '1.2.40.0.34.6.0.11.2.8']]]/hl7:section[hl7:templateId[@root = '1.2.40.0.34.6.0.11.2.8']]/hl7:informant/hl7:assignedEntity/hl7:addr/*[not(@xsi:nil = 'true')][not(self::hl7:streetAddressLine | self::hl7:streetName | self::hl7:houseNumber | self::hl7:postalCode | self::hl7:city | self::hl7:state | self::hl7:country | self::hl7:additionalLocator)]"
         id="d1327153e50-true-d1327346e0">
      <assert role="error"
              see="https://elga.art-decor.org/at-lab-html-20250116T124017/tmp-1.2.40.0.34.6.0.11.2.8-2023-04-13T110152.html"
              test="not(.)">(atcdabbr_section_Uebersetzung)/d1327153e50-true-d1327346e0: '<value-of select="name(..)"/>' ist als geschlossen definiert und dieses Element '<name/>' ist nicht erlaubt oder nicht mit diesem Inhalt erlaubt. Dies kann templateId, code oder id betreffen. Erwartet:  hl7:streetAddressLine | hl7:streetName | hl7:houseNumber | hl7:postalCode | hl7:city | hl7:state | hl7:country | hl7:additionalLocator (rule-reference: d1327153e50-true-d1327346e0)</assert>
   </rule>

   <!-- Checking undefined contents for template/element @isClosed="true". Match context that we did not already match -->
   <rule fpi="RUL-QQQ"
         context="*[hl7:section[hl7:templateId[@root = '1.2.40.0.34.6.0.11.2.8']]]/hl7:section[hl7:templateId[@root = '1.2.40.0.34.6.0.11.2.8']]/hl7:informant/hl7:assignedEntity/hl7:assignedPerson/*[not(@xsi:nil = 'true')][not(self::hl7:name[not(@nullFlavor)])]"
         id="d1327153e120-true-d1327408e0">
      <assert role="error"
              see="https://elga.art-decor.org/at-lab-html-20250116T124017/tmp-1.2.40.0.34.6.0.11.2.8-2023-04-13T110152.html"
              test="not(.)">(atcdabbr_section_Uebersetzung)/d1327153e120-true-d1327408e0: '<value-of select="name(..)"/>' ist als geschlossen definiert und dieses Element '<name/>' ist nicht erlaubt oder nicht mit diesem Inhalt erlaubt. Dies kann templateId, code oder id betreffen. Erwartet:  hl7:name[not(@nullFlavor)] (rule-reference: d1327153e120-true-d1327408e0)</assert>
   </rule>

   <!-- Checking undefined contents for template/element @isClosed="true". Match context that we did not already match -->
   <rule fpi="RUL-QQQ"
         context="*[hl7:section[hl7:templateId[@root = '1.2.40.0.34.6.0.11.2.8']]]/hl7:section[hl7:templateId[@root = '1.2.40.0.34.6.0.11.2.8']]/hl7:informant/hl7:assignedEntity/hl7:assignedPerson/*[not(@xsi:nil = 'true')][not(self::hl7:name[not(@nullFlavor)])]"
         id="d1327153e132-true-d1327430e0">
      <assert role="error"
              see="https://elga.art-decor.org/at-lab-html-20250116T124017/tmp-1.2.40.0.34.6.0.11.2.8-2023-04-13T110152.html"
              test="not(.)">(atcdabbr_section_Uebersetzung)/d1327153e132-true-d1327430e0: '<value-of select="name(..)"/>' ist als geschlossen definiert und dieses Element '<name/>' ist nicht erlaubt oder nicht mit diesem Inhalt erlaubt. Dies kann templateId, code oder id betreffen. Erwartet:  hl7:name[not(@nullFlavor)] (rule-reference: d1327153e132-true-d1327430e0)</assert>
   </rule>

   <!-- Checking undefined contents for template/element @isClosed="true". Match context that we did not already match -->
   <rule fpi="RUL-QQQ"
         context="*[hl7:section[hl7:templateId[@root = '1.2.40.0.34.6.0.11.2.8']]]/hl7:section[hl7:templateId[@root = '1.2.40.0.34.6.0.11.2.8']]/hl7:informant/hl7:assignedEntity/hl7:assignedPerson/hl7:name[not(@nullFlavor)]/*[not(@xsi:nil = 'true')][not(self::hl7:prefix | self::hl7:family[not(@nullFlavor)] | self::hl7:given[not(@nullFlavor)] | self::hl7:suffix)]"
         id="d1327418e12-true-d1327459e0">
      <assert role="error"
              see="https://elga.art-decor.org/at-lab-html-20250116T124017/tmp-1.2.40.0.34.6.0.11.2.8-2023-04-13T110152.html"
              test="not(.)">(atcdabbr_section_Uebersetzung)/d1327418e12-true-d1327459e0: '<value-of select="name(..)"/>' ist als geschlossen definiert und dieses Element '<name/>' ist nicht erlaubt oder nicht mit diesem Inhalt erlaubt. Dies kann templateId, code oder id betreffen. Erwartet:  hl7:prefix | hl7:family[not(@nullFlavor)] | hl7:given[not(@nullFlavor)] | hl7:suffix (rule-reference: d1327418e12-true-d1327459e0)</assert>
   </rule>

   <!-- Checking undefined contents for template/element @isClosed="true". Match context that we did not already match -->
   <rule fpi="RUL-QQQ"
         context="*[hl7:section[hl7:templateId[@root = '1.2.40.0.34.6.0.11.2.8']]]/hl7:section[hl7:templateId[@root = '1.2.40.0.34.6.0.11.2.8']]/hl7:informant/hl7:assignedEntity/hl7:representedOrganization/*[not(@xsi:nil = 'true')][not(self::hl7:id[not(@nullFlavor)] | self::hl7:name[not(@nullFlavor)] | self::hl7:telecom[not(@nullFlavor)] | self::hl7:addr[not(@nullFlavor)])]"
         id="d1327153e143-true-d1327510e0">
      <assert role="error"
              see="https://elga.art-decor.org/at-lab-html-20250116T124017/tmp-1.2.40.0.34.6.0.11.2.8-2023-04-13T110152.html"
              test="not(.)">(atcdabbr_section_Uebersetzung)/d1327153e143-true-d1327510e0: '<value-of select="name(..)"/>' ist als geschlossen definiert und dieses Element '<name/>' ist nicht erlaubt oder nicht mit diesem Inhalt erlaubt. Dies kann templateId, code oder id betreffen. Erwartet:  hl7:id[not(@nullFlavor)] | hl7:name[not(@nullFlavor)] | hl7:telecom[not(@nullFlavor)] | hl7:addr[not(@nullFlavor)] (rule-reference: d1327153e143-true-d1327510e0)</assert>
   </rule>

   <!-- Checking undefined contents for template/element @isClosed="true". Match context that we did not already match -->
   <rule fpi="RUL-QQQ"
         context="*[hl7:section[hl7:templateId[@root = '1.2.40.0.34.6.0.11.2.8']]]/hl7:section[hl7:templateId[@root = '1.2.40.0.34.6.0.11.2.8']]/hl7:informant/hl7:assignedEntity/hl7:representedOrganization/hl7:addr[not(@nullFlavor)]/*[not(@xsi:nil = 'true')][not(self::hl7:streetAddressLine | self::hl7:streetName | self::hl7:houseNumber | self::hl7:postalCode | self::hl7:city | self::hl7:state | self::hl7:country | self::hl7:additionalLocator)]"
         id="d1327484e58-true-d1327571e0">
      <assert role="error"
              see="https://elga.art-decor.org/at-lab-html-20250116T124017/tmp-1.2.40.0.34.6.0.11.2.8-2023-04-13T110152.html"
              test="not(.)">(atcdabbr_section_Uebersetzung)/d1327484e58-true-d1327571e0: '<value-of select="name(..)"/>' ist als geschlossen definiert und dieses Element '<name/>' ist nicht erlaubt oder nicht mit diesem Inhalt erlaubt. Dies kann templateId, code oder id betreffen. Erwartet:  hl7:streetAddressLine | hl7:streetName | hl7:houseNumber | hl7:postalCode | hl7:city | hl7:state | hl7:country | hl7:additionalLocator (rule-reference: d1327484e58-true-d1327571e0)</assert>
   </rule>

   <!-- Checking undefined contents for template/element @isClosed="true". Match context that we did not already match -->
   <rule fpi="RUL-QQQ"
         context="*[hl7:section[hl7:templateId[@root = '1.2.40.0.34.6.0.11.2.8']]]/hl7:section[hl7:templateId[@root = '1.2.40.0.34.6.0.11.2.8']]/hl7:informant/hl7:relatedEntity[@classCode = 'PRS']/*[not(@xsi:nil = 'true')][not(self::hl7:code[not(@nullFlavor)] | self::hl7:addr[not(@nullFlavor)] | self::hl7:telecom[not(@nullFlavor)] | self::hl7:relatedPerson)]"
         id="d1327025e7-true-d1327648e0">
      <assert role="error"
              see="https://elga.art-decor.org/at-lab-html-20250116T124017/tmp-1.2.40.0.34.6.0.11.2.8-2023-04-13T110152.html"
              test="not(.)">(atcdabbr_section_Uebersetzung)/d1327025e7-true-d1327648e0: '<value-of select="name(..)"/>' ist als geschlossen definiert und dieses Element '<name/>' ist nicht erlaubt oder nicht mit diesem Inhalt erlaubt. Dies kann templateId, code oder id betreffen. Erwartet:  hl7:code[not(@nullFlavor)] | hl7:addr[not(@nullFlavor)] | hl7:telecom[not(@nullFlavor)] | hl7:relatedPerson (rule-reference: d1327025e7-true-d1327648e0)</assert>
   </rule>

   <!-- Checking undefined contents for template/element @isClosed="true". Match context that we did not already match -->
   <rule fpi="RUL-QQQ"
         context="*[hl7:section[hl7:templateId[@root = '1.2.40.0.34.6.0.11.2.8']]]/hl7:section[hl7:templateId[@root = '1.2.40.0.34.6.0.11.2.8']]/hl7:informant/hl7:relatedEntity[@classCode = 'PRS']/hl7:addr[not(@nullFlavor)]/*[not(@xsi:nil = 'true')][not(self::hl7:streetAddressLine | self::hl7:streetName | self::hl7:houseNumber | self::hl7:postalCode | self::hl7:city | self::hl7:state | self::hl7:country | self::hl7:additionalLocator)]"
         id="d1327025e16-true-d1327701e0">
      <assert role="error"
              see="https://elga.art-decor.org/at-lab-html-20250116T124017/tmp-1.2.40.0.34.6.0.11.2.8-2023-04-13T110152.html"
              test="not(.)">(atcdabbr_section_Uebersetzung)/d1327025e16-true-d1327701e0: '<value-of select="name(..)"/>' ist als geschlossen definiert und dieses Element '<name/>' ist nicht erlaubt oder nicht mit diesem Inhalt erlaubt. Dies kann templateId, code oder id betreffen. Erwartet:  hl7:streetAddressLine | hl7:streetName | hl7:houseNumber | hl7:postalCode | hl7:city | hl7:state | hl7:country | hl7:additionalLocator (rule-reference: d1327025e16-true-d1327701e0)</assert>
   </rule>

   <!-- Checking undefined contents for template/element @isClosed="true". Match context that we did not already match -->
   <rule fpi="RUL-QQQ"
         context="*[hl7:section[hl7:templateId[@root = '1.2.40.0.34.6.0.11.2.8']]]/hl7:section[hl7:templateId[@root = '1.2.40.0.34.6.0.11.2.8']]/hl7:informant/hl7:relatedEntity[@classCode = 'PRS']/hl7:relatedPerson/*[not(@xsi:nil = 'true')][not(self::hl7:name[not(@nullFlavor)] | self::hl7:name[@nullFlavor='UNK'] | self::hl7:name[@nullFlavor='MSK'])]"
         id="d1327025e20-true-d1327756e0">
      <assert role="error"
              see="https://elga.art-decor.org/at-lab-html-20250116T124017/tmp-1.2.40.0.34.6.0.11.2.8-2023-04-13T110152.html"
              test="not(.)">(atcdabbr_section_Uebersetzung)/d1327025e20-true-d1327756e0: '<value-of select="name(..)"/>' ist als geschlossen definiert und dieses Element '<name/>' ist nicht erlaubt oder nicht mit diesem Inhalt erlaubt. Dies kann templateId, code oder id betreffen. Erwartet:  hl7:name[not(@nullFlavor)] | hl7:name[@nullFlavor='UNK'] | hl7:name[@nullFlavor='MSK'] (rule-reference: d1327025e20-true-d1327756e0)</assert>
   </rule>

   <!-- Checking undefined contents for template/element @isClosed="true". Match context that we did not already match -->
   <rule fpi="RUL-QQQ"
         context="*[hl7:section[hl7:templateId[@root = '1.2.40.0.34.6.0.11.2.8']]]/hl7:section[hl7:templateId[@root = '1.2.40.0.34.6.0.11.2.8']]/hl7:informant/hl7:relatedEntity[@classCode = 'PRS']/hl7:relatedPerson/hl7:name[not(@nullFlavor)]/*[not(@xsi:nil = 'true')][not(self::hl7:prefix | self::hl7:family[not(@nullFlavor)] | self::hl7:given[not(@nullFlavor)] | self::hl7:suffix)]"
         id="d1327749e10-true-d1327783e0">
      <assert role="error"
              see="https://elga.art-decor.org/at-lab-html-20250116T124017/tmp-1.2.40.0.34.6.0.11.2.8-2023-04-13T110152.html"
              test="not(.)">(atcdabbr_section_Uebersetzung)/d1327749e10-true-d1327783e0: '<value-of select="name(..)"/>' ist als geschlossen definiert und dieses Element '<name/>' ist nicht erlaubt oder nicht mit diesem Inhalt erlaubt. Dies kann templateId, code oder id betreffen. Erwartet:  hl7:prefix | hl7:family[not(@nullFlavor)] | hl7:given[not(@nullFlavor)] | hl7:suffix (rule-reference: d1327749e10-true-d1327783e0)</assert>
   </rule>
</pattern>
