<?xml version="1.0" encoding="UTF-8"?>
<!-- 
    DTR1 CE.EPSOS - Coded String with Equivalents
    Status: draft
-->
<rule xmlns="http://purl.oclc.org/dsdl/schematron"
      abstract="true"
      id="CE.EPSOS">
    <extends rule="CD.EPSOS"/>
    
    <assert role="error"
           test="not(hl7:qualifier)"
           see="https://docs.art-decor.org/documentation/datatypes/DTr1_CE.EPSOS">dtr1-1-CE.EPSOS: cannot have qualifier</assert>
</rule>
