<?xml version="1.0" encoding="UTF-8"?>
<!--
Template derived pattern
===========================================
ID: 1.2.40.0.34.6.0.11.3.20
Name: Expositionsrisiko Problem Concern Entry
Description: Angabe der Indikation für eine bestimmte Impfung (entsprechend der Patienten- oder Indikationsgruppe(n). Das  effectiveTime.low -Element trägt die Information, ab wann die Indikation eingetragen wurde und damit zu berücksichtigen ist, das  effectiveTime.high -Element den Zeitpunkt, wenn die Indikation nicht mehr zu berücksichtigen ist
                (zugleich wird  statusCode  "completed" gesetzt). Anmerkung: Es ist  nicht  vorgesehen, Kontraindikationen zu dokumentieren. 
-->
<pattern xmlns="http://purl.oclc.org/dsdl/schematron"
         id="template-1.2.40.0.34.6.0.11.3.20-2019-05-29T150252-closed">
   <title>Expositionsrisiko Problem Concern Entry</title>

   <!-- Checking undefined contents for template/element @isClosed="true". Match context that we did not already match -->
   <rule fpi="RUL-QQQ"
         context="*[hl7:act[hl7:templateId[@root = '1.2.40.0.34.6.0.11.3.20'] and hl7:templateId[@root = '2.16.840.1.113883.10.20.1.27'] and hl7:templateId[@root = '1.3.6.1.4.1.19376.1.5.3.1.4.5.1'] and hl7:templateId[@root = '1.3.6.1.4.1.19376.1.5.3.1.4.5.2']]]/*[not(@xsi:nil = 'true')][not(self::hl7:act[hl7:templateId[@root = '1.2.40.0.34.6.0.11.3.20'] and hl7:templateId[@root = '2.16.840.1.113883.10.20.1.27'] and hl7:templateId[@root = '1.3.6.1.4.1.19376.1.5.3.1.4.5.1'] and hl7:templateId[@root = '1.3.6.1.4.1.19376.1.5.3.1.4.5.2']])]"
         id="d42e37857-true-d1358670e0">
      <assert role="error"
              see="http://elga.art-decor.org/elgaimpf-html-20250116T125121/tmp-1.2.40.0.34.6.0.11.3.20-2019-05-29T150252.html"
              test="not(.)">(atcdabbr_entry_ExpositionsrisikoProblemConcern)/d42e37857-true-d1358670e0: '<value-of select="name(..)"/>' ist als geschlossen definiert und dieses Element '<name/>' ist nicht erlaubt oder nicht mit diesem Inhalt erlaubt. Dies kann templateId, code oder id betreffen. Erwartet:  hl7:act[hl7:templateId[@root = '1.2.40.0.34.6.0.11.3.20'] and hl7:templateId[@root = '2.16.840.1.113883.10.20.1.27'] and hl7:templateId[@root = '1.3.6.1.4.1.19376.1.5.3.1.4.5.1'] and hl7:templateId[@root = '1.3.6.1.4.1.19376.1.5.3.1.4.5.2']] (rule-reference: d42e37857-true-d1358670e0)</assert>
   </rule>

   <!-- Checking undefined contents for template/element @isClosed="true". Match context that we did not already match -->
   <rule fpi="RUL-QQQ"
         context="*[hl7:act[hl7:templateId[@root = '1.2.40.0.34.6.0.11.3.20'] and hl7:templateId[@root = '2.16.840.1.113883.10.20.1.27'] and hl7:templateId[@root = '1.3.6.1.4.1.19376.1.5.3.1.4.5.1'] and hl7:templateId[@root = '1.3.6.1.4.1.19376.1.5.3.1.4.5.2']]]/hl7:act[hl7:templateId[@root = '1.2.40.0.34.6.0.11.3.20'] and hl7:templateId[@root = '2.16.840.1.113883.10.20.1.27'] and hl7:templateId[@root = '1.3.6.1.4.1.19376.1.5.3.1.4.5.1'] and hl7:templateId[@root = '1.3.6.1.4.1.19376.1.5.3.1.4.5.2']]/*[not(@xsi:nil = 'true')][not(self::hl7:templateId[@root = '1.2.40.0.34.6.0.11.3.20'] | self::hl7:templateId[@root = '2.16.840.1.113883.10.20.1.27'] | self::hl7:templateId[@root = '1.3.6.1.4.1.19376.1.5.3.1.4.5.1'] | self::hl7:templateId[@root = '1.3.6.1.4.1.19376.1.5.3.1.4.5.2'] | self::hl7:id[not(@nullFlavor)] | self::hl7:code[@nullFlavor = 'NA'] | self::hl7:statusCode[@code = 'active' or @code = 'completed'] | self::hl7:effectiveTime[not(@nullFlavor)] | self::hl7:author[hl7:assignedAuthor] | self::hl7:entryRelationship[@typeCode='SUBJ'][not(@nullFlavor)] | self::hl7:reference[hl7:externalDocument[hl7:templateId[@root = '1.2.40.0.34.6.0.11.3.14']]])]"
         id="d42e37958-true-d1358929e0">
      <assert role="error"
              see="http://elga.art-decor.org/elgaimpf-html-20250116T125121/tmp-1.2.40.0.34.6.0.11.3.20-2019-05-29T150252.html"
              test="not(.)">(atcdabbr_entry_ExpositionsrisikoProblemConcern)/d42e37958-true-d1358929e0: '<value-of select="name(..)"/>' ist als geschlossen definiert und dieses Element '<name/>' ist nicht erlaubt oder nicht mit diesem Inhalt erlaubt. Dies kann templateId, code oder id betreffen. Erwartet:  hl7:templateId[@root = '1.2.40.0.34.6.0.11.3.20'] | hl7:templateId[@root = '2.16.840.1.113883.10.20.1.27'] | hl7:templateId[@root = '1.3.6.1.4.1.19376.1.5.3.1.4.5.1'] | hl7:templateId[@root = '1.3.6.1.4.1.19376.1.5.3.1.4.5.2'] | hl7:id[not(@nullFlavor)] | hl7:code[@nullFlavor = 'NA'] | hl7:statusCode[@code = 'active' or @code = 'completed'] | hl7:effectiveTime[not(@nullFlavor)] | hl7:author[hl7:assignedAuthor] | hl7:entryRelationship[@typeCode='SUBJ'][not(@nullFlavor)] | hl7:reference[hl7:externalDocument[hl7:templateId[@root = '1.2.40.0.34.6.0.11.3.14']]] (rule-reference: d42e37958-true-d1358929e0)</assert>
   </rule>

   <!-- Checking undefined contents for template/element @isClosed="true". Match context that we did not already match -->
   <rule fpi="RUL-QQQ"
         context="*[hl7:act[hl7:templateId[@root = '1.2.40.0.34.6.0.11.3.20'] and hl7:templateId[@root = '2.16.840.1.113883.10.20.1.27'] and hl7:templateId[@root = '1.3.6.1.4.1.19376.1.5.3.1.4.5.1'] and hl7:templateId[@root = '1.3.6.1.4.1.19376.1.5.3.1.4.5.2']]]/hl7:act[hl7:templateId[@root = '1.2.40.0.34.6.0.11.3.20'] and hl7:templateId[@root = '2.16.840.1.113883.10.20.1.27'] and hl7:templateId[@root = '1.3.6.1.4.1.19376.1.5.3.1.4.5.1'] and hl7:templateId[@root = '1.3.6.1.4.1.19376.1.5.3.1.4.5.2']]/hl7:effectiveTime[not(@nullFlavor)]/*[not(@xsi:nil = 'true')][not(self::hl7:low[not(@nullFlavor)] | self::hl7:high)]"
         id="d42e38036-true-d1358988e0">
      <assert role="error"
              see="http://elga.art-decor.org/elgaimpf-html-20250116T125121/tmp-1.2.40.0.34.6.0.11.3.20-2019-05-29T150252.html"
              test="not(.)">(atcdabbr_entry_ExpositionsrisikoProblemConcern)/d42e38036-true-d1358988e0: '<value-of select="name(..)"/>' ist als geschlossen definiert und dieses Element '<name/>' ist nicht erlaubt oder nicht mit diesem Inhalt erlaubt. Dies kann templateId, code oder id betreffen. Erwartet:  hl7:low[not(@nullFlavor)] | hl7:high (rule-reference: d42e38036-true-d1358988e0)</assert>
   </rule>

   <!-- Checking undefined contents for template/element @isClosed="true". Match context that we did not already match -->
   <rule fpi="RUL-QQQ"
         context="*[hl7:act[hl7:templateId[@root = '1.2.40.0.34.6.0.11.3.20'] and hl7:templateId[@root = '2.16.840.1.113883.10.20.1.27'] and hl7:templateId[@root = '1.3.6.1.4.1.19376.1.5.3.1.4.5.1'] and hl7:templateId[@root = '1.3.6.1.4.1.19376.1.5.3.1.4.5.2']]]/hl7:act[hl7:templateId[@root = '1.2.40.0.34.6.0.11.3.20'] and hl7:templateId[@root = '2.16.840.1.113883.10.20.1.27'] and hl7:templateId[@root = '1.3.6.1.4.1.19376.1.5.3.1.4.5.1'] and hl7:templateId[@root = '1.3.6.1.4.1.19376.1.5.3.1.4.5.2']]/hl7:author[hl7:assignedAuthor]/*[not(@xsi:nil = 'true')][not(self::hl7:time[not(@nullFlavor)] | self::hl7:time[@nullFlavor='UNK'] | self::hl7:assignedAuthor)]"
         id="d42e38072-true-d1359120e0">
      <assert role="error"
              see="http://elga.art-decor.org/elgaimpf-html-20250116T125121/tmp-1.2.40.0.34.6.0.11.3.20-2019-05-29T150252.html"
              test="not(.)">(atcdabbr_entry_ExpositionsrisikoProblemConcern)/d42e38072-true-d1359120e0: '<value-of select="name(..)"/>' ist als geschlossen definiert und dieses Element '<name/>' ist nicht erlaubt oder nicht mit diesem Inhalt erlaubt. Dies kann templateId, code oder id betreffen. Erwartet:  hl7:time[not(@nullFlavor)] | hl7:time[@nullFlavor='UNK'] | hl7:assignedAuthor (rule-reference: d42e38072-true-d1359120e0)</assert>
   </rule>

   <!-- Checking undefined contents for template/element @isClosed="true". Match context that we did not already match -->
   <rule fpi="RUL-QQQ"
         context="*[hl7:act[hl7:templateId[@root = '1.2.40.0.34.6.0.11.3.20'] and hl7:templateId[@root = '2.16.840.1.113883.10.20.1.27'] and hl7:templateId[@root = '1.3.6.1.4.1.19376.1.5.3.1.4.5.1'] and hl7:templateId[@root = '1.3.6.1.4.1.19376.1.5.3.1.4.5.2']]]/hl7:act[hl7:templateId[@root = '1.2.40.0.34.6.0.11.3.20'] and hl7:templateId[@root = '2.16.840.1.113883.10.20.1.27'] and hl7:templateId[@root = '1.3.6.1.4.1.19376.1.5.3.1.4.5.1'] and hl7:templateId[@root = '1.3.6.1.4.1.19376.1.5.3.1.4.5.2']]/hl7:author[hl7:assignedAuthor]/hl7:assignedAuthor/*[not(@xsi:nil = 'true')][not(self::hl7:id[not(@nullFlavor)] | self::hl7:id[@nullFlavor='UNK'] | self::hl7:code[not(@nullFlavor)] | self::hl7:addr[not(@nullFlavor)] | self::hl7:telecom[not(@nullFlavor)] | self::hl7:assignedPerson | self::hl7:assignedAuthoringDevice | self::hl7:representedOrganization)]"
         id="d1359003e56-true-d1359223e0">
      <assert role="error"
              see="http://elga.art-decor.org/elgaimpf-html-20250116T125121/tmp-1.2.40.0.34.6.0.11.3.20-2019-05-29T150252.html"
              test="not(.)">(atcdabbr_entry_ExpositionsrisikoProblemConcern)/d1359003e56-true-d1359223e0: '<value-of select="name(..)"/>' ist als geschlossen definiert und dieses Element '<name/>' ist nicht erlaubt oder nicht mit diesem Inhalt erlaubt. Dies kann templateId, code oder id betreffen. Erwartet:  hl7:id[not(@nullFlavor)] | hl7:id[@nullFlavor='UNK'] | hl7:code[not(@nullFlavor)] | hl7:addr[not(@nullFlavor)] | hl7:telecom[not(@nullFlavor)] | hl7:assignedPerson | hl7:assignedAuthoringDevice | hl7:representedOrganization (rule-reference: d1359003e56-true-d1359223e0)</assert>
   </rule>

   <!-- Checking undefined contents for template/element @isClosed="true". Match context that we did not already match -->
   <rule fpi="RUL-QQQ"
         context="*[hl7:act[hl7:templateId[@root = '1.2.40.0.34.6.0.11.3.20'] and hl7:templateId[@root = '2.16.840.1.113883.10.20.1.27'] and hl7:templateId[@root = '1.3.6.1.4.1.19376.1.5.3.1.4.5.1'] and hl7:templateId[@root = '1.3.6.1.4.1.19376.1.5.3.1.4.5.2']]]/hl7:act[hl7:templateId[@root = '1.2.40.0.34.6.0.11.3.20'] and hl7:templateId[@root = '2.16.840.1.113883.10.20.1.27'] and hl7:templateId[@root = '1.3.6.1.4.1.19376.1.5.3.1.4.5.1'] and hl7:templateId[@root = '1.3.6.1.4.1.19376.1.5.3.1.4.5.2']]/hl7:author[hl7:assignedAuthor]/hl7:assignedAuthor/hl7:addr[not(@nullFlavor)]/*[not(@xsi:nil = 'true')][not(self::hl7:streetAddressLine | self::hl7:streetName | self::hl7:houseNumber | self::hl7:postalCode[not(@nullFlavor)] | self::hl7:city[not(@nullFlavor)] | self::hl7:state | self::hl7:country[not(@nullFlavor)] | self::hl7:additionalLocator)]"
         id="d1359003e106-true-d1359282e0">
      <assert role="error"
              see="http://elga.art-decor.org/elgaimpf-html-20250116T125121/tmp-1.2.40.0.34.6.0.11.3.20-2019-05-29T150252.html"
              test="not(.)">(atcdabbr_entry_ExpositionsrisikoProblemConcern)/d1359003e106-true-d1359282e0: '<value-of select="name(..)"/>' ist als geschlossen definiert und dieses Element '<name/>' ist nicht erlaubt oder nicht mit diesem Inhalt erlaubt. Dies kann templateId, code oder id betreffen. Erwartet:  hl7:streetAddressLine | hl7:streetName | hl7:houseNumber | hl7:postalCode[not(@nullFlavor)] | hl7:city[not(@nullFlavor)] | hl7:state | hl7:country[not(@nullFlavor)] | hl7:additionalLocator (rule-reference: d1359003e106-true-d1359282e0)</assert>
   </rule>

   <!-- Checking undefined contents for template/element @isClosed="true". Match context that we did not already match -->
   <rule fpi="RUL-QQQ"
         context="*[hl7:act[hl7:templateId[@root = '1.2.40.0.34.6.0.11.3.20'] and hl7:templateId[@root = '2.16.840.1.113883.10.20.1.27'] and hl7:templateId[@root = '1.3.6.1.4.1.19376.1.5.3.1.4.5.1'] and hl7:templateId[@root = '1.3.6.1.4.1.19376.1.5.3.1.4.5.2']]]/hl7:act[hl7:templateId[@root = '1.2.40.0.34.6.0.11.3.20'] and hl7:templateId[@root = '2.16.840.1.113883.10.20.1.27'] and hl7:templateId[@root = '1.3.6.1.4.1.19376.1.5.3.1.4.5.1'] and hl7:templateId[@root = '1.3.6.1.4.1.19376.1.5.3.1.4.5.2']]/hl7:author[hl7:assignedAuthor]/hl7:assignedAuthor/hl7:assignedPerson/*[not(@xsi:nil = 'true')][not(self::hl7:name[not(@nullFlavor)] | self::hl7:name[@nullFlavor='UNK'] | self::hl7:name[@nullFlavor='MSK'])]"
         id="d1359003e152-true-d1359339e0">
      <assert role="error"
              see="http://elga.art-decor.org/elgaimpf-html-20250116T125121/tmp-1.2.40.0.34.6.0.11.3.20-2019-05-29T150252.html"
              test="not(.)">(atcdabbr_entry_ExpositionsrisikoProblemConcern)/d1359003e152-true-d1359339e0: '<value-of select="name(..)"/>' ist als geschlossen definiert und dieses Element '<name/>' ist nicht erlaubt oder nicht mit diesem Inhalt erlaubt. Dies kann templateId, code oder id betreffen. Erwartet:  hl7:name[not(@nullFlavor)] | hl7:name[@nullFlavor='UNK'] | hl7:name[@nullFlavor='MSK'] (rule-reference: d1359003e152-true-d1359339e0)</assert>
   </rule>

   <!-- Checking undefined contents for template/element @isClosed="true". Match context that we did not already match -->
   <rule fpi="RUL-QQQ"
         context="*[hl7:act[hl7:templateId[@root = '1.2.40.0.34.6.0.11.3.20'] and hl7:templateId[@root = '2.16.840.1.113883.10.20.1.27'] and hl7:templateId[@root = '1.3.6.1.4.1.19376.1.5.3.1.4.5.1'] and hl7:templateId[@root = '1.3.6.1.4.1.19376.1.5.3.1.4.5.2']]]/hl7:act[hl7:templateId[@root = '1.2.40.0.34.6.0.11.3.20'] and hl7:templateId[@root = '2.16.840.1.113883.10.20.1.27'] and hl7:templateId[@root = '1.3.6.1.4.1.19376.1.5.3.1.4.5.1'] and hl7:templateId[@root = '1.3.6.1.4.1.19376.1.5.3.1.4.5.2']]/hl7:author[hl7:assignedAuthor]/hl7:assignedAuthor/hl7:assignedPerson/hl7:name[not(@nullFlavor)]/*[not(@xsi:nil = 'true')][not(self::hl7:prefix | self::hl7:family[not(@nullFlavor)] | self::hl7:given[not(@nullFlavor)] | self::hl7:suffix)]"
         id="d1359343e92-true-d1359373e0">
      <assert role="error"
              see="http://elga.art-decor.org/elgaimpf-html-20250116T125121/tmp-1.2.40.0.34.6.0.11.9.6-2023-03-31T111555.html"
              test="not(.)">(atcdabbr_other_PersonNameCompilationG2)/d1359343e92-true-d1359373e0: '<value-of select="name(..)"/>' ist als geschlossen definiert und dieses Element '<name/>' ist nicht erlaubt oder nicht mit diesem Inhalt erlaubt. Dies kann templateId, code oder id betreffen. Erwartet:  hl7:prefix | hl7:family[not(@nullFlavor)] | hl7:given[not(@nullFlavor)] | hl7:suffix (rule-reference: d1359343e92-true-d1359373e0)</assert>
   </rule>

   <!-- Checking undefined contents for template/element @isClosed="true". Match context that we did not already match -->
   <rule fpi="RUL-QQQ"
         context="*[hl7:act[hl7:templateId[@root = '1.2.40.0.34.6.0.11.3.20'] and hl7:templateId[@root = '2.16.840.1.113883.10.20.1.27'] and hl7:templateId[@root = '1.3.6.1.4.1.19376.1.5.3.1.4.5.1'] and hl7:templateId[@root = '1.3.6.1.4.1.19376.1.5.3.1.4.5.2']]]/hl7:act[hl7:templateId[@root = '1.2.40.0.34.6.0.11.3.20'] and hl7:templateId[@root = '2.16.840.1.113883.10.20.1.27'] and hl7:templateId[@root = '1.3.6.1.4.1.19376.1.5.3.1.4.5.1'] and hl7:templateId[@root = '1.3.6.1.4.1.19376.1.5.3.1.4.5.2']]/hl7:author[hl7:assignedAuthor]/hl7:assignedAuthor/hl7:assignedAuthoringDevice/*[not(@xsi:nil = 'true')][not(self::hl7:manufacturerModelName[not(@nullFlavor)] | self::hl7:softwareName[not(@nullFlavor)])]"
         id="d1359003e175-true-d1359421e0">
      <assert role="error"
              see="http://elga.art-decor.org/elgaimpf-html-20250116T125121/tmp-1.2.40.0.34.6.0.11.3.20-2019-05-29T150252.html"
              test="not(.)">(atcdabbr_entry_ExpositionsrisikoProblemConcern)/d1359003e175-true-d1359421e0: '<value-of select="name(..)"/>' ist als geschlossen definiert und dieses Element '<name/>' ist nicht erlaubt oder nicht mit diesem Inhalt erlaubt. Dies kann templateId, code oder id betreffen. Erwartet:  hl7:manufacturerModelName[not(@nullFlavor)] | hl7:softwareName[not(@nullFlavor)] (rule-reference: d1359003e175-true-d1359421e0)</assert>
   </rule>

   <!-- Checking undefined contents for template/element @isClosed="true". Match context that we did not already match -->
   <rule fpi="RUL-QQQ"
         context="*[hl7:act[hl7:templateId[@root = '1.2.40.0.34.6.0.11.3.20'] and hl7:templateId[@root = '2.16.840.1.113883.10.20.1.27'] and hl7:templateId[@root = '1.3.6.1.4.1.19376.1.5.3.1.4.5.1'] and hl7:templateId[@root = '1.3.6.1.4.1.19376.1.5.3.1.4.5.2']]]/hl7:act[hl7:templateId[@root = '1.2.40.0.34.6.0.11.3.20'] and hl7:templateId[@root = '2.16.840.1.113883.10.20.1.27'] and hl7:templateId[@root = '1.3.6.1.4.1.19376.1.5.3.1.4.5.1'] and hl7:templateId[@root = '1.3.6.1.4.1.19376.1.5.3.1.4.5.2']]/hl7:author[hl7:assignedAuthor]/hl7:assignedAuthor/hl7:representedOrganization/*[not(@xsi:nil = 'true')][not(self::hl7:id[not(@nullFlavor)] | self::hl7:name[not(@nullFlavor)] | self::hl7:telecom[not(@nullFlavor)] | self::hl7:addr[not(@nullFlavor)])]"
         id="d1359003e191-true-d1359466e0">
      <assert role="error"
              see="http://elga.art-decor.org/elgaimpf-html-20250116T125121/tmp-1.2.40.0.34.6.0.11.3.20-2019-05-29T150252.html"
              test="not(.)">(atcdabbr_entry_ExpositionsrisikoProblemConcern)/d1359003e191-true-d1359466e0: '<value-of select="name(..)"/>' ist als geschlossen definiert und dieses Element '<name/>' ist nicht erlaubt oder nicht mit diesem Inhalt erlaubt. Dies kann templateId, code oder id betreffen. Erwartet:  hl7:id[not(@nullFlavor)] | hl7:name[not(@nullFlavor)] | hl7:telecom[not(@nullFlavor)] | hl7:addr[not(@nullFlavor)] (rule-reference: d1359003e191-true-d1359466e0)</assert>
   </rule>

   <!-- Checking undefined contents for template/element @isClosed="true". Match context that we did not already match -->
   <rule fpi="RUL-QQQ"
         context="*[hl7:act[hl7:templateId[@root = '1.2.40.0.34.6.0.11.3.20'] and hl7:templateId[@root = '2.16.840.1.113883.10.20.1.27'] and hl7:templateId[@root = '1.3.6.1.4.1.19376.1.5.3.1.4.5.1'] and hl7:templateId[@root = '1.3.6.1.4.1.19376.1.5.3.1.4.5.2']]]/hl7:act[hl7:templateId[@root = '1.2.40.0.34.6.0.11.3.20'] and hl7:templateId[@root = '2.16.840.1.113883.10.20.1.27'] and hl7:templateId[@root = '1.3.6.1.4.1.19376.1.5.3.1.4.5.1'] and hl7:templateId[@root = '1.3.6.1.4.1.19376.1.5.3.1.4.5.2']]/hl7:author[hl7:assignedAuthor]/hl7:assignedAuthor/hl7:representedOrganization/hl7:addr[not(@nullFlavor)]/*[not(@xsi:nil = 'true')][not(self::hl7:streetAddressLine | self::hl7:streetName | self::hl7:houseNumber | self::hl7:postalCode[not(@nullFlavor)] | self::hl7:city[not(@nullFlavor)] | self::hl7:state | self::hl7:country[not(@nullFlavor)] | self::hl7:additionalLocator)]"
         id="d1359436e94-true-d1359529e0">
      <assert role="error"
              see="http://elga.art-decor.org/elgaimpf-html-20250116T125121/tmp-1.2.40.0.34.6.0.11.3.20-2019-05-29T150252.html"
              test="not(.)">(atcdabbr_entry_ExpositionsrisikoProblemConcern)/d1359436e94-true-d1359529e0: '<value-of select="name(..)"/>' ist als geschlossen definiert und dieses Element '<name/>' ist nicht erlaubt oder nicht mit diesem Inhalt erlaubt. Dies kann templateId, code oder id betreffen. Erwartet:  hl7:streetAddressLine | hl7:streetName | hl7:houseNumber | hl7:postalCode[not(@nullFlavor)] | hl7:city[not(@nullFlavor)] | hl7:state | hl7:country[not(@nullFlavor)] | hl7:additionalLocator (rule-reference: d1359436e94-true-d1359529e0)</assert>
   </rule>

   <!-- Checking undefined contents for template/element @isClosed="true". Match context that we did not already match -->
   <rule fpi="RUL-QQQ"
         context="*[hl7:act[hl7:templateId[@root = '1.2.40.0.34.6.0.11.3.20'] and hl7:templateId[@root = '2.16.840.1.113883.10.20.1.27'] and hl7:templateId[@root = '1.3.6.1.4.1.19376.1.5.3.1.4.5.1'] and hl7:templateId[@root = '1.3.6.1.4.1.19376.1.5.3.1.4.5.2']]]/hl7:act[hl7:templateId[@root = '1.2.40.0.34.6.0.11.3.20'] and hl7:templateId[@root = '2.16.840.1.113883.10.20.1.27'] and hl7:templateId[@root = '1.3.6.1.4.1.19376.1.5.3.1.4.5.1'] and hl7:templateId[@root = '1.3.6.1.4.1.19376.1.5.3.1.4.5.2']]/hl7:entryRelationship[@typeCode='SUBJ'][not(@nullFlavor)]/*[not(@xsi:nil = 'true')][not(self::hl7:observation[hl7:templateId[@root = '1.2.40.0.34.6.0.11.3.21'] and hl7:templateId[@root = '2.16.840.1.113883.10.20.1.28'] and hl7:templateId[@root = '1.3.6.1.4.1.19376.1.5.3.1.4.5']])]"
         id="d42e38094-true-d1359686e0">
      <assert role="error"
              see="http://elga.art-decor.org/elgaimpf-html-20250116T125121/tmp-1.2.40.0.34.6.0.11.3.20-2019-05-29T150252.html"
              test="not(.)">(atcdabbr_entry_ExpositionsrisikoProblemConcern)/d42e38094-true-d1359686e0: '<value-of select="name(..)"/>' ist als geschlossen definiert und dieses Element '<name/>' ist nicht erlaubt oder nicht mit diesem Inhalt erlaubt. Dies kann templateId, code oder id betreffen. Erwartet:  hl7:observation[hl7:templateId[@root = '1.2.40.0.34.6.0.11.3.21'] and hl7:templateId[@root = '2.16.840.1.113883.10.20.1.28'] and hl7:templateId[@root = '1.3.6.1.4.1.19376.1.5.3.1.4.5']] (rule-reference: d42e38094-true-d1359686e0)</assert>
   </rule>

   <!-- Checking undefined contents for template/element @isClosed="true". Match context that we did not already match -->
   <rule fpi="RUL-QQQ"
         context="*[hl7:act[hl7:templateId[@root = '1.2.40.0.34.6.0.11.3.20'] and hl7:templateId[@root = '2.16.840.1.113883.10.20.1.27'] and hl7:templateId[@root = '1.3.6.1.4.1.19376.1.5.3.1.4.5.1'] and hl7:templateId[@root = '1.3.6.1.4.1.19376.1.5.3.1.4.5.2']]]/hl7:act[hl7:templateId[@root = '1.2.40.0.34.6.0.11.3.20'] and hl7:templateId[@root = '2.16.840.1.113883.10.20.1.27'] and hl7:templateId[@root = '1.3.6.1.4.1.19376.1.5.3.1.4.5.1'] and hl7:templateId[@root = '1.3.6.1.4.1.19376.1.5.3.1.4.5.2']]/hl7:entryRelationship[@typeCode='SUBJ'][not(@nullFlavor)]/hl7:observation[hl7:templateId[@root = '1.2.40.0.34.6.0.11.3.21'] and hl7:templateId[@root = '2.16.840.1.113883.10.20.1.28'] and hl7:templateId[@root = '1.3.6.1.4.1.19376.1.5.3.1.4.5']]/*[not(@xsi:nil = 'true')][not(self::hl7:templateId[@root = '1.2.40.0.34.6.0.11.3.21'] | self::hl7:templateId[@root = '2.16.840.1.113883.10.20.1.28'] | self::hl7:templateId[@root = '1.3.6.1.4.1.19376.1.5.3.1.4.5'] | self::hl7:id[not(@nullFlavor)] | self::hl7:code[(@code = '55607006' and @codeSystem = '2.16.840.1.113883.6.96')] | self::hl7:text | self::hl7:statusCode[@code = 'completed'] | self::hl7:effectiveTime[not(@nullFlavor)] | self::hl7:value[concat(@code, @codeSystem) = doc('include/voc-1.2.40.0.34.6.0.10.15-DYNAMIC.xml')//valueSet[1]/conceptList/concept/concat(@code, @codeSystem)] | self::hl7:participant[hl7:templateId[@root = '1.2.40.0.34.6.0.11.9.44']] | self::hl7:participant[hl7:templateId[@root = '1.2.40.0.34.6.0.11.9.46']] | self::hl7:participant[hl7:templateId[@root = '1.2.40.0.34.6.0.11.9.47']])]"
         id="d1359574e5-true-d1359921e0">
      <assert role="error"
              see="http://elga.art-decor.org/elgaimpf-html-20250116T125121/tmp-1.2.40.0.34.6.0.11.3.20-2019-05-29T150252.html"
              test="not(.)">(atcdabbr_entry_ExpositionsrisikoProblemConcern)/d1359574e5-true-d1359921e0: '<value-of select="name(..)"/>' ist als geschlossen definiert und dieses Element '<name/>' ist nicht erlaubt oder nicht mit diesem Inhalt erlaubt. Dies kann templateId, code oder id betreffen. Erwartet:  hl7:templateId[@root = '1.2.40.0.34.6.0.11.3.21'] | hl7:templateId[@root = '2.16.840.1.113883.10.20.1.28'] | hl7:templateId[@root = '1.3.6.1.4.1.19376.1.5.3.1.4.5'] | hl7:id[not(@nullFlavor)] | hl7:code[(@code = '55607006' and @codeSystem = '2.16.840.1.113883.6.96')] | hl7:text | hl7:statusCode[@code = 'completed'] | hl7:effectiveTime[not(@nullFlavor)] | hl7:value[concat(@code, @codeSystem) = doc('include/voc-1.2.40.0.34.6.0.10.15-DYNAMIC.xml')//valueSet[1]/conceptList/concept/concat(@code, @codeSystem)] | hl7:participant[hl7:templateId[@root = '1.2.40.0.34.6.0.11.9.44']] | hl7:participant[hl7:templateId[@root = '1.2.40.0.34.6.0.11.9.46']] | hl7:participant[hl7:templateId[@root = '1.2.40.0.34.6.0.11.9.47']] (rule-reference: d1359574e5-true-d1359921e0)</assert>
   </rule>

   <!-- Checking undefined contents for template/element @isClosed="true". Match context that we did not already match -->
   <rule fpi="RUL-QQQ"
         context="*[hl7:act[hl7:templateId[@root = '1.2.40.0.34.6.0.11.3.20'] and hl7:templateId[@root = '2.16.840.1.113883.10.20.1.27'] and hl7:templateId[@root = '1.3.6.1.4.1.19376.1.5.3.1.4.5.1'] and hl7:templateId[@root = '1.3.6.1.4.1.19376.1.5.3.1.4.5.2']]]/hl7:act[hl7:templateId[@root = '1.2.40.0.34.6.0.11.3.20'] and hl7:templateId[@root = '2.16.840.1.113883.10.20.1.27'] and hl7:templateId[@root = '1.3.6.1.4.1.19376.1.5.3.1.4.5.1'] and hl7:templateId[@root = '1.3.6.1.4.1.19376.1.5.3.1.4.5.2']]/hl7:entryRelationship[@typeCode='SUBJ'][not(@nullFlavor)]/hl7:observation[hl7:templateId[@root = '1.2.40.0.34.6.0.11.3.21'] and hl7:templateId[@root = '2.16.840.1.113883.10.20.1.28'] and hl7:templateId[@root = '1.3.6.1.4.1.19376.1.5.3.1.4.5']]/hl7:text/*[not(@xsi:nil = 'true')][not(self::hl7:reference[not(@nullFlavor)])]"
         id="d1359954e54-true-d1359966e0">
      <assert role="error"
              see="http://elga.art-decor.org/elgaimpf-html-20250116T125121/tmp-1.2.40.0.34.6.0.11.9.1-2021-05-06T093820.html"
              test="not(.)">(atcdabrr_other_NarrativeTextReference)/d1359954e54-true-d1359966e0: '<value-of select="name(..)"/>' ist als geschlossen definiert und dieses Element '<name/>' ist nicht erlaubt oder nicht mit diesem Inhalt erlaubt. Dies kann templateId, code oder id betreffen. Erwartet:  hl7:reference[not(@nullFlavor)] (rule-reference: d1359954e54-true-d1359966e0)</assert>
   </rule>

   <!-- Checking undefined contents for template/element @isClosed="true". Match context that we did not already match -->
   <rule fpi="RUL-QQQ"
         context="*[hl7:act[hl7:templateId[@root = '1.2.40.0.34.6.0.11.3.20'] and hl7:templateId[@root = '2.16.840.1.113883.10.20.1.27'] and hl7:templateId[@root = '1.3.6.1.4.1.19376.1.5.3.1.4.5.1'] and hl7:templateId[@root = '1.3.6.1.4.1.19376.1.5.3.1.4.5.2']]]/hl7:act[hl7:templateId[@root = '1.2.40.0.34.6.0.11.3.20'] and hl7:templateId[@root = '2.16.840.1.113883.10.20.1.27'] and hl7:templateId[@root = '1.3.6.1.4.1.19376.1.5.3.1.4.5.1'] and hl7:templateId[@root = '1.3.6.1.4.1.19376.1.5.3.1.4.5.2']]/hl7:entryRelationship[@typeCode='SUBJ'][not(@nullFlavor)]/hl7:observation[hl7:templateId[@root = '1.2.40.0.34.6.0.11.3.21'] and hl7:templateId[@root = '2.16.840.1.113883.10.20.1.28'] and hl7:templateId[@root = '1.3.6.1.4.1.19376.1.5.3.1.4.5']]/hl7:effectiveTime[not(@nullFlavor)]/*[not(@xsi:nil = 'true')][not(self::hl7:low[not(@nullFlavor)] | self::hl7:high)]"
         id="d1359574e82-true-d1359996e0">
      <assert role="error"
              see="http://elga.art-decor.org/elgaimpf-html-20250116T125121/tmp-1.2.40.0.34.6.0.11.3.20-2019-05-29T150252.html"
              test="not(.)">(atcdabbr_entry_ExpositionsrisikoProblemConcern)/d1359574e82-true-d1359996e0: '<value-of select="name(..)"/>' ist als geschlossen definiert und dieses Element '<name/>' ist nicht erlaubt oder nicht mit diesem Inhalt erlaubt. Dies kann templateId, code oder id betreffen. Erwartet:  hl7:low[not(@nullFlavor)] | hl7:high (rule-reference: d1359574e82-true-d1359996e0)</assert>
   </rule>

   <!-- Checking undefined contents for template/element @isClosed="true". Match context that we did not already match -->
   <rule fpi="RUL-QQQ"
         context="*[hl7:act[hl7:templateId[@root = '1.2.40.0.34.6.0.11.3.20'] and hl7:templateId[@root = '2.16.840.1.113883.10.20.1.27'] and hl7:templateId[@root = '1.3.6.1.4.1.19376.1.5.3.1.4.5.1'] and hl7:templateId[@root = '1.3.6.1.4.1.19376.1.5.3.1.4.5.2']]]/hl7:act[hl7:templateId[@root = '1.2.40.0.34.6.0.11.3.20'] and hl7:templateId[@root = '2.16.840.1.113883.10.20.1.27'] and hl7:templateId[@root = '1.3.6.1.4.1.19376.1.5.3.1.4.5.1'] and hl7:templateId[@root = '1.3.6.1.4.1.19376.1.5.3.1.4.5.2']]/hl7:entryRelationship[@typeCode='SUBJ'][not(@nullFlavor)]/hl7:observation[hl7:templateId[@root = '1.2.40.0.34.6.0.11.3.21'] and hl7:templateId[@root = '2.16.840.1.113883.10.20.1.28'] and hl7:templateId[@root = '1.3.6.1.4.1.19376.1.5.3.1.4.5']]/hl7:value[concat(@code, @codeSystem) = doc('include/voc-1.2.40.0.34.6.0.10.15-DYNAMIC.xml')//valueSet[1]/conceptList/concept/concat(@code, @codeSystem)]/*[not(@xsi:nil = 'true')][not(self::hl7:originalText)]"
         id="d1359574e106-true-d1360025e0">
      <assert role="error"
              see="http://elga.art-decor.org/elgaimpf-html-20250116T125121/tmp-1.2.40.0.34.6.0.11.3.20-2019-05-29T150252.html"
              test="not(.)">(atcdabbr_entry_ExpositionsrisikoProblemConcern)/d1359574e106-true-d1360025e0: '<value-of select="name(..)"/>' ist als geschlossen definiert und dieses Element '<name/>' ist nicht erlaubt oder nicht mit diesem Inhalt erlaubt. Dies kann templateId, code oder id betreffen. Erwartet:  hl7:originalText (rule-reference: d1359574e106-true-d1360025e0)</assert>
   </rule>

   <!-- Checking undefined contents for template/element @isClosed="true". Match context that we did not already match -->
   <rule fpi="RUL-QQQ"
         context="*[hl7:act[hl7:templateId[@root = '1.2.40.0.34.6.0.11.3.20'] and hl7:templateId[@root = '2.16.840.1.113883.10.20.1.27'] and hl7:templateId[@root = '1.3.6.1.4.1.19376.1.5.3.1.4.5.1'] and hl7:templateId[@root = '1.3.6.1.4.1.19376.1.5.3.1.4.5.2']]]/hl7:act[hl7:templateId[@root = '1.2.40.0.34.6.0.11.3.20'] and hl7:templateId[@root = '2.16.840.1.113883.10.20.1.27'] and hl7:templateId[@root = '1.3.6.1.4.1.19376.1.5.3.1.4.5.1'] and hl7:templateId[@root = '1.3.6.1.4.1.19376.1.5.3.1.4.5.2']]/hl7:entryRelationship[@typeCode='SUBJ'][not(@nullFlavor)]/hl7:observation[hl7:templateId[@root = '1.2.40.0.34.6.0.11.3.21'] and hl7:templateId[@root = '2.16.840.1.113883.10.20.1.28'] and hl7:templateId[@root = '1.3.6.1.4.1.19376.1.5.3.1.4.5']]/hl7:value[concat(@code, @codeSystem) = doc('include/voc-1.2.40.0.34.6.0.10.15-DYNAMIC.xml')//valueSet[1]/conceptList/concept/concat(@code, @codeSystem)]/hl7:originalText/*[not(@xsi:nil = 'true')][not(self::hl7:reference[not(@nullFlavor)])]"
         id="d1360029e41-true-d1360041e0">
      <assert role="error"
              see="http://elga.art-decor.org/elgaimpf-html-20250116T125121/tmp-1.2.40.0.34.6.0.11.9.2-2021-02-19T133148.html"
              test="not(.)">(atcdabbr_other_OriginalTextReference)/d1360029e41-true-d1360041e0: '<value-of select="name(..)"/>' ist als geschlossen definiert und dieses Element '<name/>' ist nicht erlaubt oder nicht mit diesem Inhalt erlaubt. Dies kann templateId, code oder id betreffen. Erwartet:  hl7:reference[not(@nullFlavor)] (rule-reference: d1360029e41-true-d1360041e0)</assert>
   </rule>

   <!-- Checking undefined contents for template/element @isClosed="true". Match context that we did not already match -->
   <rule fpi="RUL-QQQ"
         context="*[hl7:act[hl7:templateId[@root = '1.2.40.0.34.6.0.11.3.20'] and hl7:templateId[@root = '2.16.840.1.113883.10.20.1.27'] and hl7:templateId[@root = '1.3.6.1.4.1.19376.1.5.3.1.4.5.1'] and hl7:templateId[@root = '1.3.6.1.4.1.19376.1.5.3.1.4.5.2']]]/hl7:act[hl7:templateId[@root = '1.2.40.0.34.6.0.11.3.20'] and hl7:templateId[@root = '2.16.840.1.113883.10.20.1.27'] and hl7:templateId[@root = '1.3.6.1.4.1.19376.1.5.3.1.4.5.1'] and hl7:templateId[@root = '1.3.6.1.4.1.19376.1.5.3.1.4.5.2']]/hl7:entryRelationship[@typeCode='SUBJ'][not(@nullFlavor)]/hl7:observation[hl7:templateId[@root = '1.2.40.0.34.6.0.11.3.21'] and hl7:templateId[@root = '2.16.840.1.113883.10.20.1.28'] and hl7:templateId[@root = '1.3.6.1.4.1.19376.1.5.3.1.4.5']]/hl7:participant[hl7:templateId[@root = '1.2.40.0.34.6.0.11.9.44']]/*[not(@xsi:nil = 'true')][not(self::hl7:templateId[@root = '1.2.40.0.34.6.0.11.9.44'] | self::hl7:time[not(@nullFlavor)] | self::hl7:participantRole[not(@nullFlavor)])]"
         id="d1359574e137-true-d1360121e0">
      <assert role="error"
              see="http://elga.art-decor.org/elgaimpf-html-20250116T125121/tmp-1.2.40.0.34.6.0.11.3.20-2019-05-29T150252.html"
              test="not(.)">(atcdabbr_entry_ExpositionsrisikoProblemConcern)/d1359574e137-true-d1360121e0: '<value-of select="name(..)"/>' ist als geschlossen definiert und dieses Element '<name/>' ist nicht erlaubt oder nicht mit diesem Inhalt erlaubt. Dies kann templateId, code oder id betreffen. Erwartet:  hl7:templateId[@root = '1.2.40.0.34.6.0.11.9.44'] | hl7:time[not(@nullFlavor)] | hl7:participantRole[not(@nullFlavor)] (rule-reference: d1359574e137-true-d1360121e0)</assert>
   </rule>

   <!-- Checking undefined contents for template/element @isClosed="true". Match context that we did not already match -->
   <rule fpi="RUL-QQQ"
         context="*[hl7:act[hl7:templateId[@root = '1.2.40.0.34.6.0.11.3.20'] and hl7:templateId[@root = '2.16.840.1.113883.10.20.1.27'] and hl7:templateId[@root = '1.3.6.1.4.1.19376.1.5.3.1.4.5.1'] and hl7:templateId[@root = '1.3.6.1.4.1.19376.1.5.3.1.4.5.2']]]/hl7:act[hl7:templateId[@root = '1.2.40.0.34.6.0.11.3.20'] and hl7:templateId[@root = '2.16.840.1.113883.10.20.1.27'] and hl7:templateId[@root = '1.3.6.1.4.1.19376.1.5.3.1.4.5.1'] and hl7:templateId[@root = '1.3.6.1.4.1.19376.1.5.3.1.4.5.2']]/hl7:entryRelationship[@typeCode='SUBJ'][not(@nullFlavor)]/hl7:observation[hl7:templateId[@root = '1.2.40.0.34.6.0.11.3.21'] and hl7:templateId[@root = '2.16.840.1.113883.10.20.1.28'] and hl7:templateId[@root = '1.3.6.1.4.1.19376.1.5.3.1.4.5']]/hl7:participant[hl7:templateId[@root = '1.2.40.0.34.6.0.11.9.44']]/hl7:participantRole[not(@nullFlavor)]/*[not(@xsi:nil = 'true')][not(self::hl7:id[not(@nullFlavor)] | self::hl7:id[@nullFlavor='NI'] | self::hl7:id[@nullFlavor='UNK'] | self::hl7:addr[not(@nullFlavor)] | self::hl7:telecom[not(@nullFlavor)] | self::hl7:playingDevice | self::hl7:playingEntity | self::hl7:scopingEntity)]"
         id="d1360051e83-true-d1360171e0">
      <assert role="error"
              see="http://elga.art-decor.org/elgaimpf-html-20250116T125121/tmp-1.2.40.0.34.6.0.11.3.20-2019-05-29T150252.html"
              test="not(.)">(atcdabbr_entry_ExpositionsrisikoProblemConcern)/d1360051e83-true-d1360171e0: '<value-of select="name(..)"/>' ist als geschlossen definiert und dieses Element '<name/>' ist nicht erlaubt oder nicht mit diesem Inhalt erlaubt. Dies kann templateId, code oder id betreffen. Erwartet:  hl7:id[not(@nullFlavor)] | hl7:id[@nullFlavor='NI'] | hl7:id[@nullFlavor='UNK'] | hl7:addr[not(@nullFlavor)] | hl7:telecom[not(@nullFlavor)] | hl7:playingDevice | hl7:playingEntity | hl7:scopingEntity (rule-reference: d1360051e83-true-d1360171e0)</assert>
   </rule>

   <!-- Checking undefined contents for template/element @isClosed="true". Match context that we did not already match -->
   <rule fpi="RUL-QQQ"
         context="*[hl7:act[hl7:templateId[@root = '1.2.40.0.34.6.0.11.3.20'] and hl7:templateId[@root = '2.16.840.1.113883.10.20.1.27'] and hl7:templateId[@root = '1.3.6.1.4.1.19376.1.5.3.1.4.5.1'] and hl7:templateId[@root = '1.3.6.1.4.1.19376.1.5.3.1.4.5.2']]]/hl7:act[hl7:templateId[@root = '1.2.40.0.34.6.0.11.3.20'] and hl7:templateId[@root = '2.16.840.1.113883.10.20.1.27'] and hl7:templateId[@root = '1.3.6.1.4.1.19376.1.5.3.1.4.5.1'] and hl7:templateId[@root = '1.3.6.1.4.1.19376.1.5.3.1.4.5.2']]/hl7:entryRelationship[@typeCode='SUBJ'][not(@nullFlavor)]/hl7:observation[hl7:templateId[@root = '1.2.40.0.34.6.0.11.3.21'] and hl7:templateId[@root = '2.16.840.1.113883.10.20.1.28'] and hl7:templateId[@root = '1.3.6.1.4.1.19376.1.5.3.1.4.5']]/hl7:participant[hl7:templateId[@root = '1.2.40.0.34.6.0.11.9.44']]/hl7:participantRole[not(@nullFlavor)]/hl7:addr[not(@nullFlavor)]/*[not(@xsi:nil = 'true')][not(self::hl7:streetAddressLine | self::hl7:streetName | self::hl7:houseNumber | self::hl7:postalCode[not(@nullFlavor)] | self::hl7:city[not(@nullFlavor)] | self::hl7:state | self::hl7:country[not(@nullFlavor)] | self::hl7:additionalLocator)]"
         id="d1360051e112-true-d1360230e0">
      <assert role="error"
              see="http://elga.art-decor.org/elgaimpf-html-20250116T125121/tmp-1.2.40.0.34.6.0.11.3.20-2019-05-29T150252.html"
              test="not(.)">(atcdabbr_entry_ExpositionsrisikoProblemConcern)/d1360051e112-true-d1360230e0: '<value-of select="name(..)"/>' ist als geschlossen definiert und dieses Element '<name/>' ist nicht erlaubt oder nicht mit diesem Inhalt erlaubt. Dies kann templateId, code oder id betreffen. Erwartet:  hl7:streetAddressLine | hl7:streetName | hl7:houseNumber | hl7:postalCode[not(@nullFlavor)] | hl7:city[not(@nullFlavor)] | hl7:state | hl7:country[not(@nullFlavor)] | hl7:additionalLocator (rule-reference: d1360051e112-true-d1360230e0)</assert>
   </rule>

   <!-- Checking undefined contents for template/element @isClosed="true". Match context that we did not already match -->
   <rule fpi="RUL-QQQ"
         context="*[hl7:act[hl7:templateId[@root = '1.2.40.0.34.6.0.11.3.20'] and hl7:templateId[@root = '2.16.840.1.113883.10.20.1.27'] and hl7:templateId[@root = '1.3.6.1.4.1.19376.1.5.3.1.4.5.1'] and hl7:templateId[@root = '1.3.6.1.4.1.19376.1.5.3.1.4.5.2']]]/hl7:act[hl7:templateId[@root = '1.2.40.0.34.6.0.11.3.20'] and hl7:templateId[@root = '2.16.840.1.113883.10.20.1.27'] and hl7:templateId[@root = '1.3.6.1.4.1.19376.1.5.3.1.4.5.1'] and hl7:templateId[@root = '1.3.6.1.4.1.19376.1.5.3.1.4.5.2']]/hl7:entryRelationship[@typeCode='SUBJ'][not(@nullFlavor)]/hl7:observation[hl7:templateId[@root = '1.2.40.0.34.6.0.11.3.21'] and hl7:templateId[@root = '2.16.840.1.113883.10.20.1.28'] and hl7:templateId[@root = '1.3.6.1.4.1.19376.1.5.3.1.4.5']]/hl7:participant[hl7:templateId[@root = '1.2.40.0.34.6.0.11.9.44']]/hl7:participantRole[not(@nullFlavor)]/hl7:playingDevice/*[not(@xsi:nil = 'true')][not(self::hl7:manufacturerModelName[not(@nullFlavor)] | self::hl7:softwareName[not(@nullFlavor)])]"
         id="d1360051e142-true-d1360295e0">
      <assert role="error"
              see="http://elga.art-decor.org/elgaimpf-html-20250116T125121/tmp-1.2.40.0.34.6.0.11.3.20-2019-05-29T150252.html"
              test="not(.)">(atcdabbr_entry_ExpositionsrisikoProblemConcern)/d1360051e142-true-d1360295e0: '<value-of select="name(..)"/>' ist als geschlossen definiert und dieses Element '<name/>' ist nicht erlaubt oder nicht mit diesem Inhalt erlaubt. Dies kann templateId, code oder id betreffen. Erwartet:  hl7:manufacturerModelName[not(@nullFlavor)] | hl7:softwareName[not(@nullFlavor)] (rule-reference: d1360051e142-true-d1360295e0)</assert>
   </rule>

   <!-- Checking undefined contents for template/element @isClosed="true". Match context that we did not already match -->
   <rule fpi="RUL-QQQ"
         context="*[hl7:act[hl7:templateId[@root = '1.2.40.0.34.6.0.11.3.20'] and hl7:templateId[@root = '2.16.840.1.113883.10.20.1.27'] and hl7:templateId[@root = '1.3.6.1.4.1.19376.1.5.3.1.4.5.1'] and hl7:templateId[@root = '1.3.6.1.4.1.19376.1.5.3.1.4.5.2']]]/hl7:act[hl7:templateId[@root = '1.2.40.0.34.6.0.11.3.20'] and hl7:templateId[@root = '2.16.840.1.113883.10.20.1.27'] and hl7:templateId[@root = '1.3.6.1.4.1.19376.1.5.3.1.4.5.1'] and hl7:templateId[@root = '1.3.6.1.4.1.19376.1.5.3.1.4.5.2']]/hl7:entryRelationship[@typeCode='SUBJ'][not(@nullFlavor)]/hl7:observation[hl7:templateId[@root = '1.2.40.0.34.6.0.11.3.21'] and hl7:templateId[@root = '2.16.840.1.113883.10.20.1.28'] and hl7:templateId[@root = '1.3.6.1.4.1.19376.1.5.3.1.4.5']]/hl7:participant[hl7:templateId[@root = '1.2.40.0.34.6.0.11.9.44']]/hl7:participantRole[not(@nullFlavor)]/hl7:playingEntity/*[not(@xsi:nil = 'true')][not(self::hl7:name[not(@nullFlavor)])]"
         id="d1360051e144-true-d1360319e0">
      <assert role="error"
              see="http://elga.art-decor.org/elgaimpf-html-20250116T125121/tmp-1.2.40.0.34.6.0.11.3.20-2019-05-29T150252.html"
              test="not(.)">(atcdabbr_entry_ExpositionsrisikoProblemConcern)/d1360051e144-true-d1360319e0: '<value-of select="name(..)"/>' ist als geschlossen definiert und dieses Element '<name/>' ist nicht erlaubt oder nicht mit diesem Inhalt erlaubt. Dies kann templateId, code oder id betreffen. Erwartet:  hl7:name[not(@nullFlavor)] (rule-reference: d1360051e144-true-d1360319e0)</assert>
   </rule>

   <!-- Checking undefined contents for template/element @isClosed="true". Match context that we did not already match -->
   <rule fpi="RUL-QQQ"
         context="*[hl7:act[hl7:templateId[@root = '1.2.40.0.34.6.0.11.3.20'] and hl7:templateId[@root = '2.16.840.1.113883.10.20.1.27'] and hl7:templateId[@root = '1.3.6.1.4.1.19376.1.5.3.1.4.5.1'] and hl7:templateId[@root = '1.3.6.1.4.1.19376.1.5.3.1.4.5.2']]]/hl7:act[hl7:templateId[@root = '1.2.40.0.34.6.0.11.3.20'] and hl7:templateId[@root = '2.16.840.1.113883.10.20.1.27'] and hl7:templateId[@root = '1.3.6.1.4.1.19376.1.5.3.1.4.5.1'] and hl7:templateId[@root = '1.3.6.1.4.1.19376.1.5.3.1.4.5.2']]/hl7:entryRelationship[@typeCode='SUBJ'][not(@nullFlavor)]/hl7:observation[hl7:templateId[@root = '1.2.40.0.34.6.0.11.3.21'] and hl7:templateId[@root = '2.16.840.1.113883.10.20.1.28'] and hl7:templateId[@root = '1.3.6.1.4.1.19376.1.5.3.1.4.5']]/hl7:participant[hl7:templateId[@root = '1.2.40.0.34.6.0.11.9.44']]/hl7:participantRole[not(@nullFlavor)]/hl7:playingEntity/hl7:name[not(@nullFlavor)]/*[not(@xsi:nil = 'true')][not(self::hl7:prefix | self::hl7:family[not(@nullFlavor)] | self::hl7:given[not(@nullFlavor)] | self::hl7:suffix)]"
         id="d1360051e150-true-d1360348e0">
      <assert role="error"
              see="http://elga.art-decor.org/elgaimpf-html-20250116T125121/tmp-1.2.40.0.34.6.0.11.3.20-2019-05-29T150252.html"
              test="not(.)">(atcdabbr_entry_ExpositionsrisikoProblemConcern)/d1360051e150-true-d1360348e0: '<value-of select="name(..)"/>' ist als geschlossen definiert und dieses Element '<name/>' ist nicht erlaubt oder nicht mit diesem Inhalt erlaubt. Dies kann templateId, code oder id betreffen. Erwartet:  hl7:prefix | hl7:family[not(@nullFlavor)] | hl7:given[not(@nullFlavor)] | hl7:suffix (rule-reference: d1360051e150-true-d1360348e0)</assert>
   </rule>

   <!-- Checking undefined contents for template/element @isClosed="true". Match context that we did not already match -->
   <rule fpi="RUL-QQQ"
         context="*[hl7:act[hl7:templateId[@root = '1.2.40.0.34.6.0.11.3.20'] and hl7:templateId[@root = '2.16.840.1.113883.10.20.1.27'] and hl7:templateId[@root = '1.3.6.1.4.1.19376.1.5.3.1.4.5.1'] and hl7:templateId[@root = '1.3.6.1.4.1.19376.1.5.3.1.4.5.2']]]/hl7:act[hl7:templateId[@root = '1.2.40.0.34.6.0.11.3.20'] and hl7:templateId[@root = '2.16.840.1.113883.10.20.1.27'] and hl7:templateId[@root = '1.3.6.1.4.1.19376.1.5.3.1.4.5.1'] and hl7:templateId[@root = '1.3.6.1.4.1.19376.1.5.3.1.4.5.2']]/hl7:entryRelationship[@typeCode='SUBJ'][not(@nullFlavor)]/hl7:observation[hl7:templateId[@root = '1.2.40.0.34.6.0.11.3.21'] and hl7:templateId[@root = '2.16.840.1.113883.10.20.1.28'] and hl7:templateId[@root = '1.3.6.1.4.1.19376.1.5.3.1.4.5']]/hl7:participant[hl7:templateId[@root = '1.2.40.0.34.6.0.11.9.44']]/hl7:participantRole[not(@nullFlavor)]/hl7:scopingEntity/*[not(@xsi:nil = 'true')][not(self::hl7:desc)]"
         id="d1360051e249-true-d1360382e0">
      <assert role="error"
              see="http://elga.art-decor.org/elgaimpf-html-20250116T125121/tmp-1.2.40.0.34.6.0.11.3.20-2019-05-29T150252.html"
              test="not(.)">(atcdabbr_entry_ExpositionsrisikoProblemConcern)/d1360051e249-true-d1360382e0: '<value-of select="name(..)"/>' ist als geschlossen definiert und dieses Element '<name/>' ist nicht erlaubt oder nicht mit diesem Inhalt erlaubt. Dies kann templateId, code oder id betreffen. Erwartet:  hl7:desc (rule-reference: d1360051e249-true-d1360382e0)</assert>
   </rule>

   <!-- Checking undefined contents for template/element @isClosed="true". Match context that we did not already match -->
   <rule fpi="RUL-QQQ"
         context="*[hl7:act[hl7:templateId[@root = '1.2.40.0.34.6.0.11.3.20'] and hl7:templateId[@root = '2.16.840.1.113883.10.20.1.27'] and hl7:templateId[@root = '1.3.6.1.4.1.19376.1.5.3.1.4.5.1'] and hl7:templateId[@root = '1.3.6.1.4.1.19376.1.5.3.1.4.5.2']]]/hl7:act[hl7:templateId[@root = '1.2.40.0.34.6.0.11.3.20'] and hl7:templateId[@root = '2.16.840.1.113883.10.20.1.27'] and hl7:templateId[@root = '1.3.6.1.4.1.19376.1.5.3.1.4.5.1'] and hl7:templateId[@root = '1.3.6.1.4.1.19376.1.5.3.1.4.5.2']]/hl7:entryRelationship[@typeCode='SUBJ'][not(@nullFlavor)]/hl7:observation[hl7:templateId[@root = '1.2.40.0.34.6.0.11.3.21'] and hl7:templateId[@root = '2.16.840.1.113883.10.20.1.28'] and hl7:templateId[@root = '1.3.6.1.4.1.19376.1.5.3.1.4.5']]/hl7:participant[hl7:templateId[@root = '1.2.40.0.34.6.0.11.9.46']]/*[not(@xsi:nil = 'true')][not(self::hl7:templateId[@root = '1.2.40.0.34.6.0.11.9.46'] | self::hl7:participantRole[not(@nullFlavor)])]"
         id="d1359574e209-true-d1360412e0">
      <assert role="error"
              see="http://elga.art-decor.org/elgaimpf-html-20250116T125121/tmp-1.2.40.0.34.6.0.11.3.20-2019-05-29T150252.html"
              test="not(.)">(atcdabbr_entry_ExpositionsrisikoProblemConcern)/d1359574e209-true-d1360412e0: '<value-of select="name(..)"/>' ist als geschlossen definiert und dieses Element '<name/>' ist nicht erlaubt oder nicht mit diesem Inhalt erlaubt. Dies kann templateId, code oder id betreffen. Erwartet:  hl7:templateId[@root = '1.2.40.0.34.6.0.11.9.46'] | hl7:participantRole[not(@nullFlavor)] (rule-reference: d1359574e209-true-d1360412e0)</assert>
   </rule>

   <!-- Checking undefined contents for template/element @isClosed="true". Match context that we did not already match -->
   <rule fpi="RUL-QQQ"
         context="*[hl7:act[hl7:templateId[@root = '1.2.40.0.34.6.0.11.3.20'] and hl7:templateId[@root = '2.16.840.1.113883.10.20.1.27'] and hl7:templateId[@root = '1.3.6.1.4.1.19376.1.5.3.1.4.5.1'] and hl7:templateId[@root = '1.3.6.1.4.1.19376.1.5.3.1.4.5.2']]]/hl7:act[hl7:templateId[@root = '1.2.40.0.34.6.0.11.3.20'] and hl7:templateId[@root = '2.16.840.1.113883.10.20.1.27'] and hl7:templateId[@root = '1.3.6.1.4.1.19376.1.5.3.1.4.5.1'] and hl7:templateId[@root = '1.3.6.1.4.1.19376.1.5.3.1.4.5.2']]/hl7:entryRelationship[@typeCode='SUBJ'][not(@nullFlavor)]/hl7:observation[hl7:templateId[@root = '1.2.40.0.34.6.0.11.3.21'] and hl7:templateId[@root = '2.16.840.1.113883.10.20.1.28'] and hl7:templateId[@root = '1.3.6.1.4.1.19376.1.5.3.1.4.5']]/hl7:participant[hl7:templateId[@root = '1.2.40.0.34.6.0.11.9.46']]/hl7:participantRole[not(@nullFlavor)]/*[not(@xsi:nil = 'true')][not(self::hl7:id[not(@nullFlavor)][not(@nullFlavor)])]"
         id="d1360392e52-true-d1360428e0">
      <assert role="error"
              see="http://elga.art-decor.org/elgaimpf-html-20250116T125121/tmp-1.2.40.0.34.6.0.11.3.20-2019-05-29T150252.html"
              test="not(.)">(atcdabbr_entry_ExpositionsrisikoProblemConcern)/d1360392e52-true-d1360428e0: '<value-of select="name(..)"/>' ist als geschlossen definiert und dieses Element '<name/>' ist nicht erlaubt oder nicht mit diesem Inhalt erlaubt. Dies kann templateId, code oder id betreffen. Erwartet:  hl7:id[not(@nullFlavor)][not(@nullFlavor)] (rule-reference: d1360392e52-true-d1360428e0)</assert>
   </rule>

   <!-- Checking undefined contents for template/element @isClosed="true". Match context that we did not already match -->
   <rule fpi="RUL-QQQ"
         context="*[hl7:act[hl7:templateId[@root = '1.2.40.0.34.6.0.11.3.20'] and hl7:templateId[@root = '2.16.840.1.113883.10.20.1.27'] and hl7:templateId[@root = '1.3.6.1.4.1.19376.1.5.3.1.4.5.1'] and hl7:templateId[@root = '1.3.6.1.4.1.19376.1.5.3.1.4.5.2']]]/hl7:act[hl7:templateId[@root = '1.2.40.0.34.6.0.11.3.20'] and hl7:templateId[@root = '2.16.840.1.113883.10.20.1.27'] and hl7:templateId[@root = '1.3.6.1.4.1.19376.1.5.3.1.4.5.1'] and hl7:templateId[@root = '1.3.6.1.4.1.19376.1.5.3.1.4.5.2']]/hl7:entryRelationship[@typeCode='SUBJ'][not(@nullFlavor)]/hl7:observation[hl7:templateId[@root = '1.2.40.0.34.6.0.11.3.21'] and hl7:templateId[@root = '2.16.840.1.113883.10.20.1.28'] and hl7:templateId[@root = '1.3.6.1.4.1.19376.1.5.3.1.4.5']]/hl7:participant[hl7:templateId[@root = '1.2.40.0.34.6.0.11.9.47']]/*[not(@xsi:nil = 'true')][not(self::hl7:templateId[@root = '1.2.40.0.34.6.0.11.9.47'] | self::hl7:time | self::hl7:participantRole[not(@nullFlavor)])]"
         id="d1359574e257-true-d1360506e0">
      <assert role="error"
              see="http://elga.art-decor.org/elgaimpf-html-20250116T125121/tmp-1.2.40.0.34.6.0.11.3.20-2019-05-29T150252.html"
              test="not(.)">(atcdabbr_entry_ExpositionsrisikoProblemConcern)/d1359574e257-true-d1360506e0: '<value-of select="name(..)"/>' ist als geschlossen definiert und dieses Element '<name/>' ist nicht erlaubt oder nicht mit diesem Inhalt erlaubt. Dies kann templateId, code oder id betreffen. Erwartet:  hl7:templateId[@root = '1.2.40.0.34.6.0.11.9.47'] | hl7:time | hl7:participantRole[not(@nullFlavor)] (rule-reference: d1359574e257-true-d1360506e0)</assert>
   </rule>

   <!-- Checking undefined contents for template/element @isClosed="true". Match context that we did not already match -->
   <rule fpi="RUL-QQQ"
         context="*[hl7:act[hl7:templateId[@root = '1.2.40.0.34.6.0.11.3.20'] and hl7:templateId[@root = '2.16.840.1.113883.10.20.1.27'] and hl7:templateId[@root = '1.3.6.1.4.1.19376.1.5.3.1.4.5.1'] and hl7:templateId[@root = '1.3.6.1.4.1.19376.1.5.3.1.4.5.2']]]/hl7:act[hl7:templateId[@root = '1.2.40.0.34.6.0.11.3.20'] and hl7:templateId[@root = '2.16.840.1.113883.10.20.1.27'] and hl7:templateId[@root = '1.3.6.1.4.1.19376.1.5.3.1.4.5.1'] and hl7:templateId[@root = '1.3.6.1.4.1.19376.1.5.3.1.4.5.2']]/hl7:entryRelationship[@typeCode='SUBJ'][not(@nullFlavor)]/hl7:observation[hl7:templateId[@root = '1.2.40.0.34.6.0.11.3.21'] and hl7:templateId[@root = '2.16.840.1.113883.10.20.1.28'] and hl7:templateId[@root = '1.3.6.1.4.1.19376.1.5.3.1.4.5']]/hl7:participant[hl7:templateId[@root = '1.2.40.0.34.6.0.11.9.47']]/hl7:participantRole[not(@nullFlavor)]/*[not(@xsi:nil = 'true')][not(self::hl7:id[not(@nullFlavor)] | self::hl7:id[@nullFlavor='NI'] | self::hl7:id[@nullFlavor='UNK'] | self::hl7:addr[not(@nullFlavor)] | self::hl7:telecom[not(@nullFlavor)] | self::hl7:playingDevice | self::hl7:playingEntity | self::hl7:scopingEntity)]"
         id="d1360436e57-true-d1360556e0">
      <assert role="error"
              see="http://elga.art-decor.org/elgaimpf-html-20250116T125121/tmp-1.2.40.0.34.6.0.11.3.20-2019-05-29T150252.html"
              test="not(.)">(atcdabbr_entry_ExpositionsrisikoProblemConcern)/d1360436e57-true-d1360556e0: '<value-of select="name(..)"/>' ist als geschlossen definiert und dieses Element '<name/>' ist nicht erlaubt oder nicht mit diesem Inhalt erlaubt. Dies kann templateId, code oder id betreffen. Erwartet:  hl7:id[not(@nullFlavor)] | hl7:id[@nullFlavor='NI'] | hl7:id[@nullFlavor='UNK'] | hl7:addr[not(@nullFlavor)] | hl7:telecom[not(@nullFlavor)] | hl7:playingDevice | hl7:playingEntity | hl7:scopingEntity (rule-reference: d1360436e57-true-d1360556e0)</assert>
   </rule>

   <!-- Checking undefined contents for template/element @isClosed="true". Match context that we did not already match -->
   <rule fpi="RUL-QQQ"
         context="*[hl7:act[hl7:templateId[@root = '1.2.40.0.34.6.0.11.3.20'] and hl7:templateId[@root = '2.16.840.1.113883.10.20.1.27'] and hl7:templateId[@root = '1.3.6.1.4.1.19376.1.5.3.1.4.5.1'] and hl7:templateId[@root = '1.3.6.1.4.1.19376.1.5.3.1.4.5.2']]]/hl7:act[hl7:templateId[@root = '1.2.40.0.34.6.0.11.3.20'] and hl7:templateId[@root = '2.16.840.1.113883.10.20.1.27'] and hl7:templateId[@root = '1.3.6.1.4.1.19376.1.5.3.1.4.5.1'] and hl7:templateId[@root = '1.3.6.1.4.1.19376.1.5.3.1.4.5.2']]/hl7:entryRelationship[@typeCode='SUBJ'][not(@nullFlavor)]/hl7:observation[hl7:templateId[@root = '1.2.40.0.34.6.0.11.3.21'] and hl7:templateId[@root = '2.16.840.1.113883.10.20.1.28'] and hl7:templateId[@root = '1.3.6.1.4.1.19376.1.5.3.1.4.5']]/hl7:participant[hl7:templateId[@root = '1.2.40.0.34.6.0.11.9.47']]/hl7:participantRole[not(@nullFlavor)]/hl7:addr[not(@nullFlavor)]/*[not(@xsi:nil = 'true')][not(self::hl7:streetAddressLine | self::hl7:streetName | self::hl7:houseNumber | self::hl7:postalCode[not(@nullFlavor)] | self::hl7:city[not(@nullFlavor)] | self::hl7:state | self::hl7:country[not(@nullFlavor)] | self::hl7:additionalLocator)]"
         id="d1360436e86-true-d1360615e0">
      <assert role="error"
              see="http://elga.art-decor.org/elgaimpf-html-20250116T125121/tmp-1.2.40.0.34.6.0.11.3.20-2019-05-29T150252.html"
              test="not(.)">(atcdabbr_entry_ExpositionsrisikoProblemConcern)/d1360436e86-true-d1360615e0: '<value-of select="name(..)"/>' ist als geschlossen definiert und dieses Element '<name/>' ist nicht erlaubt oder nicht mit diesem Inhalt erlaubt. Dies kann templateId, code oder id betreffen. Erwartet:  hl7:streetAddressLine | hl7:streetName | hl7:houseNumber | hl7:postalCode[not(@nullFlavor)] | hl7:city[not(@nullFlavor)] | hl7:state | hl7:country[not(@nullFlavor)] | hl7:additionalLocator (rule-reference: d1360436e86-true-d1360615e0)</assert>
   </rule>

   <!-- Checking undefined contents for template/element @isClosed="true". Match context that we did not already match -->
   <rule fpi="RUL-QQQ"
         context="*[hl7:act[hl7:templateId[@root = '1.2.40.0.34.6.0.11.3.20'] and hl7:templateId[@root = '2.16.840.1.113883.10.20.1.27'] and hl7:templateId[@root = '1.3.6.1.4.1.19376.1.5.3.1.4.5.1'] and hl7:templateId[@root = '1.3.6.1.4.1.19376.1.5.3.1.4.5.2']]]/hl7:act[hl7:templateId[@root = '1.2.40.0.34.6.0.11.3.20'] and hl7:templateId[@root = '2.16.840.1.113883.10.20.1.27'] and hl7:templateId[@root = '1.3.6.1.4.1.19376.1.5.3.1.4.5.1'] and hl7:templateId[@root = '1.3.6.1.4.1.19376.1.5.3.1.4.5.2']]/hl7:entryRelationship[@typeCode='SUBJ'][not(@nullFlavor)]/hl7:observation[hl7:templateId[@root = '1.2.40.0.34.6.0.11.3.21'] and hl7:templateId[@root = '2.16.840.1.113883.10.20.1.28'] and hl7:templateId[@root = '1.3.6.1.4.1.19376.1.5.3.1.4.5']]/hl7:participant[hl7:templateId[@root = '1.2.40.0.34.6.0.11.9.47']]/hl7:participantRole[not(@nullFlavor)]/hl7:playingDevice/*[not(@xsi:nil = 'true')][not(self::hl7:manufacturerModelName[not(@nullFlavor)] | self::hl7:softwareName[not(@nullFlavor)])]"
         id="d1360436e116-true-d1360680e0">
      <assert role="error"
              see="http://elga.art-decor.org/elgaimpf-html-20250116T125121/tmp-1.2.40.0.34.6.0.11.3.20-2019-05-29T150252.html"
              test="not(.)">(atcdabbr_entry_ExpositionsrisikoProblemConcern)/d1360436e116-true-d1360680e0: '<value-of select="name(..)"/>' ist als geschlossen definiert und dieses Element '<name/>' ist nicht erlaubt oder nicht mit diesem Inhalt erlaubt. Dies kann templateId, code oder id betreffen. Erwartet:  hl7:manufacturerModelName[not(@nullFlavor)] | hl7:softwareName[not(@nullFlavor)] (rule-reference: d1360436e116-true-d1360680e0)</assert>
   </rule>

   <!-- Checking undefined contents for template/element @isClosed="true". Match context that we did not already match -->
   <rule fpi="RUL-QQQ"
         context="*[hl7:act[hl7:templateId[@root = '1.2.40.0.34.6.0.11.3.20'] and hl7:templateId[@root = '2.16.840.1.113883.10.20.1.27'] and hl7:templateId[@root = '1.3.6.1.4.1.19376.1.5.3.1.4.5.1'] and hl7:templateId[@root = '1.3.6.1.4.1.19376.1.5.3.1.4.5.2']]]/hl7:act[hl7:templateId[@root = '1.2.40.0.34.6.0.11.3.20'] and hl7:templateId[@root = '2.16.840.1.113883.10.20.1.27'] and hl7:templateId[@root = '1.3.6.1.4.1.19376.1.5.3.1.4.5.1'] and hl7:templateId[@root = '1.3.6.1.4.1.19376.1.5.3.1.4.5.2']]/hl7:entryRelationship[@typeCode='SUBJ'][not(@nullFlavor)]/hl7:observation[hl7:templateId[@root = '1.2.40.0.34.6.0.11.3.21'] and hl7:templateId[@root = '2.16.840.1.113883.10.20.1.28'] and hl7:templateId[@root = '1.3.6.1.4.1.19376.1.5.3.1.4.5']]/hl7:participant[hl7:templateId[@root = '1.2.40.0.34.6.0.11.9.47']]/hl7:participantRole[not(@nullFlavor)]/hl7:playingEntity/*[not(@xsi:nil = 'true')][not(self::hl7:name[not(@nullFlavor)])]"
         id="d1360436e118-true-d1360704e0">
      <assert role="error"
              see="http://elga.art-decor.org/elgaimpf-html-20250116T125121/tmp-1.2.40.0.34.6.0.11.3.20-2019-05-29T150252.html"
              test="not(.)">(atcdabbr_entry_ExpositionsrisikoProblemConcern)/d1360436e118-true-d1360704e0: '<value-of select="name(..)"/>' ist als geschlossen definiert und dieses Element '<name/>' ist nicht erlaubt oder nicht mit diesem Inhalt erlaubt. Dies kann templateId, code oder id betreffen. Erwartet:  hl7:name[not(@nullFlavor)] (rule-reference: d1360436e118-true-d1360704e0)</assert>
   </rule>

   <!-- Checking undefined contents for template/element @isClosed="true". Match context that we did not already match -->
   <rule fpi="RUL-QQQ"
         context="*[hl7:act[hl7:templateId[@root = '1.2.40.0.34.6.0.11.3.20'] and hl7:templateId[@root = '2.16.840.1.113883.10.20.1.27'] and hl7:templateId[@root = '1.3.6.1.4.1.19376.1.5.3.1.4.5.1'] and hl7:templateId[@root = '1.3.6.1.4.1.19376.1.5.3.1.4.5.2']]]/hl7:act[hl7:templateId[@root = '1.2.40.0.34.6.0.11.3.20'] and hl7:templateId[@root = '2.16.840.1.113883.10.20.1.27'] and hl7:templateId[@root = '1.3.6.1.4.1.19376.1.5.3.1.4.5.1'] and hl7:templateId[@root = '1.3.6.1.4.1.19376.1.5.3.1.4.5.2']]/hl7:entryRelationship[@typeCode='SUBJ'][not(@nullFlavor)]/hl7:observation[hl7:templateId[@root = '1.2.40.0.34.6.0.11.3.21'] and hl7:templateId[@root = '2.16.840.1.113883.10.20.1.28'] and hl7:templateId[@root = '1.3.6.1.4.1.19376.1.5.3.1.4.5']]/hl7:participant[hl7:templateId[@root = '1.2.40.0.34.6.0.11.9.47']]/hl7:participantRole[not(@nullFlavor)]/hl7:playingEntity/hl7:name[not(@nullFlavor)]/*[not(@xsi:nil = 'true')][not(self::hl7:prefix | self::hl7:family[not(@nullFlavor)] | self::hl7:given[not(@nullFlavor)] | self::hl7:suffix)]"
         id="d1360436e124-true-d1360733e0">
      <assert role="error"
              see="http://elga.art-decor.org/elgaimpf-html-20250116T125121/tmp-1.2.40.0.34.6.0.11.3.20-2019-05-29T150252.html"
              test="not(.)">(atcdabbr_entry_ExpositionsrisikoProblemConcern)/d1360436e124-true-d1360733e0: '<value-of select="name(..)"/>' ist als geschlossen definiert und dieses Element '<name/>' ist nicht erlaubt oder nicht mit diesem Inhalt erlaubt. Dies kann templateId, code oder id betreffen. Erwartet:  hl7:prefix | hl7:family[not(@nullFlavor)] | hl7:given[not(@nullFlavor)] | hl7:suffix (rule-reference: d1360436e124-true-d1360733e0)</assert>
   </rule>

   <!-- Checking undefined contents for template/element @isClosed="true". Match context that we did not already match -->
   <rule fpi="RUL-QQQ"
         context="*[hl7:act[hl7:templateId[@root = '1.2.40.0.34.6.0.11.3.20'] and hl7:templateId[@root = '2.16.840.1.113883.10.20.1.27'] and hl7:templateId[@root = '1.3.6.1.4.1.19376.1.5.3.1.4.5.1'] and hl7:templateId[@root = '1.3.6.1.4.1.19376.1.5.3.1.4.5.2']]]/hl7:act[hl7:templateId[@root = '1.2.40.0.34.6.0.11.3.20'] and hl7:templateId[@root = '2.16.840.1.113883.10.20.1.27'] and hl7:templateId[@root = '1.3.6.1.4.1.19376.1.5.3.1.4.5.1'] and hl7:templateId[@root = '1.3.6.1.4.1.19376.1.5.3.1.4.5.2']]/hl7:entryRelationship[@typeCode='SUBJ'][not(@nullFlavor)]/hl7:observation[hl7:templateId[@root = '1.2.40.0.34.6.0.11.3.21'] and hl7:templateId[@root = '2.16.840.1.113883.10.20.1.28'] and hl7:templateId[@root = '1.3.6.1.4.1.19376.1.5.3.1.4.5']]/hl7:participant[hl7:templateId[@root = '1.2.40.0.34.6.0.11.9.47']]/hl7:participantRole[not(@nullFlavor)]/hl7:scopingEntity/*[not(@xsi:nil = 'true')][not(self::hl7:desc)]"
         id="d1360436e229-true-d1360767e0">
      <assert role="error"
              see="http://elga.art-decor.org/elgaimpf-html-20250116T125121/tmp-1.2.40.0.34.6.0.11.3.20-2019-05-29T150252.html"
              test="not(.)">(atcdabbr_entry_ExpositionsrisikoProblemConcern)/d1360436e229-true-d1360767e0: '<value-of select="name(..)"/>' ist als geschlossen definiert und dieses Element '<name/>' ist nicht erlaubt oder nicht mit diesem Inhalt erlaubt. Dies kann templateId, code oder id betreffen. Erwartet:  hl7:desc (rule-reference: d1360436e229-true-d1360767e0)</assert>
   </rule>

   <!-- Checking undefined contents for template/element @isClosed="true". Match context that we did not already match -->
   <rule fpi="RUL-QQQ"
         context="*[hl7:act[hl7:templateId[@root = '1.2.40.0.34.6.0.11.3.20'] and hl7:templateId[@root = '2.16.840.1.113883.10.20.1.27'] and hl7:templateId[@root = '1.3.6.1.4.1.19376.1.5.3.1.4.5.1'] and hl7:templateId[@root = '1.3.6.1.4.1.19376.1.5.3.1.4.5.2']]]/hl7:act[hl7:templateId[@root = '1.2.40.0.34.6.0.11.3.20'] and hl7:templateId[@root = '2.16.840.1.113883.10.20.1.27'] and hl7:templateId[@root = '1.3.6.1.4.1.19376.1.5.3.1.4.5.1'] and hl7:templateId[@root = '1.3.6.1.4.1.19376.1.5.3.1.4.5.2']]/hl7:reference[hl7:externalDocument[hl7:templateId[@root = '1.2.40.0.34.6.0.11.3.14']]]/*[not(@xsi:nil = 'true')][not(self::hl7:externalDocument[hl7:templateId[@root = '1.2.40.0.34.6.0.11.3.14']])]"
         id="d42e38103-true-d1360800e0">
      <assert role="error"
              see="http://elga.art-decor.org/elgaimpf-html-20250116T125121/tmp-1.2.40.0.34.6.0.11.3.20-2019-05-29T150252.html"
              test="not(.)">(atcdabbr_entry_ExpositionsrisikoProblemConcern)/d42e38103-true-d1360800e0: '<value-of select="name(..)"/>' ist als geschlossen definiert und dieses Element '<name/>' ist nicht erlaubt oder nicht mit diesem Inhalt erlaubt. Dies kann templateId, code oder id betreffen. Erwartet:  hl7:externalDocument[hl7:templateId[@root = '1.2.40.0.34.6.0.11.3.14']] (rule-reference: d42e38103-true-d1360800e0)</assert>
   </rule>

   <!-- Checking undefined contents for template/element @isClosed="true". Match context that we did not already match -->
   <rule fpi="RUL-QQQ"
         context="*[hl7:act[hl7:templateId[@root = '1.2.40.0.34.6.0.11.3.20'] and hl7:templateId[@root = '2.16.840.1.113883.10.20.1.27'] and hl7:templateId[@root = '1.3.6.1.4.1.19376.1.5.3.1.4.5.1'] and hl7:templateId[@root = '1.3.6.1.4.1.19376.1.5.3.1.4.5.2']]]/hl7:act[hl7:templateId[@root = '1.2.40.0.34.6.0.11.3.20'] and hl7:templateId[@root = '2.16.840.1.113883.10.20.1.27'] and hl7:templateId[@root = '1.3.6.1.4.1.19376.1.5.3.1.4.5.1'] and hl7:templateId[@root = '1.3.6.1.4.1.19376.1.5.3.1.4.5.2']]/hl7:reference[hl7:externalDocument[hl7:templateId[@root = '1.2.40.0.34.6.0.11.3.14']]]/hl7:externalDocument[hl7:templateId[@root = '1.2.40.0.34.6.0.11.3.14']]/*[not(@xsi:nil = 'true')][not(self::hl7:templateId[@root = '1.2.40.0.34.6.0.11.3.14'] | self::hl7:id[not(@nullFlavor)] | self::hl7:code | self::hl7:text | self::hl7:setId[not(@nullFlavor)] | self::hl7:versionNumber[not(@nullFlavor)])]"
         id="d1360777e24-true-d1360833e0">
      <assert role="error"
              see="http://elga.art-decor.org/elgaimpf-html-20250116T125121/tmp-1.2.40.0.34.6.0.11.3.20-2019-05-29T150252.html"
              test="not(.)">(atcdabbr_entry_ExpositionsrisikoProblemConcern)/d1360777e24-true-d1360833e0: '<value-of select="name(..)"/>' ist als geschlossen definiert und dieses Element '<name/>' ist nicht erlaubt oder nicht mit diesem Inhalt erlaubt. Dies kann templateId, code oder id betreffen. Erwartet:  hl7:templateId[@root = '1.2.40.0.34.6.0.11.3.14'] | hl7:id[not(@nullFlavor)] | hl7:code | hl7:text | hl7:setId[not(@nullFlavor)] | hl7:versionNumber[not(@nullFlavor)] (rule-reference: d1360777e24-true-d1360833e0)</assert>
   </rule>

   <!-- Checking undefined contents for template/element @isClosed="true". Match context that we did not already match -->
   <rule fpi="RUL-QQQ"
         context="*[hl7:act[hl7:templateId[@root = '1.2.40.0.34.6.0.11.3.20'] and hl7:templateId[@root = '2.16.840.1.113883.10.20.1.27'] and hl7:templateId[@root = '1.3.6.1.4.1.19376.1.5.3.1.4.5.1'] and hl7:templateId[@root = '1.3.6.1.4.1.19376.1.5.3.1.4.5.2']]]/hl7:act[hl7:templateId[@root = '1.2.40.0.34.6.0.11.3.20'] and hl7:templateId[@root = '2.16.840.1.113883.10.20.1.27'] and hl7:templateId[@root = '1.3.6.1.4.1.19376.1.5.3.1.4.5.1'] and hl7:templateId[@root = '1.3.6.1.4.1.19376.1.5.3.1.4.5.2']]/hl7:reference[hl7:externalDocument[hl7:templateId[@root = '1.2.40.0.34.6.0.11.3.14']]]/hl7:externalDocument[hl7:templateId[@root = '1.2.40.0.34.6.0.11.3.14']]/hl7:text/*[not(@xsi:nil = 'true')][not(self::hl7:reference[not(@nullFlavor)])]"
         id="d1360853e54-true-d1360865e0">
      <assert role="error"
              see="http://elga.art-decor.org/elgaimpf-html-20250116T125121/tmp-1.2.40.0.34.6.0.11.9.1-2021-05-06T093820.html"
              test="not(.)">(atcdabrr_other_NarrativeTextReference)/d1360853e54-true-d1360865e0: '<value-of select="name(..)"/>' ist als geschlossen definiert und dieses Element '<name/>' ist nicht erlaubt oder nicht mit diesem Inhalt erlaubt. Dies kann templateId, code oder id betreffen. Erwartet:  hl7:reference[not(@nullFlavor)] (rule-reference: d1360853e54-true-d1360865e0)</assert>
   </rule>
</pattern>
