<?xml version="1.0" encoding="UTF-8"?>
<!-- 
    DTR1 GLIST - Generated Sequence
    Status: draft
-->
<rule xmlns="http://purl.oclc.org/dsdl/schematron"
      abstract="true"
      id="GLIST"
      see="https://docs.art-decor.org/documentation/datatypes/DTr1_GLIST">
    <extends rule="ANY"/>
</rule>
