<?xml version="1.0" encoding="UTF-8"?>
<!--
Template derived pattern
===========================================
ID: 1.2.40.0.34.6.0.11.3.10
Name: Immunization Schedule Entry
Description: 
                 Impfschema bzw. Plan der notwendigen Impfdosen (als Sequenz von Dosiskennungen). 
                 Stellt das Regelwerk für die Verabreichung von Impfdosen bzw. Teilimpfungen zur Immunisierung, Grundimmunisierung und Auffrischung dar. 
                 Wird bei einer Impfung kein Impfschema angegeben, wird das "Default-Schema" angenommen. 
                 Dieses Template wird nicht nur von Immunization Entry, sondern auch für Empfehlungen von Immunization Recommendation Entry verwendet. Bei Empfehlungen kann die Dosis-Angabe in criterion/value entfallen, wenn: 
                 
                     
                         Keine weitere Impfung empfohlen wird - -> nullFlavor="NA" (not applicable) 
                     
                     
                         Keine Impfung berechnet werden kann - -> nullFlavor="NAV" (not available) 
                     
                     
                         Der Arzt eine Individuelle Empfehlung ausspricht - -> nullFlav
-->
<pattern xmlns="http://purl.oclc.org/dsdl/schematron"
         id="template-1.2.40.0.34.6.0.11.3.10-2023-04-05T100925-closed">
   <title>Immunization Schedule Entry</title>

   <!-- Checking undefined contents for template/element @isClosed="true". Match context that we did not already match -->
   <rule fpi="RUL-QQQ"
         context="*[hl7:criterion[hl7:templateId[@root = '1.2.40.0.34.6.0.11.3.10']]]/*[not(@xsi:nil = 'true')][not(self::hl7:criterion[hl7:templateId[@root = '1.2.40.0.34.6.0.11.3.10']])]"
         id="d42e29326-true-d1169354e0">
      <assert role="error"
              see="http://elga.art-decor.org/elgaimpf-html-20250116T125121/tmp-1.2.40.0.34.6.0.11.3.10-2023-04-05T100925.html"
              test="not(.)">(atcdabbr_entry_ImmunizationSchedule)/d42e29326-true-d1169354e0: '<value-of select="name(..)"/>' ist als geschlossen definiert und dieses Element '<name/>' ist nicht erlaubt oder nicht mit diesem Inhalt erlaubt. Dies kann templateId, code oder id betreffen. Erwartet:  hl7:criterion[hl7:templateId[@root = '1.2.40.0.34.6.0.11.3.10']] (rule-reference: d42e29326-true-d1169354e0)</assert>
   </rule>

   <!-- Checking undefined contents for template/element @isClosed="true". Match context that we did not already match -->
   <rule fpi="RUL-QQQ"
         context="*[hl7:criterion[hl7:templateId[@root = '1.2.40.0.34.6.0.11.3.10']]]/hl7:criterion[hl7:templateId[@root = '1.2.40.0.34.6.0.11.3.10']]/*[not(@xsi:nil = 'true')][not(self::hl7:templateId[@root = '1.2.40.0.34.6.0.11.3.10'] | self::hl7:code[concat(@code, @codeSystem) = doc('include/voc-1.2.40.0.34.6.0.10.5-DYNAMIC.xml')//valueSet[1]/conceptList/concept/concat(@code, @codeSystem)] | self::hl7:code[@nullFlavor='NI'] | self::hl7:text | self::hl7:value[not(@nullFlavor)] | self::hl7:value[@nullFlavor='UNK'] | self::hl7:value[@nullFlavor='NAV'] | self::hl7:value[@nullFlavor='NA'])]"
         id="d42e29389-true-d1169384e0">
      <assert role="error"
              see="http://elga.art-decor.org/elgaimpf-html-20250116T125121/tmp-1.2.40.0.34.6.0.11.3.10-2023-04-05T100925.html"
              test="not(.)">(atcdabbr_entry_ImmunizationSchedule)/d42e29389-true-d1169384e0: '<value-of select="name(..)"/>' ist als geschlossen definiert und dieses Element '<name/>' ist nicht erlaubt oder nicht mit diesem Inhalt erlaubt. Dies kann templateId, code oder id betreffen. Erwartet:  hl7:templateId[@root = '1.2.40.0.34.6.0.11.3.10'] | hl7:code[concat(@code, @codeSystem) = doc('include/voc-1.2.40.0.34.6.0.10.5-DYNAMIC.xml')//valueSet[1]/conceptList/concept/concat(@code, @codeSystem)] | hl7:code[@nullFlavor='NI'] | hl7:text | hl7:value[not(@nullFlavor)] | hl7:value[@nullFlavor='UNK'] | hl7:value[@nullFlavor='NAV'] | hl7:value[@nullFlavor='NA'] (rule-reference: d42e29389-true-d1169384e0)</assert>
   </rule>

   <!-- Checking undefined contents for template/element @isClosed="true". Match context that we did not already match -->
   <rule fpi="RUL-QQQ"
         context="*[hl7:criterion[hl7:templateId[@root = '1.2.40.0.34.6.0.11.3.10']]]/hl7:criterion[hl7:templateId[@root = '1.2.40.0.34.6.0.11.3.10']]/hl7:text/*[not(@xsi:nil = 'true')][not(self::hl7:reference[not(@nullFlavor)])]"
         id="d1169405e54-true-d1169417e0">
      <assert role="error"
              see="http://elga.art-decor.org/elgaimpf-html-20250116T125121/tmp-1.2.40.0.34.6.0.11.9.1-2021-05-06T093820.html"
              test="not(.)">(atcdabrr_other_NarrativeTextReference)/d1169405e54-true-d1169417e0: '<value-of select="name(..)"/>' ist als geschlossen definiert und dieses Element '<name/>' ist nicht erlaubt oder nicht mit diesem Inhalt erlaubt. Dies kann templateId, code oder id betreffen. Erwartet:  hl7:reference[not(@nullFlavor)] (rule-reference: d1169405e54-true-d1169417e0)</assert>
   </rule>

   <!-- Checking undefined contents for template/element @isClosed="true". Match context that we did not already match -->
   <rule fpi="RUL-QQQ"
         context="*[hl7:criterion[hl7:templateId[@root = '1.2.40.0.34.6.0.11.3.10']]]/hl7:criterion[hl7:templateId[@root = '1.2.40.0.34.6.0.11.3.10']]/hl7:value[not(@nullFlavor)]/*[not(@xsi:nil = 'true')][not(self::hl7:originalText)]"
         id="d42e29475-true-d1169433e0">
      <assert role="error"
              see="http://elga.art-decor.org/elgaimpf-html-20250116T125121/tmp-1.2.40.0.34.6.0.11.3.10-2023-04-05T100925.html"
              test="not(.)">(atcdabbr_entry_ImmunizationSchedule)/d42e29475-true-d1169433e0: '<value-of select="name(..)"/>' ist als geschlossen definiert und dieses Element '<name/>' ist nicht erlaubt oder nicht mit diesem Inhalt erlaubt. Dies kann templateId, code oder id betreffen. Erwartet:  hl7:originalText (rule-reference: d42e29475-true-d1169433e0)</assert>
   </rule>

   <!-- Checking undefined contents for template/element @isClosed="true". Match context that we did not already match -->
   <rule fpi="RUL-QQQ"
         context="*[hl7:criterion[hl7:templateId[@root = '1.2.40.0.34.6.0.11.3.10']]]/hl7:criterion[hl7:templateId[@root = '1.2.40.0.34.6.0.11.3.10']]/hl7:value[not(@nullFlavor)]/hl7:originalText/*[not(@xsi:nil = 'true')][not(self::hl7:reference[not(@nullFlavor)])]"
         id="d1169437e41-true-d1169449e0">
      <assert role="error"
              see="http://elga.art-decor.org/elgaimpf-html-20250116T125121/tmp-1.2.40.0.34.6.0.11.9.2-2021-02-19T133148.html"
              test="not(.)">(atcdabbr_other_OriginalTextReference)/d1169437e41-true-d1169449e0: '<value-of select="name(..)"/>' ist als geschlossen definiert und dieses Element '<name/>' ist nicht erlaubt oder nicht mit diesem Inhalt erlaubt. Dies kann templateId, code oder id betreffen. Erwartet:  hl7:reference[not(@nullFlavor)] (rule-reference: d1169437e41-true-d1169449e0)</assert>
   </rule>
</pattern>
