<?xml version="1.0" encoding="UTF-8"?>
<!--
Template derived pattern
===========================================
ID: 1.2.40.0.34.6.0.11.3.1
Name: Immunization Entry
Description: Enthält die Dokumentation einer einzelnen Impfung (einzelne Gabe eines Impfstoffes). Wird die  Nachtragung  einer Impfung dokumentiert,  MUSS  dies durch das Element participant/@typeCode = "ENT" gekennzeichnet sein (M [1..1]).
-->
<pattern xmlns="http://purl.oclc.org/dsdl/schematron"
         id="template-1.2.40.0.34.6.0.11.3.1-2021-02-19T124649-closed">
   <title>Immunization Entry</title>

   <!-- Checking undefined contents for template/element @isClosed="true". Match context that we did not already match -->
   <rule fpi="RUL-QQQ"
         context="*[hl7:substanceAdministration[hl7:templateId[@root = '1.2.40.0.34.6.0.11.3.1'] and hl7:templateId[@root = '2.16.840.1.113883.10.20.1.24'] and hl7:templateId[@root = '1.3.6.1.4.1.19376.1.5.3.1.4.12']]]/*[not(@xsi:nil = 'true')][not(self::hl7:substanceAdministration[hl7:templateId[@root = '1.2.40.0.34.6.0.11.3.1'] and hl7:templateId[@root = '2.16.840.1.113883.10.20.1.24'] and hl7:templateId[@root = '1.3.6.1.4.1.19376.1.5.3.1.4.12']])]"
         id="d42e27947-true-d1159289e0">
      <assert role="error"
              see="http://elga.art-decor.org/elgaimpf-html-20250116T125121/tmp-1.2.40.0.34.6.0.11.3.1-2021-02-19T124649.html"
              test="not(.)">(atcdabbr_entry_Immunization)/d42e27947-true-d1159289e0: '<value-of select="name(..)"/>' ist als geschlossen definiert und dieses Element '<name/>' ist nicht erlaubt oder nicht mit diesem Inhalt erlaubt. Dies kann templateId, code oder id betreffen. Erwartet:  hl7:substanceAdministration[hl7:templateId[@root = '1.2.40.0.34.6.0.11.3.1'] and hl7:templateId[@root = '2.16.840.1.113883.10.20.1.24'] and hl7:templateId[@root = '1.3.6.1.4.1.19376.1.5.3.1.4.12']] (rule-reference: d42e27947-true-d1159289e0)</assert>
   </rule>

   <!-- Checking undefined contents for template/element @isClosed="true". Match context that we did not already match -->
   <rule fpi="RUL-QQQ"
         context="*[hl7:substanceAdministration[hl7:templateId[@root = '1.2.40.0.34.6.0.11.3.1'] and hl7:templateId[@root = '2.16.840.1.113883.10.20.1.24'] and hl7:templateId[@root = '1.3.6.1.4.1.19376.1.5.3.1.4.12']]]/hl7:substanceAdministration[hl7:templateId[@root = '1.2.40.0.34.6.0.11.3.1'] and hl7:templateId[@root = '2.16.840.1.113883.10.20.1.24'] and hl7:templateId[@root = '1.3.6.1.4.1.19376.1.5.3.1.4.12']]/*[not(@xsi:nil = 'true')][not(self::hl7:templateId[@root = '1.2.40.0.34.6.0.11.3.1'] | self::hl7:templateId[@root = '2.16.840.1.113883.10.20.1.24'] | self::hl7:templateId[@root = '1.3.6.1.4.1.19376.1.5.3.1.4.12'] | self::hl7:id[not(@nullFlavor)] | self::hl7:code[(@code = 'IMMUNIZ' and @codeSystem = '2.16.840.1.113883.5.4')] | self::hl7:text | self::hl7:statusCode[@code = 'completed'] | self::hl7:effectiveTime[not(@nullFlavor)] | self::hl7:effectiveTime[@nullFlavor='UNK'] | self::hl7:routeCode[@nullFlavor = 'NA'] | self::hl7:approachSiteCode[@nullFlavor = 'NA'] | self::hl7:doseQuantity[not(hl7:low|hl7:high|@nullFlavor)] | self::hl7:doseQuantity[@nullFlavor='UNK'] | self::hl7:consumable[hl7:manufacturedProduct/hl7:templateId[@root='1.2.40.0.34.6.0.11.9.32']] | self::hl7:consumable[hl7:manufacturedProduct/hl7:templateId[@root='1.2.40.0.34.6.0.11.9.31']] | self::hl7:performer[hl7:templateId[@root = '1.2.40.0.34.6.0.11.9.21']] | self::hl7:author[hl7:assignedAuthor] | self::hl7:participant[hl7:templateId[@root = '1.2.40.0.34.6.0.11.9.14']] | self::hl7:entryRelationship[hl7:observation[hl7:templateId[@root = '1.2.40.0.34.6.0.11.3.2']]] | self::hl7:entryRelationship[hl7:act[hl7:templateId[@root = '1.2.40.0.34.6.0.11.3.5']]] | self::hl7:reference[hl7:externalDocument[hl7:templateId[@root = '1.2.40.0.34.6.0.11.3.14']]] | self::hl7:precondition[hl7:criterion[hl7:templateId[@root = '1.2.40.0.34.6.0.11.3.10']]])]"
         id="d42e28132-true-d1159780e0">
      <assert role="error"
              see="http://elga.art-decor.org/elgaimpf-html-20250116T125121/tmp-1.2.40.0.34.6.0.11.3.1-2021-02-19T124649.html"
              test="not(.)">(atcdabbr_entry_Immunization)/d42e28132-true-d1159780e0: '<value-of select="name(..)"/>' ist als geschlossen definiert und dieses Element '<name/>' ist nicht erlaubt oder nicht mit diesem Inhalt erlaubt. Dies kann templateId, code oder id betreffen. Erwartet:  hl7:templateId[@root = '1.2.40.0.34.6.0.11.3.1'] | hl7:templateId[@root = '2.16.840.1.113883.10.20.1.24'] | hl7:templateId[@root = '1.3.6.1.4.1.19376.1.5.3.1.4.12'] | hl7:id[not(@nullFlavor)] | hl7:code[(@code = 'IMMUNIZ' and @codeSystem = '2.16.840.1.113883.5.4')] | hl7:text | hl7:statusCode[@code = 'completed'] | hl7:effectiveTime[not(@nullFlavor)] | hl7:effectiveTime[@nullFlavor='UNK'] | hl7:routeCode[@nullFlavor = 'NA'] | hl7:approachSiteCode[@nullFlavor = 'NA'] | hl7:doseQuantity[not(hl7:low|hl7:high|@nullFlavor)] | hl7:doseQuantity[@nullFlavor='UNK'] | hl7:consumable[hl7:manufacturedProduct/hl7:templateId[@root='1.2.40.0.34.6.0.11.9.32']] | hl7:consumable[hl7:manufacturedProduct/hl7:templateId[@root='1.2.40.0.34.6.0.11.9.31']] | hl7:performer[hl7:templateId[@root = '1.2.40.0.34.6.0.11.9.21']] | hl7:author[hl7:assignedAuthor] | hl7:participant[hl7:templateId[@root = '1.2.40.0.34.6.0.11.9.14']] | hl7:entryRelationship[hl7:observation[hl7:templateId[@root = '1.2.40.0.34.6.0.11.3.2']]] | hl7:entryRelationship[hl7:act[hl7:templateId[@root = '1.2.40.0.34.6.0.11.3.5']]] | hl7:reference[hl7:externalDocument[hl7:templateId[@root = '1.2.40.0.34.6.0.11.3.14']]] | hl7:precondition[hl7:criterion[hl7:templateId[@root = '1.2.40.0.34.6.0.11.3.10']]] (rule-reference: d42e28132-true-d1159780e0)</assert>
   </rule>

   <!-- Checking undefined contents for template/element @isClosed="true". Match context that we did not already match -->
   <rule fpi="RUL-QQQ"
         context="*[hl7:substanceAdministration[hl7:templateId[@root = '1.2.40.0.34.6.0.11.3.1'] and hl7:templateId[@root = '2.16.840.1.113883.10.20.1.24'] and hl7:templateId[@root = '1.3.6.1.4.1.19376.1.5.3.1.4.12']]]/hl7:substanceAdministration[hl7:templateId[@root = '1.2.40.0.34.6.0.11.3.1'] and hl7:templateId[@root = '2.16.840.1.113883.10.20.1.24'] and hl7:templateId[@root = '1.3.6.1.4.1.19376.1.5.3.1.4.12']]/hl7:text/*[not(@xsi:nil = 'true')][not(self::hl7:reference[not(@nullFlavor)])]"
         id="d1159813e54-true-d1159825e0">
      <assert role="error"
              see="http://elga.art-decor.org/elgaimpf-html-20250116T125121/tmp-1.2.40.0.34.6.0.11.9.1-2021-05-06T093820.html"
              test="not(.)">(atcdabrr_other_NarrativeTextReference)/d1159813e54-true-d1159825e0: '<value-of select="name(..)"/>' ist als geschlossen definiert und dieses Element '<name/>' ist nicht erlaubt oder nicht mit diesem Inhalt erlaubt. Dies kann templateId, code oder id betreffen. Erwartet:  hl7:reference[not(@nullFlavor)] (rule-reference: d1159813e54-true-d1159825e0)</assert>
   </rule>

   <!-- Checking undefined contents for template/element @isClosed="true". Match context that we did not already match -->
   <rule fpi="RUL-QQQ"
         context="*[hl7:substanceAdministration[hl7:templateId[@root = '1.2.40.0.34.6.0.11.3.1'] and hl7:templateId[@root = '2.16.840.1.113883.10.20.1.24'] and hl7:templateId[@root = '1.3.6.1.4.1.19376.1.5.3.1.4.12']]]/hl7:substanceAdministration[hl7:templateId[@root = '1.2.40.0.34.6.0.11.3.1'] and hl7:templateId[@root = '2.16.840.1.113883.10.20.1.24'] and hl7:templateId[@root = '1.3.6.1.4.1.19376.1.5.3.1.4.12']]/hl7:doseQuantity[not(hl7:low|hl7:high|@nullFlavor)]/*[not(@xsi:nil = 'true')][not(self::hl7:low | self::hl7:center | self::hl7:width | self::hl7:high)]"
         id="d42e28268-true-d1159879e0">
      <assert role="error"
              see="http://elga.art-decor.org/elgaimpf-html-20250116T125121/tmp-1.2.40.0.34.6.0.11.3.1-2021-02-19T124649.html"
              test="not(.)">(atcdabbr_entry_Immunization)/d42e28268-true-d1159879e0: '<value-of select="name(..)"/>' ist als geschlossen definiert und dieses Element '<name/>' ist nicht erlaubt oder nicht mit diesem Inhalt erlaubt. Dies kann templateId, code oder id betreffen. Erwartet:  hl7:low | hl7:center | hl7:width | hl7:high (rule-reference: d42e28268-true-d1159879e0)</assert>
   </rule>

   <!-- Checking undefined contents for template/element @isClosed="true". Match context that we did not already match -->
   <rule fpi="RUL-QQQ"
         context="*[hl7:substanceAdministration[hl7:templateId[@root = '1.2.40.0.34.6.0.11.3.1'] and hl7:templateId[@root = '2.16.840.1.113883.10.20.1.24'] and hl7:templateId[@root = '1.3.6.1.4.1.19376.1.5.3.1.4.12']]]/hl7:substanceAdministration[hl7:templateId[@root = '1.2.40.0.34.6.0.11.3.1'] and hl7:templateId[@root = '2.16.840.1.113883.10.20.1.24'] and hl7:templateId[@root = '1.3.6.1.4.1.19376.1.5.3.1.4.12']]/hl7:consumable[hl7:manufacturedProduct/hl7:templateId[@root='1.2.40.0.34.6.0.11.9.32']]/*[not(@xsi:nil = 'true')][not(self::hl7:manufacturedProduct[hl7:templateId[@root = '1.2.40.0.34.6.0.11.9.32'] and hl7:templateId[@root = '1.3.6.1.4.1.19376.1.5.3.1.4.7.2'] and hl7:templateId[@root = '2.16.840.1.113883.10.20.1.53']])]"
         id="d42e28344-true-d1159961e0">
      <assert role="error"
              see="http://elga.art-decor.org/elgaimpf-html-20250116T125121/tmp-1.2.40.0.34.6.0.11.3.1-2021-02-19T124649.html"
              test="not(.)">(atcdabbr_entry_Immunization)/d42e28344-true-d1159961e0: '<value-of select="name(..)"/>' ist als geschlossen definiert und dieses Element '<name/>' ist nicht erlaubt oder nicht mit diesem Inhalt erlaubt. Dies kann templateId, code oder id betreffen. Erwartet:  hl7:manufacturedProduct[hl7:templateId[@root = '1.2.40.0.34.6.0.11.9.32'] and hl7:templateId[@root = '1.3.6.1.4.1.19376.1.5.3.1.4.7.2'] and hl7:templateId[@root = '2.16.840.1.113883.10.20.1.53']] (rule-reference: d42e28344-true-d1159961e0)</assert>
   </rule>

   <!-- Checking undefined contents for template/element @isClosed="true". Match context that we did not already match -->
   <rule fpi="RUL-QQQ"
         context="*[hl7:substanceAdministration[hl7:templateId[@root = '1.2.40.0.34.6.0.11.3.1'] and hl7:templateId[@root = '2.16.840.1.113883.10.20.1.24'] and hl7:templateId[@root = '1.3.6.1.4.1.19376.1.5.3.1.4.12']]]/hl7:substanceAdministration[hl7:templateId[@root = '1.2.40.0.34.6.0.11.3.1'] and hl7:templateId[@root = '2.16.840.1.113883.10.20.1.24'] and hl7:templateId[@root = '1.3.6.1.4.1.19376.1.5.3.1.4.12']]/hl7:consumable[hl7:manufacturedProduct/hl7:templateId[@root='1.2.40.0.34.6.0.11.9.32']]/hl7:manufacturedProduct[hl7:templateId[@root = '1.2.40.0.34.6.0.11.9.32'] and hl7:templateId[@root = '1.3.6.1.4.1.19376.1.5.3.1.4.7.2'] and hl7:templateId[@root = '2.16.840.1.113883.10.20.1.53']]/*[not(@xsi:nil = 'true')][not(self::hl7:templateId[@root = '1.2.40.0.34.6.0.11.9.32'] | self::hl7:templateId[@root = '1.3.6.1.4.1.19376.1.5.3.1.4.7.2'] | self::hl7:templateId[@root = '2.16.840.1.113883.10.20.1.53'] | self::hl7:id[not(@nullFlavor)] | self::hl7:manufacturedMaterial[hl7:templateId[@root = '1.3.6.1.4.1.19376.1.9.1.3.1']] | self::hl7:manufacturerOrganization)]"
         id="d1159907e7-true-d1160064e0">
      <assert role="error"
              see="http://elga.art-decor.org/elgaimpf-html-20250116T125121/tmp-1.2.40.0.34.6.0.11.3.1-2021-02-19T124649.html"
              test="not(.)">(atcdabbr_entry_Immunization)/d1159907e7-true-d1160064e0: '<value-of select="name(..)"/>' ist als geschlossen definiert und dieses Element '<name/>' ist nicht erlaubt oder nicht mit diesem Inhalt erlaubt. Dies kann templateId, code oder id betreffen. Erwartet:  hl7:templateId[@root = '1.2.40.0.34.6.0.11.9.32'] | hl7:templateId[@root = '1.3.6.1.4.1.19376.1.5.3.1.4.7.2'] | hl7:templateId[@root = '2.16.840.1.113883.10.20.1.53'] | hl7:id[not(@nullFlavor)] | hl7:manufacturedMaterial[hl7:templateId[@root = '1.3.6.1.4.1.19376.1.9.1.3.1']] | hl7:manufacturerOrganization (rule-reference: d1159907e7-true-d1160064e0)</assert>
   </rule>

   <!-- Checking undefined contents for template/element @isClosed="true". Match context that we did not already match -->
   <rule fpi="RUL-QQQ"
         context="*[hl7:substanceAdministration[hl7:templateId[@root = '1.2.40.0.34.6.0.11.3.1'] and hl7:templateId[@root = '2.16.840.1.113883.10.20.1.24'] and hl7:templateId[@root = '1.3.6.1.4.1.19376.1.5.3.1.4.12']]]/hl7:substanceAdministration[hl7:templateId[@root = '1.2.40.0.34.6.0.11.3.1'] and hl7:templateId[@root = '2.16.840.1.113883.10.20.1.24'] and hl7:templateId[@root = '1.3.6.1.4.1.19376.1.5.3.1.4.12']]/hl7:consumable[hl7:manufacturedProduct/hl7:templateId[@root='1.2.40.0.34.6.0.11.9.32']]/hl7:manufacturedProduct[hl7:templateId[@root = '1.2.40.0.34.6.0.11.9.32'] and hl7:templateId[@root = '1.3.6.1.4.1.19376.1.5.3.1.4.7.2'] and hl7:templateId[@root = '2.16.840.1.113883.10.20.1.53']]/hl7:manufacturedMaterial[hl7:templateId[@root = '1.3.6.1.4.1.19376.1.9.1.3.1']]/*[not(@xsi:nil = 'true')][not(self::hl7:templateId[@root = '1.3.6.1.4.1.19376.1.9.1.3.1'] | self::hl7:code[concat(@code, @codeSystem) = doc('include/voc-1.2.40.0.34.6.0.10.14-DYNAMIC.xml')//valueSet[1]/conceptList/concept/concat(@code, @codeSystem) or concat(@code, @codeSystem) = doc('include/voc-1.2.40.0.34.6.0.10.10-DYNAMIC.xml')//valueSet[1]/conceptList/concept/concat(@code, @codeSystem) or @nullFlavor] | self::hl7:name | self::hl7:lotNumberText[not(@nullFlavor)] | self::hl7:lotNumberText[@nullFlavor='NA'] | self::hl7:lotNumberText[@nullFlavor='UNK'] | self::pharm:ingredient[pharm:ingredient])]"
         id="d1159907e52-true-d1160135e0">
      <assert role="error"
              see="http://elga.art-decor.org/elgaimpf-html-20250116T125121/tmp-1.2.40.0.34.6.0.11.3.1-2021-02-19T124649.html"
              test="not(.)">(atcdabbr_entry_Immunization)/d1159907e52-true-d1160135e0: '<value-of select="name(..)"/>' ist als geschlossen definiert und dieses Element '<name/>' ist nicht erlaubt oder nicht mit diesem Inhalt erlaubt. Dies kann templateId, code oder id betreffen. Erwartet:  hl7:templateId[@root = '1.3.6.1.4.1.19376.1.9.1.3.1'] | hl7:code[concat(@code, @codeSystem) = doc('include/voc-1.2.40.0.34.6.0.10.14-DYNAMIC.xml')//valueSet[1]/conceptList/concept/concat(@code, @codeSystem) or concat(@code, @codeSystem) = doc('include/voc-1.2.40.0.34.6.0.10.10-DYNAMIC.xml')//valueSet[1]/conceptList/concept/concat(@code, @codeSystem) or @nullFlavor] | hl7:name | hl7:lotNumberText[not(@nullFlavor)] | hl7:lotNumberText[@nullFlavor='NA'] | hl7:lotNumberText[@nullFlavor='UNK'] | pharm:ingredient[pharm:ingredient] (rule-reference: d1159907e52-true-d1160135e0)</assert>
   </rule>

   <!-- Checking undefined contents for template/element @isClosed="true". Match context that we did not already match -->
   <rule fpi="RUL-QQQ"
         context="*[hl7:substanceAdministration[hl7:templateId[@root = '1.2.40.0.34.6.0.11.3.1'] and hl7:templateId[@root = '2.16.840.1.113883.10.20.1.24'] and hl7:templateId[@root = '1.3.6.1.4.1.19376.1.5.3.1.4.12']]]/hl7:substanceAdministration[hl7:templateId[@root = '1.2.40.0.34.6.0.11.3.1'] and hl7:templateId[@root = '2.16.840.1.113883.10.20.1.24'] and hl7:templateId[@root = '1.3.6.1.4.1.19376.1.5.3.1.4.12']]/hl7:consumable[hl7:manufacturedProduct/hl7:templateId[@root='1.2.40.0.34.6.0.11.9.32']]/hl7:manufacturedProduct[hl7:templateId[@root = '1.2.40.0.34.6.0.11.9.32'] and hl7:templateId[@root = '1.3.6.1.4.1.19376.1.5.3.1.4.7.2'] and hl7:templateId[@root = '2.16.840.1.113883.10.20.1.53']]/hl7:manufacturedMaterial[hl7:templateId[@root = '1.3.6.1.4.1.19376.1.9.1.3.1']]/hl7:code[concat(@code, @codeSystem) = doc('include/voc-1.2.40.0.34.6.0.10.14-DYNAMIC.xml')//valueSet[1]/conceptList/concept/concat(@code, @codeSystem) or concat(@code, @codeSystem) = doc('include/voc-1.2.40.0.34.6.0.10.10-DYNAMIC.xml')//valueSet[1]/conceptList/concept/concat(@code, @codeSystem) or @nullFlavor]/*[not(@xsi:nil = 'true')][not(self::hl7:originalText | self::hl7:translation)]"
         id="d1159907e66-true-d1160167e0">
      <assert role="error"
              see="http://elga.art-decor.org/elgaimpf-html-20250116T125121/tmp-1.2.40.0.34.6.0.11.3.1-2021-02-19T124649.html"
              test="not(.)">(atcdabbr_entry_Immunization)/d1159907e66-true-d1160167e0: '<value-of select="name(..)"/>' ist als geschlossen definiert und dieses Element '<name/>' ist nicht erlaubt oder nicht mit diesem Inhalt erlaubt. Dies kann templateId, code oder id betreffen. Erwartet:  hl7:originalText | hl7:translation (rule-reference: d1159907e66-true-d1160167e0)</assert>
   </rule>

   <!-- Checking undefined contents for template/element @isClosed="true". Match context that we did not already match -->
   <rule fpi="RUL-QQQ"
         context="*[hl7:substanceAdministration[hl7:templateId[@root = '1.2.40.0.34.6.0.11.3.1'] and hl7:templateId[@root = '2.16.840.1.113883.10.20.1.24'] and hl7:templateId[@root = '1.3.6.1.4.1.19376.1.5.3.1.4.12']]]/hl7:substanceAdministration[hl7:templateId[@root = '1.2.40.0.34.6.0.11.3.1'] and hl7:templateId[@root = '2.16.840.1.113883.10.20.1.24'] and hl7:templateId[@root = '1.3.6.1.4.1.19376.1.5.3.1.4.12']]/hl7:consumable[hl7:manufacturedProduct/hl7:templateId[@root='1.2.40.0.34.6.0.11.9.32']]/hl7:manufacturedProduct[hl7:templateId[@root = '1.2.40.0.34.6.0.11.9.32'] and hl7:templateId[@root = '1.3.6.1.4.1.19376.1.5.3.1.4.7.2'] and hl7:templateId[@root = '2.16.840.1.113883.10.20.1.53']]/hl7:manufacturedMaterial[hl7:templateId[@root = '1.3.6.1.4.1.19376.1.9.1.3.1']]/hl7:code[concat(@code, @codeSystem) = doc('include/voc-1.2.40.0.34.6.0.10.14-DYNAMIC.xml')//valueSet[1]/conceptList/concept/concat(@code, @codeSystem) or concat(@code, @codeSystem) = doc('include/voc-1.2.40.0.34.6.0.10.10-DYNAMIC.xml')//valueSet[1]/conceptList/concept/concat(@code, @codeSystem) or @nullFlavor]/hl7:originalText/*[not(@xsi:nil = 'true')][not(self::hl7:reference[not(@nullFlavor)])]"
         id="d1160171e41-true-d1160183e0">
      <assert role="error"
              see="http://elga.art-decor.org/elgaimpf-html-20250116T125121/tmp-1.2.40.0.34.6.0.11.9.2-2021-02-19T133148.html"
              test="not(.)">(atcdabbr_other_OriginalTextReference)/d1160171e41-true-d1160183e0: '<value-of select="name(..)"/>' ist als geschlossen definiert und dieses Element '<name/>' ist nicht erlaubt oder nicht mit diesem Inhalt erlaubt. Dies kann templateId, code oder id betreffen. Erwartet:  hl7:reference[not(@nullFlavor)] (rule-reference: d1160171e41-true-d1160183e0)</assert>
   </rule>

   <!-- Checking undefined contents for template/element @isClosed="true". Match context that we did not already match -->
   <rule fpi="RUL-QQQ"
         context="*[hl7:substanceAdministration[hl7:templateId[@root = '1.2.40.0.34.6.0.11.3.1'] and hl7:templateId[@root = '2.16.840.1.113883.10.20.1.24'] and hl7:templateId[@root = '1.3.6.1.4.1.19376.1.5.3.1.4.12']]]/hl7:substanceAdministration[hl7:templateId[@root = '1.2.40.0.34.6.0.11.3.1'] and hl7:templateId[@root = '2.16.840.1.113883.10.20.1.24'] and hl7:templateId[@root = '1.3.6.1.4.1.19376.1.5.3.1.4.12']]/hl7:consumable[hl7:manufacturedProduct/hl7:templateId[@root='1.2.40.0.34.6.0.11.9.32']]/hl7:manufacturedProduct[hl7:templateId[@root = '1.2.40.0.34.6.0.11.9.32'] and hl7:templateId[@root = '1.3.6.1.4.1.19376.1.5.3.1.4.7.2'] and hl7:templateId[@root = '2.16.840.1.113883.10.20.1.53']]/hl7:manufacturedMaterial[hl7:templateId[@root = '1.3.6.1.4.1.19376.1.9.1.3.1']]/pharm:ingredient[pharm:ingredient]/*[not(@xsi:nil = 'true')][not(self::pharm:ingredient[not(@nullFlavor)])]"
         id="d1159907e229-true-d1160221e0">
      <assert role="error"
              see="http://elga.art-decor.org/elgaimpf-html-20250116T125121/tmp-1.2.40.0.34.6.0.11.3.1-2021-02-19T124649.html"
              test="not(.)">(atcdabbr_entry_Immunization)/d1159907e229-true-d1160221e0: '<value-of select="name(..)"/>' ist als geschlossen definiert und dieses Element '<name/>' ist nicht erlaubt oder nicht mit diesem Inhalt erlaubt. Dies kann templateId, code oder id betreffen. Erwartet:  pharm:ingredient[not(@nullFlavor)] (rule-reference: d1159907e229-true-d1160221e0)</assert>
   </rule>

   <!-- Checking undefined contents for template/element @isClosed="true". Match context that we did not already match -->
   <rule fpi="RUL-QQQ"
         context="*[hl7:substanceAdministration[hl7:templateId[@root = '1.2.40.0.34.6.0.11.3.1'] and hl7:templateId[@root = '2.16.840.1.113883.10.20.1.24'] and hl7:templateId[@root = '1.3.6.1.4.1.19376.1.5.3.1.4.12']]]/hl7:substanceAdministration[hl7:templateId[@root = '1.2.40.0.34.6.0.11.3.1'] and hl7:templateId[@root = '2.16.840.1.113883.10.20.1.24'] and hl7:templateId[@root = '1.3.6.1.4.1.19376.1.5.3.1.4.12']]/hl7:consumable[hl7:manufacturedProduct/hl7:templateId[@root='1.2.40.0.34.6.0.11.9.32']]/hl7:manufacturedProduct[hl7:templateId[@root = '1.2.40.0.34.6.0.11.9.32'] and hl7:templateId[@root = '1.3.6.1.4.1.19376.1.5.3.1.4.7.2'] and hl7:templateId[@root = '2.16.840.1.113883.10.20.1.53']]/hl7:manufacturedMaterial[hl7:templateId[@root = '1.3.6.1.4.1.19376.1.9.1.3.1']]/pharm:ingredient[pharm:ingredient]/pharm:ingredient[not(@nullFlavor)]/*[not(@xsi:nil = 'true')][not(self::pharm:code | self::pharm:name)]"
         id="d1159907e236-true-d1160240e0">
      <assert role="error"
              see="http://elga.art-decor.org/elgaimpf-html-20250116T125121/tmp-1.2.40.0.34.6.0.11.3.1-2021-02-19T124649.html"
              test="not(.)">(atcdabbr_entry_Immunization)/d1159907e236-true-d1160240e0: '<value-of select="name(..)"/>' ist als geschlossen definiert und dieses Element '<name/>' ist nicht erlaubt oder nicht mit diesem Inhalt erlaubt. Dies kann templateId, code oder id betreffen. Erwartet:  pharm:code | pharm:name (rule-reference: d1159907e236-true-d1160240e0)</assert>
   </rule>

   <!-- Checking undefined contents for template/element @isClosed="true". Match context that we did not already match -->
   <rule fpi="RUL-QQQ"
         context="*[hl7:substanceAdministration[hl7:templateId[@root = '1.2.40.0.34.6.0.11.3.1'] and hl7:templateId[@root = '2.16.840.1.113883.10.20.1.24'] and hl7:templateId[@root = '1.3.6.1.4.1.19376.1.5.3.1.4.12']]]/hl7:substanceAdministration[hl7:templateId[@root = '1.2.40.0.34.6.0.11.3.1'] and hl7:templateId[@root = '2.16.840.1.113883.10.20.1.24'] and hl7:templateId[@root = '1.3.6.1.4.1.19376.1.5.3.1.4.12']]/hl7:consumable[hl7:manufacturedProduct/hl7:templateId[@root='1.2.40.0.34.6.0.11.9.32']]/hl7:manufacturedProduct[hl7:templateId[@root = '1.2.40.0.34.6.0.11.9.32'] and hl7:templateId[@root = '1.3.6.1.4.1.19376.1.5.3.1.4.7.2'] and hl7:templateId[@root = '2.16.840.1.113883.10.20.1.53']]/hl7:manufacturedMaterial[hl7:templateId[@root = '1.3.6.1.4.1.19376.1.9.1.3.1']]/pharm:ingredient[pharm:ingredient]/pharm:ingredient[not(@nullFlavor)]/pharm:code/*[not(@xsi:nil = 'true')][not(self::hl7:originalText | self::hl7:translation)]"
         id="d1159907e245-true-d1160259e0">
      <assert role="error"
              see="http://elga.art-decor.org/elgaimpf-html-20250116T125121/tmp-1.2.40.0.34.6.0.11.3.1-2021-02-19T124649.html"
              test="not(.)">(atcdabbr_entry_Immunization)/d1159907e245-true-d1160259e0: '<value-of select="name(..)"/>' ist als geschlossen definiert und dieses Element '<name/>' ist nicht erlaubt oder nicht mit diesem Inhalt erlaubt. Dies kann templateId, code oder id betreffen. Erwartet:  hl7:originalText | hl7:translation (rule-reference: d1159907e245-true-d1160259e0)</assert>
   </rule>

   <!-- Checking undefined contents for template/element @isClosed="true". Match context that we did not already match -->
   <rule fpi="RUL-QQQ"
         context="*[hl7:substanceAdministration[hl7:templateId[@root = '1.2.40.0.34.6.0.11.3.1'] and hl7:templateId[@root = '2.16.840.1.113883.10.20.1.24'] and hl7:templateId[@root = '1.3.6.1.4.1.19376.1.5.3.1.4.12']]]/hl7:substanceAdministration[hl7:templateId[@root = '1.2.40.0.34.6.0.11.3.1'] and hl7:templateId[@root = '2.16.840.1.113883.10.20.1.24'] and hl7:templateId[@root = '1.3.6.1.4.1.19376.1.5.3.1.4.12']]/hl7:consumable[hl7:manufacturedProduct/hl7:templateId[@root='1.2.40.0.34.6.0.11.9.32']]/hl7:manufacturedProduct[hl7:templateId[@root = '1.2.40.0.34.6.0.11.9.32'] and hl7:templateId[@root = '1.3.6.1.4.1.19376.1.5.3.1.4.7.2'] and hl7:templateId[@root = '2.16.840.1.113883.10.20.1.53']]/hl7:manufacturerOrganization/*[not(@xsi:nil = 'true')][not(self::hl7:id[not(@nullFlavor)] | self::hl7:name[not(@nullFlavor)] | self::hl7:telecom[not(@nullFlavor)] | self::hl7:addr[not(@nullFlavor)])]"
         id="d1159907e286-true-d1160305e0">
      <assert role="error"
              see="http://elga.art-decor.org/elgaimpf-html-20250116T125121/tmp-1.2.40.0.34.6.0.11.3.1-2021-02-19T124649.html"
              test="not(.)">(atcdabbr_entry_Immunization)/d1159907e286-true-d1160305e0: '<value-of select="name(..)"/>' ist als geschlossen definiert und dieses Element '<name/>' ist nicht erlaubt oder nicht mit diesem Inhalt erlaubt. Dies kann templateId, code oder id betreffen. Erwartet:  hl7:id[not(@nullFlavor)] | hl7:name[not(@nullFlavor)] | hl7:telecom[not(@nullFlavor)] | hl7:addr[not(@nullFlavor)] (rule-reference: d1159907e286-true-d1160305e0)</assert>
   </rule>

   <!-- Checking undefined contents for template/element @isClosed="true". Match context that we did not already match -->
   <rule fpi="RUL-QQQ"
         context="*[hl7:substanceAdministration[hl7:templateId[@root = '1.2.40.0.34.6.0.11.3.1'] and hl7:templateId[@root = '2.16.840.1.113883.10.20.1.24'] and hl7:templateId[@root = '1.3.6.1.4.1.19376.1.5.3.1.4.12']]]/hl7:substanceAdministration[hl7:templateId[@root = '1.2.40.0.34.6.0.11.3.1'] and hl7:templateId[@root = '2.16.840.1.113883.10.20.1.24'] and hl7:templateId[@root = '1.3.6.1.4.1.19376.1.5.3.1.4.12']]/hl7:consumable[hl7:manufacturedProduct/hl7:templateId[@root='1.2.40.0.34.6.0.11.9.32']]/hl7:manufacturedProduct[hl7:templateId[@root = '1.2.40.0.34.6.0.11.9.32'] and hl7:templateId[@root = '1.3.6.1.4.1.19376.1.5.3.1.4.7.2'] and hl7:templateId[@root = '2.16.840.1.113883.10.20.1.53']]/hl7:manufacturerOrganization/hl7:addr[not(@nullFlavor)]/*[not(@xsi:nil = 'true')][not(self::hl7:streetAddressLine | self::hl7:streetName | self::hl7:houseNumber | self::hl7:postalCode[not(@nullFlavor)] | self::hl7:city[not(@nullFlavor)] | self::hl7:state | self::hl7:country[not(@nullFlavor)] | self::hl7:additionalLocator)]"
         id="d1160279e63-true-d1160366e0">
      <assert role="error"
              see="http://elga.art-decor.org/elgaimpf-html-20250116T125121/tmp-1.2.40.0.34.6.0.11.3.1-2021-02-19T124649.html"
              test="not(.)">(atcdabbr_entry_Immunization)/d1160279e63-true-d1160366e0: '<value-of select="name(..)"/>' ist als geschlossen definiert und dieses Element '<name/>' ist nicht erlaubt oder nicht mit diesem Inhalt erlaubt. Dies kann templateId, code oder id betreffen. Erwartet:  hl7:streetAddressLine | hl7:streetName | hl7:houseNumber | hl7:postalCode[not(@nullFlavor)] | hl7:city[not(@nullFlavor)] | hl7:state | hl7:country[not(@nullFlavor)] | hl7:additionalLocator (rule-reference: d1160279e63-true-d1160366e0)</assert>
   </rule>

   <!-- Checking undefined contents for template/element @isClosed="true". Match context that we did not already match -->
   <rule fpi="RUL-QQQ"
         context="*[hl7:substanceAdministration[hl7:templateId[@root = '1.2.40.0.34.6.0.11.3.1'] and hl7:templateId[@root = '2.16.840.1.113883.10.20.1.24'] and hl7:templateId[@root = '1.3.6.1.4.1.19376.1.5.3.1.4.12']]]/hl7:substanceAdministration[hl7:templateId[@root = '1.2.40.0.34.6.0.11.3.1'] and hl7:templateId[@root = '2.16.840.1.113883.10.20.1.24'] and hl7:templateId[@root = '1.3.6.1.4.1.19376.1.5.3.1.4.12']]/hl7:consumable[hl7:manufacturedProduct/hl7:templateId[@root='1.2.40.0.34.6.0.11.9.31']]/*[not(@xsi:nil = 'true')][not(self::hl7:manufacturedProduct[hl7:templateId[@root = '1.2.40.0.34.6.0.11.9.31'] and hl7:templateId[@root = '2.16.840.1.113883.10.20.1.53'] and hl7:templateId[@root = '1.3.6.1.4.1.19376.1.5.3.1.4.7.2']])]"
         id="d42e28353-true-d1160427e0">
      <assert role="error"
              see="http://elga.art-decor.org/elgaimpf-html-20250116T125121/tmp-1.2.40.0.34.6.0.11.3.1-2021-02-19T124649.html"
              test="not(.)">(atcdabbr_entry_Immunization)/d42e28353-true-d1160427e0: '<value-of select="name(..)"/>' ist als geschlossen definiert und dieses Element '<name/>' ist nicht erlaubt oder nicht mit diesem Inhalt erlaubt. Dies kann templateId, code oder id betreffen. Erwartet:  hl7:manufacturedProduct[hl7:templateId[@root = '1.2.40.0.34.6.0.11.9.31'] and hl7:templateId[@root = '2.16.840.1.113883.10.20.1.53'] and hl7:templateId[@root = '1.3.6.1.4.1.19376.1.5.3.1.4.7.2']] (rule-reference: d42e28353-true-d1160427e0)</assert>
   </rule>

   <!-- Checking undefined contents for template/element @isClosed="true". Match context that we did not already match -->
   <rule fpi="RUL-QQQ"
         context="*[hl7:substanceAdministration[hl7:templateId[@root = '1.2.40.0.34.6.0.11.3.1'] and hl7:templateId[@root = '2.16.840.1.113883.10.20.1.24'] and hl7:templateId[@root = '1.3.6.1.4.1.19376.1.5.3.1.4.12']]]/hl7:substanceAdministration[hl7:templateId[@root = '1.2.40.0.34.6.0.11.3.1'] and hl7:templateId[@root = '2.16.840.1.113883.10.20.1.24'] and hl7:templateId[@root = '1.3.6.1.4.1.19376.1.5.3.1.4.12']]/hl7:consumable[hl7:manufacturedProduct/hl7:templateId[@root='1.2.40.0.34.6.0.11.9.31']]/hl7:manufacturedProduct[hl7:templateId[@root = '1.2.40.0.34.6.0.11.9.31'] and hl7:templateId[@root = '2.16.840.1.113883.10.20.1.53'] and hl7:templateId[@root = '1.3.6.1.4.1.19376.1.5.3.1.4.7.2']]/*[not(@xsi:nil = 'true')][not(self::hl7:templateId[@root = '1.2.40.0.34.6.0.11.9.31'] | self::hl7:templateId[@root = '2.16.840.1.113883.10.20.1.53'] | self::hl7:templateId[@root = '1.3.6.1.4.1.19376.1.5.3.1.4.7.2'] | self::hl7:manufacturedMaterial[not(@nullFlavor)][hl7:code[@nullFlavor = 'NA']])]"
         id="d1160411e3-true-d1160465e0">
      <assert role="error"
              see="http://elga.art-decor.org/elgaimpf-html-20250116T125121/tmp-1.2.40.0.34.6.0.11.3.1-2021-02-19T124649.html"
              test="not(.)">(atcdabbr_entry_Immunization)/d1160411e3-true-d1160465e0: '<value-of select="name(..)"/>' ist als geschlossen definiert und dieses Element '<name/>' ist nicht erlaubt oder nicht mit diesem Inhalt erlaubt. Dies kann templateId, code oder id betreffen. Erwartet:  hl7:templateId[@root = '1.2.40.0.34.6.0.11.9.31'] | hl7:templateId[@root = '2.16.840.1.113883.10.20.1.53'] | hl7:templateId[@root = '1.3.6.1.4.1.19376.1.5.3.1.4.7.2'] | hl7:manufacturedMaterial[not(@nullFlavor)][hl7:code[@nullFlavor = 'NA']] (rule-reference: d1160411e3-true-d1160465e0)</assert>
   </rule>

   <!-- Checking undefined contents for template/element @isClosed="true". Match context that we did not already match -->
   <rule fpi="RUL-QQQ"
         context="*[hl7:substanceAdministration[hl7:templateId[@root = '1.2.40.0.34.6.0.11.3.1'] and hl7:templateId[@root = '2.16.840.1.113883.10.20.1.24'] and hl7:templateId[@root = '1.3.6.1.4.1.19376.1.5.3.1.4.12']]]/hl7:substanceAdministration[hl7:templateId[@root = '1.2.40.0.34.6.0.11.3.1'] and hl7:templateId[@root = '2.16.840.1.113883.10.20.1.24'] and hl7:templateId[@root = '1.3.6.1.4.1.19376.1.5.3.1.4.12']]/hl7:consumable[hl7:manufacturedProduct/hl7:templateId[@root='1.2.40.0.34.6.0.11.9.31']]/hl7:manufacturedProduct[hl7:templateId[@root = '1.2.40.0.34.6.0.11.9.31'] and hl7:templateId[@root = '2.16.840.1.113883.10.20.1.53'] and hl7:templateId[@root = '1.3.6.1.4.1.19376.1.5.3.1.4.7.2']]/hl7:manufacturedMaterial[not(@nullFlavor)][hl7:code[@nullFlavor = 'NA']]/*[not(@xsi:nil = 'true')][not(self::hl7:code[@nullFlavor = 'NA'])]"
         id="d1160411e31-true-d1160497e0">
      <assert role="error"
              see="http://elga.art-decor.org/elgaimpf-html-20250116T125121/tmp-1.2.40.0.34.6.0.11.3.1-2021-02-19T124649.html"
              test="not(.)">(atcdabbr_entry_Immunization)/d1160411e31-true-d1160497e0: '<value-of select="name(..)"/>' ist als geschlossen definiert und dieses Element '<name/>' ist nicht erlaubt oder nicht mit diesem Inhalt erlaubt. Dies kann templateId, code oder id betreffen. Erwartet:  hl7:code[@nullFlavor = 'NA'] (rule-reference: d1160411e31-true-d1160497e0)</assert>
   </rule>

   <!-- Checking undefined contents for template/element @isClosed="true". Match context that we did not already match -->
   <rule fpi="RUL-QQQ"
         context="*[hl7:substanceAdministration[hl7:templateId[@root = '1.2.40.0.34.6.0.11.3.1'] and hl7:templateId[@root = '2.16.840.1.113883.10.20.1.24'] and hl7:templateId[@root = '1.3.6.1.4.1.19376.1.5.3.1.4.12']]]/hl7:substanceAdministration[hl7:templateId[@root = '1.2.40.0.34.6.0.11.3.1'] and hl7:templateId[@root = '2.16.840.1.113883.10.20.1.24'] and hl7:templateId[@root = '1.3.6.1.4.1.19376.1.5.3.1.4.12']]/hl7:performer[hl7:templateId[@root = '1.2.40.0.34.6.0.11.9.21']]/*[not(@xsi:nil = 'true')][not(self::hl7:templateId[@root = '1.2.40.0.34.6.0.11.9.21'] | self::hl7:time | self::hl7:assignedEntity[not(@nullFlavor)])]"
         id="d42e28359-true-d1160634e0">
      <assert role="error"
              see="http://elga.art-decor.org/elgaimpf-html-20250116T125121/tmp-1.2.40.0.34.6.0.11.3.1-2021-02-19T124649.html"
              test="not(.)">(atcdabbr_entry_Immunization)/d42e28359-true-d1160634e0: '<value-of select="name(..)"/>' ist als geschlossen definiert und dieses Element '<name/>' ist nicht erlaubt oder nicht mit diesem Inhalt erlaubt. Dies kann templateId, code oder id betreffen. Erwartet:  hl7:templateId[@root = '1.2.40.0.34.6.0.11.9.21'] | hl7:time | hl7:assignedEntity[not(@nullFlavor)] (rule-reference: d42e28359-true-d1160634e0)</assert>
   </rule>

   <!-- Checking undefined contents for template/element @isClosed="true". Match context that we did not already match -->
   <rule fpi="RUL-QQQ"
         context="*[hl7:substanceAdministration[hl7:templateId[@root = '1.2.40.0.34.6.0.11.3.1'] and hl7:templateId[@root = '2.16.840.1.113883.10.20.1.24'] and hl7:templateId[@root = '1.3.6.1.4.1.19376.1.5.3.1.4.12']]]/hl7:substanceAdministration[hl7:templateId[@root = '1.2.40.0.34.6.0.11.3.1'] and hl7:templateId[@root = '2.16.840.1.113883.10.20.1.24'] and hl7:templateId[@root = '1.3.6.1.4.1.19376.1.5.3.1.4.12']]/hl7:performer[hl7:templateId[@root = '1.2.40.0.34.6.0.11.9.21']]/hl7:assignedEntity[not(@nullFlavor)]/*[not(@xsi:nil = 'true')][not(self::hl7:id[not(@nullFlavor)] | self::hl7:id[@nullFlavor='NI'] | self::hl7:id[@nullFlavor='UNK'] | self::hl7:code[concat(@code, @codeSystem) = doc('include/voc-1.2.40.0.34.6.0.10.11-DYNAMIC.xml')//valueSet[1]/conceptList/concept/concat(@code, @codeSystem)] | self::hl7:code[@nullFlavor='UNK'] | self::hl7:addr[not(@nullFlavor)] | self::hl7:addr[@nullFlavor = 'UNK'] | self::hl7:telecom[not(@nullFlavor)] | self::hl7:assignedPerson | self::hl7:assignedPerson | self::hl7:representedOrganization)]"
         id="d1160507e47-true-d1160745e0">
      <assert role="error"
              see="http://elga.art-decor.org/elgaimpf-html-20250116T125121/tmp-1.2.40.0.34.6.0.11.3.1-2021-02-19T124649.html"
              test="not(.)">(atcdabbr_entry_Immunization)/d1160507e47-true-d1160745e0: '<value-of select="name(..)"/>' ist als geschlossen definiert und dieses Element '<name/>' ist nicht erlaubt oder nicht mit diesem Inhalt erlaubt. Dies kann templateId, code oder id betreffen. Erwartet:  hl7:id[not(@nullFlavor)] | hl7:id[@nullFlavor='NI'] | hl7:id[@nullFlavor='UNK'] | hl7:code[concat(@code, @codeSystem) = doc('include/voc-1.2.40.0.34.6.0.10.11-DYNAMIC.xml')//valueSet[1]/conceptList/concept/concat(@code, @codeSystem)] | hl7:code[@nullFlavor='UNK'] | hl7:addr[not(@nullFlavor)] | hl7:addr[@nullFlavor = 'UNK'] | hl7:telecom[not(@nullFlavor)] | hl7:assignedPerson | hl7:assignedPerson | hl7:representedOrganization (rule-reference: d1160507e47-true-d1160745e0)</assert>
   </rule>

   <!-- Checking undefined contents for template/element @isClosed="true". Match context that we did not already match -->
   <rule fpi="RUL-QQQ"
         context="*[hl7:substanceAdministration[hl7:templateId[@root = '1.2.40.0.34.6.0.11.3.1'] and hl7:templateId[@root = '2.16.840.1.113883.10.20.1.24'] and hl7:templateId[@root = '1.3.6.1.4.1.19376.1.5.3.1.4.12']]]/hl7:substanceAdministration[hl7:templateId[@root = '1.2.40.0.34.6.0.11.3.1'] and hl7:templateId[@root = '2.16.840.1.113883.10.20.1.24'] and hl7:templateId[@root = '1.3.6.1.4.1.19376.1.5.3.1.4.12']]/hl7:performer[hl7:templateId[@root = '1.2.40.0.34.6.0.11.9.21']]/hl7:assignedEntity[not(@nullFlavor)]/hl7:addr[not(@nullFlavor)]/*[not(@xsi:nil = 'true')][not(self::hl7:streetAddressLine | self::hl7:streetName | self::hl7:houseNumber | self::hl7:postalCode | self::hl7:city | self::hl7:state | self::hl7:country | self::hl7:additionalLocator)]"
         id="d1160507e137-true-d1160815e0">
      <assert role="error"
              see="http://elga.art-decor.org/elgaimpf-html-20250116T125121/tmp-1.2.40.0.34.6.0.11.3.1-2021-02-19T124649.html"
              test="not(.)">(atcdabbr_entry_Immunization)/d1160507e137-true-d1160815e0: '<value-of select="name(..)"/>' ist als geschlossen definiert und dieses Element '<name/>' ist nicht erlaubt oder nicht mit diesem Inhalt erlaubt. Dies kann templateId, code oder id betreffen. Erwartet:  hl7:streetAddressLine | hl7:streetName | hl7:houseNumber | hl7:postalCode | hl7:city | hl7:state | hl7:country | hl7:additionalLocator (rule-reference: d1160507e137-true-d1160815e0)</assert>
   </rule>

   <!-- Checking undefined contents for template/element @isClosed="true". Match context that we did not already match -->
   <rule fpi="RUL-QQQ"
         context="*[hl7:substanceAdministration[hl7:templateId[@root = '1.2.40.0.34.6.0.11.3.1'] and hl7:templateId[@root = '2.16.840.1.113883.10.20.1.24'] and hl7:templateId[@root = '1.3.6.1.4.1.19376.1.5.3.1.4.12']]]/hl7:substanceAdministration[hl7:templateId[@root = '1.2.40.0.34.6.0.11.3.1'] and hl7:templateId[@root = '2.16.840.1.113883.10.20.1.24'] and hl7:templateId[@root = '1.3.6.1.4.1.19376.1.5.3.1.4.12']]/hl7:performer[hl7:templateId[@root = '1.2.40.0.34.6.0.11.9.21']]/hl7:assignedEntity[not(@nullFlavor)]/hl7:assignedPerson/*[not(@xsi:nil = 'true')][not(self::hl7:name[not(@nullFlavor)])]"
         id="d1160507e211-true-d1160880e0">
      <assert role="error"
              see="http://elga.art-decor.org/elgaimpf-html-20250116T125121/tmp-1.2.40.0.34.6.0.11.3.1-2021-02-19T124649.html"
              test="not(.)">(atcdabbr_entry_Immunization)/d1160507e211-true-d1160880e0: '<value-of select="name(..)"/>' ist als geschlossen definiert und dieses Element '<name/>' ist nicht erlaubt oder nicht mit diesem Inhalt erlaubt. Dies kann templateId, code oder id betreffen. Erwartet:  hl7:name[not(@nullFlavor)] (rule-reference: d1160507e211-true-d1160880e0)</assert>
   </rule>

   <!-- Checking undefined contents for template/element @isClosed="true". Match context that we did not already match -->
   <rule fpi="RUL-QQQ"
         context="*[hl7:substanceAdministration[hl7:templateId[@root = '1.2.40.0.34.6.0.11.3.1'] and hl7:templateId[@root = '2.16.840.1.113883.10.20.1.24'] and hl7:templateId[@root = '1.3.6.1.4.1.19376.1.5.3.1.4.12']]]/hl7:substanceAdministration[hl7:templateId[@root = '1.2.40.0.34.6.0.11.3.1'] and hl7:templateId[@root = '2.16.840.1.113883.10.20.1.24'] and hl7:templateId[@root = '1.3.6.1.4.1.19376.1.5.3.1.4.12']]/hl7:performer[hl7:templateId[@root = '1.2.40.0.34.6.0.11.9.21']]/hl7:assignedEntity[not(@nullFlavor)]/hl7:assignedPerson/*[not(@xsi:nil = 'true')][not(self::hl7:name[not(@nullFlavor)])]"
         id="d1160507e225-true-d1160902e0">
      <assert role="error"
              see="http://elga.art-decor.org/elgaimpf-html-20250116T125121/tmp-1.2.40.0.34.6.0.11.3.1-2021-02-19T124649.html"
              test="not(.)">(atcdabbr_entry_Immunization)/d1160507e225-true-d1160902e0: '<value-of select="name(..)"/>' ist als geschlossen definiert und dieses Element '<name/>' ist nicht erlaubt oder nicht mit diesem Inhalt erlaubt. Dies kann templateId, code oder id betreffen. Erwartet:  hl7:name[not(@nullFlavor)] (rule-reference: d1160507e225-true-d1160902e0)</assert>
   </rule>

   <!-- Checking undefined contents for template/element @isClosed="true". Match context that we did not already match -->
   <rule fpi="RUL-QQQ"
         context="*[hl7:substanceAdministration[hl7:templateId[@root = '1.2.40.0.34.6.0.11.3.1'] and hl7:templateId[@root = '2.16.840.1.113883.10.20.1.24'] and hl7:templateId[@root = '1.3.6.1.4.1.19376.1.5.3.1.4.12']]]/hl7:substanceAdministration[hl7:templateId[@root = '1.2.40.0.34.6.0.11.3.1'] and hl7:templateId[@root = '2.16.840.1.113883.10.20.1.24'] and hl7:templateId[@root = '1.3.6.1.4.1.19376.1.5.3.1.4.12']]/hl7:performer[hl7:templateId[@root = '1.2.40.0.34.6.0.11.9.21']]/hl7:assignedEntity[not(@nullFlavor)]/hl7:assignedPerson/hl7:name[not(@nullFlavor)]/*[not(@xsi:nil = 'true')][not(self::hl7:prefix | self::hl7:family[not(@nullFlavor)] | self::hl7:given[not(@nullFlavor)] | self::hl7:suffix)]"
         id="d1160890e12-true-d1160931e0">
      <assert role="error"
              see="http://elga.art-decor.org/elgaimpf-html-20250116T125121/tmp-1.2.40.0.34.6.0.11.3.1-2021-02-19T124649.html"
              test="not(.)">(atcdabbr_entry_Immunization)/d1160890e12-true-d1160931e0: '<value-of select="name(..)"/>' ist als geschlossen definiert und dieses Element '<name/>' ist nicht erlaubt oder nicht mit diesem Inhalt erlaubt. Dies kann templateId, code oder id betreffen. Erwartet:  hl7:prefix | hl7:family[not(@nullFlavor)] | hl7:given[not(@nullFlavor)] | hl7:suffix (rule-reference: d1160890e12-true-d1160931e0)</assert>
   </rule>

   <!-- Checking undefined contents for template/element @isClosed="true". Match context that we did not already match -->
   <rule fpi="RUL-QQQ"
         context="*[hl7:substanceAdministration[hl7:templateId[@root = '1.2.40.0.34.6.0.11.3.1'] and hl7:templateId[@root = '2.16.840.1.113883.10.20.1.24'] and hl7:templateId[@root = '1.3.6.1.4.1.19376.1.5.3.1.4.12']]]/hl7:substanceAdministration[hl7:templateId[@root = '1.2.40.0.34.6.0.11.3.1'] and hl7:templateId[@root = '2.16.840.1.113883.10.20.1.24'] and hl7:templateId[@root = '1.3.6.1.4.1.19376.1.5.3.1.4.12']]/hl7:performer[hl7:templateId[@root = '1.2.40.0.34.6.0.11.9.21']]/hl7:assignedEntity[not(@nullFlavor)]/hl7:representedOrganization/*[not(@xsi:nil = 'true')][not(self::hl7:id[not(@nullFlavor)] | self::hl7:name[not(@nullFlavor)] | self::hl7:telecom[not(@nullFlavor)] | self::hl7:addr[not(@nullFlavor)])]"
         id="d1160507e237-true-d1160982e0">
      <assert role="error"
              see="http://elga.art-decor.org/elgaimpf-html-20250116T125121/tmp-1.2.40.0.34.6.0.11.3.1-2021-02-19T124649.html"
              test="not(.)">(atcdabbr_entry_Immunization)/d1160507e237-true-d1160982e0: '<value-of select="name(..)"/>' ist als geschlossen definiert und dieses Element '<name/>' ist nicht erlaubt oder nicht mit diesem Inhalt erlaubt. Dies kann templateId, code oder id betreffen. Erwartet:  hl7:id[not(@nullFlavor)] | hl7:name[not(@nullFlavor)] | hl7:telecom[not(@nullFlavor)] | hl7:addr[not(@nullFlavor)] (rule-reference: d1160507e237-true-d1160982e0)</assert>
   </rule>

   <!-- Checking undefined contents for template/element @isClosed="true". Match context that we did not already match -->
   <rule fpi="RUL-QQQ"
         context="*[hl7:substanceAdministration[hl7:templateId[@root = '1.2.40.0.34.6.0.11.3.1'] and hl7:templateId[@root = '2.16.840.1.113883.10.20.1.24'] and hl7:templateId[@root = '1.3.6.1.4.1.19376.1.5.3.1.4.12']]]/hl7:substanceAdministration[hl7:templateId[@root = '1.2.40.0.34.6.0.11.3.1'] and hl7:templateId[@root = '2.16.840.1.113883.10.20.1.24'] and hl7:templateId[@root = '1.3.6.1.4.1.19376.1.5.3.1.4.12']]/hl7:performer[hl7:templateId[@root = '1.2.40.0.34.6.0.11.9.21']]/hl7:assignedEntity[not(@nullFlavor)]/hl7:representedOrganization/hl7:addr[not(@nullFlavor)]/*[not(@xsi:nil = 'true')][not(self::hl7:streetAddressLine | self::hl7:streetName | self::hl7:houseNumber | self::hl7:postalCode | self::hl7:city | self::hl7:state | self::hl7:country | self::hl7:additionalLocator)]"
         id="d1160956e57-true-d1161043e0">
      <assert role="error"
              see="http://elga.art-decor.org/elgaimpf-html-20250116T125121/tmp-1.2.40.0.34.6.0.11.3.1-2021-02-19T124649.html"
              test="not(.)">(atcdabbr_entry_Immunization)/d1160956e57-true-d1161043e0: '<value-of select="name(..)"/>' ist als geschlossen definiert und dieses Element '<name/>' ist nicht erlaubt oder nicht mit diesem Inhalt erlaubt. Dies kann templateId, code oder id betreffen. Erwartet:  hl7:streetAddressLine | hl7:streetName | hl7:houseNumber | hl7:postalCode | hl7:city | hl7:state | hl7:country | hl7:additionalLocator (rule-reference: d1160956e57-true-d1161043e0)</assert>
   </rule>

   <!-- Checking undefined contents for template/element @isClosed="true". Match context that we did not already match -->
   <rule fpi="RUL-QQQ"
         context="*[hl7:substanceAdministration[hl7:templateId[@root = '1.2.40.0.34.6.0.11.3.1'] and hl7:templateId[@root = '2.16.840.1.113883.10.20.1.24'] and hl7:templateId[@root = '1.3.6.1.4.1.19376.1.5.3.1.4.12']]]/hl7:substanceAdministration[hl7:templateId[@root = '1.2.40.0.34.6.0.11.3.1'] and hl7:templateId[@root = '2.16.840.1.113883.10.20.1.24'] and hl7:templateId[@root = '1.3.6.1.4.1.19376.1.5.3.1.4.12']]/hl7:author[hl7:assignedAuthor]/*[not(@xsi:nil = 'true')][not(self::hl7:time[not(@nullFlavor)] | self::hl7:time[@nullFlavor='UNK'] | self::hl7:assignedAuthor)]"
         id="d42e28396-true-d1161205e0">
      <assert role="error"
              see="http://elga.art-decor.org/elgaimpf-html-20250116T125121/tmp-1.2.40.0.34.6.0.11.3.1-2021-02-19T124649.html"
              test="not(.)">(atcdabbr_entry_Immunization)/d42e28396-true-d1161205e0: '<value-of select="name(..)"/>' ist als geschlossen definiert und dieses Element '<name/>' ist nicht erlaubt oder nicht mit diesem Inhalt erlaubt. Dies kann templateId, code oder id betreffen. Erwartet:  hl7:time[not(@nullFlavor)] | hl7:time[@nullFlavor='UNK'] | hl7:assignedAuthor (rule-reference: d42e28396-true-d1161205e0)</assert>
   </rule>

   <!-- Checking undefined contents for template/element @isClosed="true". Match context that we did not already match -->
   <rule fpi="RUL-QQQ"
         context="*[hl7:substanceAdministration[hl7:templateId[@root = '1.2.40.0.34.6.0.11.3.1'] and hl7:templateId[@root = '2.16.840.1.113883.10.20.1.24'] and hl7:templateId[@root = '1.3.6.1.4.1.19376.1.5.3.1.4.12']]]/hl7:substanceAdministration[hl7:templateId[@root = '1.2.40.0.34.6.0.11.3.1'] and hl7:templateId[@root = '2.16.840.1.113883.10.20.1.24'] and hl7:templateId[@root = '1.3.6.1.4.1.19376.1.5.3.1.4.12']]/hl7:author[hl7:assignedAuthor]/hl7:assignedAuthor/*[not(@xsi:nil = 'true')][not(self::hl7:id[not(@nullFlavor)] | self::hl7:id[@nullFlavor='UNK'] | self::hl7:code[not(@nullFlavor)] | self::hl7:addr[not(@nullFlavor)] | self::hl7:telecom[not(@nullFlavor)] | self::hl7:assignedPerson | self::hl7:assignedAuthoringDevice | self::hl7:representedOrganization)]"
         id="d1161088e58-true-d1161308e0">
      <assert role="error"
              see="http://elga.art-decor.org/elgaimpf-html-20250116T125121/tmp-1.2.40.0.34.6.0.11.3.1-2021-02-19T124649.html"
              test="not(.)">(atcdabbr_entry_Immunization)/d1161088e58-true-d1161308e0: '<value-of select="name(..)"/>' ist als geschlossen definiert und dieses Element '<name/>' ist nicht erlaubt oder nicht mit diesem Inhalt erlaubt. Dies kann templateId, code oder id betreffen. Erwartet:  hl7:id[not(@nullFlavor)] | hl7:id[@nullFlavor='UNK'] | hl7:code[not(@nullFlavor)] | hl7:addr[not(@nullFlavor)] | hl7:telecom[not(@nullFlavor)] | hl7:assignedPerson | hl7:assignedAuthoringDevice | hl7:representedOrganization (rule-reference: d1161088e58-true-d1161308e0)</assert>
   </rule>

   <!-- Checking undefined contents for template/element @isClosed="true". Match context that we did not already match -->
   <rule fpi="RUL-QQQ"
         context="*[hl7:substanceAdministration[hl7:templateId[@root = '1.2.40.0.34.6.0.11.3.1'] and hl7:templateId[@root = '2.16.840.1.113883.10.20.1.24'] and hl7:templateId[@root = '1.3.6.1.4.1.19376.1.5.3.1.4.12']]]/hl7:substanceAdministration[hl7:templateId[@root = '1.2.40.0.34.6.0.11.3.1'] and hl7:templateId[@root = '2.16.840.1.113883.10.20.1.24'] and hl7:templateId[@root = '1.3.6.1.4.1.19376.1.5.3.1.4.12']]/hl7:author[hl7:assignedAuthor]/hl7:assignedAuthor/hl7:addr[not(@nullFlavor)]/*[not(@xsi:nil = 'true')][not(self::hl7:streetAddressLine | self::hl7:streetName | self::hl7:houseNumber | self::hl7:postalCode[not(@nullFlavor)] | self::hl7:city[not(@nullFlavor)] | self::hl7:state | self::hl7:country[not(@nullFlavor)] | self::hl7:additionalLocator)]"
         id="d1161088e108-true-d1161367e0">
      <assert role="error"
              see="http://elga.art-decor.org/elgaimpf-html-20250116T125121/tmp-1.2.40.0.34.6.0.11.3.1-2021-02-19T124649.html"
              test="not(.)">(atcdabbr_entry_Immunization)/d1161088e108-true-d1161367e0: '<value-of select="name(..)"/>' ist als geschlossen definiert und dieses Element '<name/>' ist nicht erlaubt oder nicht mit diesem Inhalt erlaubt. Dies kann templateId, code oder id betreffen. Erwartet:  hl7:streetAddressLine | hl7:streetName | hl7:houseNumber | hl7:postalCode[not(@nullFlavor)] | hl7:city[not(@nullFlavor)] | hl7:state | hl7:country[not(@nullFlavor)] | hl7:additionalLocator (rule-reference: d1161088e108-true-d1161367e0)</assert>
   </rule>

   <!-- Checking undefined contents for template/element @isClosed="true". Match context that we did not already match -->
   <rule fpi="RUL-QQQ"
         context="*[hl7:substanceAdministration[hl7:templateId[@root = '1.2.40.0.34.6.0.11.3.1'] and hl7:templateId[@root = '2.16.840.1.113883.10.20.1.24'] and hl7:templateId[@root = '1.3.6.1.4.1.19376.1.5.3.1.4.12']]]/hl7:substanceAdministration[hl7:templateId[@root = '1.2.40.0.34.6.0.11.3.1'] and hl7:templateId[@root = '2.16.840.1.113883.10.20.1.24'] and hl7:templateId[@root = '1.3.6.1.4.1.19376.1.5.3.1.4.12']]/hl7:author[hl7:assignedAuthor]/hl7:assignedAuthor/hl7:assignedPerson/*[not(@xsi:nil = 'true')][not(self::hl7:name[not(@nullFlavor)] | self::hl7:name[@nullFlavor='UNK'] | self::hl7:name[@nullFlavor='MSK'])]"
         id="d1161088e154-true-d1161424e0">
      <assert role="error"
              see="http://elga.art-decor.org/elgaimpf-html-20250116T125121/tmp-1.2.40.0.34.6.0.11.3.1-2021-02-19T124649.html"
              test="not(.)">(atcdabbr_entry_Immunization)/d1161088e154-true-d1161424e0: '<value-of select="name(..)"/>' ist als geschlossen definiert und dieses Element '<name/>' ist nicht erlaubt oder nicht mit diesem Inhalt erlaubt. Dies kann templateId, code oder id betreffen. Erwartet:  hl7:name[not(@nullFlavor)] | hl7:name[@nullFlavor='UNK'] | hl7:name[@nullFlavor='MSK'] (rule-reference: d1161088e154-true-d1161424e0)</assert>
   </rule>

   <!-- Checking undefined contents for template/element @isClosed="true". Match context that we did not already match -->
   <rule fpi="RUL-QQQ"
         context="*[hl7:substanceAdministration[hl7:templateId[@root = '1.2.40.0.34.6.0.11.3.1'] and hl7:templateId[@root = '2.16.840.1.113883.10.20.1.24'] and hl7:templateId[@root = '1.3.6.1.4.1.19376.1.5.3.1.4.12']]]/hl7:substanceAdministration[hl7:templateId[@root = '1.2.40.0.34.6.0.11.3.1'] and hl7:templateId[@root = '2.16.840.1.113883.10.20.1.24'] and hl7:templateId[@root = '1.3.6.1.4.1.19376.1.5.3.1.4.12']]/hl7:author[hl7:assignedAuthor]/hl7:assignedAuthor/hl7:assignedPerson/hl7:name[not(@nullFlavor)]/*[not(@xsi:nil = 'true')][not(self::hl7:prefix | self::hl7:family[not(@nullFlavor)] | self::hl7:given[not(@nullFlavor)] | self::hl7:suffix)]"
         id="d1161428e92-true-d1161458e0">
      <assert role="error"
              see="http://elga.art-decor.org/elgaimpf-html-20250116T125121/tmp-1.2.40.0.34.6.0.11.9.6-2023-03-31T111555.html"
              test="not(.)">(atcdabbr_other_PersonNameCompilationG2)/d1161428e92-true-d1161458e0: '<value-of select="name(..)"/>' ist als geschlossen definiert und dieses Element '<name/>' ist nicht erlaubt oder nicht mit diesem Inhalt erlaubt. Dies kann templateId, code oder id betreffen. Erwartet:  hl7:prefix | hl7:family[not(@nullFlavor)] | hl7:given[not(@nullFlavor)] | hl7:suffix (rule-reference: d1161428e92-true-d1161458e0)</assert>
   </rule>

   <!-- Checking undefined contents for template/element @isClosed="true". Match context that we did not already match -->
   <rule fpi="RUL-QQQ"
         context="*[hl7:substanceAdministration[hl7:templateId[@root = '1.2.40.0.34.6.0.11.3.1'] and hl7:templateId[@root = '2.16.840.1.113883.10.20.1.24'] and hl7:templateId[@root = '1.3.6.1.4.1.19376.1.5.3.1.4.12']]]/hl7:substanceAdministration[hl7:templateId[@root = '1.2.40.0.34.6.0.11.3.1'] and hl7:templateId[@root = '2.16.840.1.113883.10.20.1.24'] and hl7:templateId[@root = '1.3.6.1.4.1.19376.1.5.3.1.4.12']]/hl7:author[hl7:assignedAuthor]/hl7:assignedAuthor/hl7:assignedAuthoringDevice/*[not(@xsi:nil = 'true')][not(self::hl7:manufacturerModelName[not(@nullFlavor)] | self::hl7:softwareName[not(@nullFlavor)])]"
         id="d1161088e177-true-d1161506e0">
      <assert role="error"
              see="http://elga.art-decor.org/elgaimpf-html-20250116T125121/tmp-1.2.40.0.34.6.0.11.3.1-2021-02-19T124649.html"
              test="not(.)">(atcdabbr_entry_Immunization)/d1161088e177-true-d1161506e0: '<value-of select="name(..)"/>' ist als geschlossen definiert und dieses Element '<name/>' ist nicht erlaubt oder nicht mit diesem Inhalt erlaubt. Dies kann templateId, code oder id betreffen. Erwartet:  hl7:manufacturerModelName[not(@nullFlavor)] | hl7:softwareName[not(@nullFlavor)] (rule-reference: d1161088e177-true-d1161506e0)</assert>
   </rule>

   <!-- Checking undefined contents for template/element @isClosed="true". Match context that we did not already match -->
   <rule fpi="RUL-QQQ"
         context="*[hl7:substanceAdministration[hl7:templateId[@root = '1.2.40.0.34.6.0.11.3.1'] and hl7:templateId[@root = '2.16.840.1.113883.10.20.1.24'] and hl7:templateId[@root = '1.3.6.1.4.1.19376.1.5.3.1.4.12']]]/hl7:substanceAdministration[hl7:templateId[@root = '1.2.40.0.34.6.0.11.3.1'] and hl7:templateId[@root = '2.16.840.1.113883.10.20.1.24'] and hl7:templateId[@root = '1.3.6.1.4.1.19376.1.5.3.1.4.12']]/hl7:author[hl7:assignedAuthor]/hl7:assignedAuthor/hl7:representedOrganization/*[not(@xsi:nil = 'true')][not(self::hl7:id[not(@nullFlavor)] | self::hl7:name[not(@nullFlavor)] | self::hl7:telecom[not(@nullFlavor)] | self::hl7:addr[not(@nullFlavor)])]"
         id="d1161088e193-true-d1161551e0">
      <assert role="error"
              see="http://elga.art-decor.org/elgaimpf-html-20250116T125121/tmp-1.2.40.0.34.6.0.11.3.1-2021-02-19T124649.html"
              test="not(.)">(atcdabbr_entry_Immunization)/d1161088e193-true-d1161551e0: '<value-of select="name(..)"/>' ist als geschlossen definiert und dieses Element '<name/>' ist nicht erlaubt oder nicht mit diesem Inhalt erlaubt. Dies kann templateId, code oder id betreffen. Erwartet:  hl7:id[not(@nullFlavor)] | hl7:name[not(@nullFlavor)] | hl7:telecom[not(@nullFlavor)] | hl7:addr[not(@nullFlavor)] (rule-reference: d1161088e193-true-d1161551e0)</assert>
   </rule>

   <!-- Checking undefined contents for template/element @isClosed="true". Match context that we did not already match -->
   <rule fpi="RUL-QQQ"
         context="*[hl7:substanceAdministration[hl7:templateId[@root = '1.2.40.0.34.6.0.11.3.1'] and hl7:templateId[@root = '2.16.840.1.113883.10.20.1.24'] and hl7:templateId[@root = '1.3.6.1.4.1.19376.1.5.3.1.4.12']]]/hl7:substanceAdministration[hl7:templateId[@root = '1.2.40.0.34.6.0.11.3.1'] and hl7:templateId[@root = '2.16.840.1.113883.10.20.1.24'] and hl7:templateId[@root = '1.3.6.1.4.1.19376.1.5.3.1.4.12']]/hl7:author[hl7:assignedAuthor]/hl7:assignedAuthor/hl7:representedOrganization/hl7:addr[not(@nullFlavor)]/*[not(@xsi:nil = 'true')][not(self::hl7:streetAddressLine | self::hl7:streetName | self::hl7:houseNumber | self::hl7:postalCode[not(@nullFlavor)] | self::hl7:city[not(@nullFlavor)] | self::hl7:state | self::hl7:country[not(@nullFlavor)] | self::hl7:additionalLocator)]"
         id="d1161521e94-true-d1161614e0">
      <assert role="error"
              see="http://elga.art-decor.org/elgaimpf-html-20250116T125121/tmp-1.2.40.0.34.6.0.11.3.1-2021-02-19T124649.html"
              test="not(.)">(atcdabbr_entry_Immunization)/d1161521e94-true-d1161614e0: '<value-of select="name(..)"/>' ist als geschlossen definiert und dieses Element '<name/>' ist nicht erlaubt oder nicht mit diesem Inhalt erlaubt. Dies kann templateId, code oder id betreffen. Erwartet:  hl7:streetAddressLine | hl7:streetName | hl7:houseNumber | hl7:postalCode[not(@nullFlavor)] | hl7:city[not(@nullFlavor)] | hl7:state | hl7:country[not(@nullFlavor)] | hl7:additionalLocator (rule-reference: d1161521e94-true-d1161614e0)</assert>
   </rule>

   <!-- Checking undefined contents for template/element @isClosed="true". Match context that we did not already match -->
   <rule fpi="RUL-QQQ"
         context="*[hl7:substanceAdministration[hl7:templateId[@root = '1.2.40.0.34.6.0.11.3.1'] and hl7:templateId[@root = '2.16.840.1.113883.10.20.1.24'] and hl7:templateId[@root = '1.3.6.1.4.1.19376.1.5.3.1.4.12']]]/hl7:substanceAdministration[hl7:templateId[@root = '1.2.40.0.34.6.0.11.3.1'] and hl7:templateId[@root = '2.16.840.1.113883.10.20.1.24'] and hl7:templateId[@root = '1.3.6.1.4.1.19376.1.5.3.1.4.12']]/hl7:participant[hl7:templateId[@root = '1.2.40.0.34.6.0.11.9.14']]/*[not(@xsi:nil = 'true')][not(self::hl7:templateId[@root = '1.2.40.0.34.6.0.11.9.14'] | self::hl7:time | self::hl7:participantRole[not(@nullFlavor)])]"
         id="d42e28420-true-d1161729e0">
      <assert role="error"
              see="http://elga.art-decor.org/elgaimpf-html-20250116T125121/tmp-1.2.40.0.34.6.0.11.3.1-2021-02-19T124649.html"
              test="not(.)">(atcdabbr_entry_Immunization)/d42e28420-true-d1161729e0: '<value-of select="name(..)"/>' ist als geschlossen definiert und dieses Element '<name/>' ist nicht erlaubt oder nicht mit diesem Inhalt erlaubt. Dies kann templateId, code oder id betreffen. Erwartet:  hl7:templateId[@root = '1.2.40.0.34.6.0.11.9.14'] | hl7:time | hl7:participantRole[not(@nullFlavor)] (rule-reference: d42e28420-true-d1161729e0)</assert>
   </rule>

   <!-- Checking undefined contents for template/element @isClosed="true". Match context that we did not already match -->
   <rule fpi="RUL-QQQ"
         context="*[hl7:substanceAdministration[hl7:templateId[@root = '1.2.40.0.34.6.0.11.3.1'] and hl7:templateId[@root = '2.16.840.1.113883.10.20.1.24'] and hl7:templateId[@root = '1.3.6.1.4.1.19376.1.5.3.1.4.12']]]/hl7:substanceAdministration[hl7:templateId[@root = '1.2.40.0.34.6.0.11.3.1'] and hl7:templateId[@root = '2.16.840.1.113883.10.20.1.24'] and hl7:templateId[@root = '1.3.6.1.4.1.19376.1.5.3.1.4.12']]/hl7:participant[hl7:templateId[@root = '1.2.40.0.34.6.0.11.9.14']]/hl7:participantRole[not(@nullFlavor)]/*[not(@xsi:nil = 'true')][not(self::hl7:id[not(@nullFlavor)] | self::hl7:id[@nullFlavor='NI'] | self::hl7:id[@nullFlavor='UNK'] | self::hl7:addr[not(@nullFlavor)] | self::hl7:telecom[not(@nullFlavor)] | self::hl7:playingDevice | self::hl7:playingEntity | self::hl7:scopingEntity)]"
         id="d1161659e85-true-d1161779e0">
      <assert role="error"
              see="http://elga.art-decor.org/elgaimpf-html-20250116T125121/tmp-1.2.40.0.34.6.0.11.3.1-2021-02-19T124649.html"
              test="not(.)">(atcdabbr_entry_Immunization)/d1161659e85-true-d1161779e0: '<value-of select="name(..)"/>' ist als geschlossen definiert und dieses Element '<name/>' ist nicht erlaubt oder nicht mit diesem Inhalt erlaubt. Dies kann templateId, code oder id betreffen. Erwartet:  hl7:id[not(@nullFlavor)] | hl7:id[@nullFlavor='NI'] | hl7:id[@nullFlavor='UNK'] | hl7:addr[not(@nullFlavor)] | hl7:telecom[not(@nullFlavor)] | hl7:playingDevice | hl7:playingEntity | hl7:scopingEntity (rule-reference: d1161659e85-true-d1161779e0)</assert>
   </rule>

   <!-- Checking undefined contents for template/element @isClosed="true". Match context that we did not already match -->
   <rule fpi="RUL-QQQ"
         context="*[hl7:substanceAdministration[hl7:templateId[@root = '1.2.40.0.34.6.0.11.3.1'] and hl7:templateId[@root = '2.16.840.1.113883.10.20.1.24'] and hl7:templateId[@root = '1.3.6.1.4.1.19376.1.5.3.1.4.12']]]/hl7:substanceAdministration[hl7:templateId[@root = '1.2.40.0.34.6.0.11.3.1'] and hl7:templateId[@root = '2.16.840.1.113883.10.20.1.24'] and hl7:templateId[@root = '1.3.6.1.4.1.19376.1.5.3.1.4.12']]/hl7:participant[hl7:templateId[@root = '1.2.40.0.34.6.0.11.9.14']]/hl7:participantRole[not(@nullFlavor)]/hl7:addr[not(@nullFlavor)]/*[not(@xsi:nil = 'true')][not(self::hl7:streetAddressLine | self::hl7:streetName | self::hl7:houseNumber | self::hl7:postalCode[not(@nullFlavor)] | self::hl7:city[not(@nullFlavor)] | self::hl7:state | self::hl7:country[not(@nullFlavor)] | self::hl7:additionalLocator)]"
         id="d1161659e113-true-d1161838e0">
      <assert role="error"
              see="http://elga.art-decor.org/elgaimpf-html-20250116T125121/tmp-1.2.40.0.34.6.0.11.3.1-2021-02-19T124649.html"
              test="not(.)">(atcdabbr_entry_Immunization)/d1161659e113-true-d1161838e0: '<value-of select="name(..)"/>' ist als geschlossen definiert und dieses Element '<name/>' ist nicht erlaubt oder nicht mit diesem Inhalt erlaubt. Dies kann templateId, code oder id betreffen. Erwartet:  hl7:streetAddressLine | hl7:streetName | hl7:houseNumber | hl7:postalCode[not(@nullFlavor)] | hl7:city[not(@nullFlavor)] | hl7:state | hl7:country[not(@nullFlavor)] | hl7:additionalLocator (rule-reference: d1161659e113-true-d1161838e0)</assert>
   </rule>

   <!-- Checking undefined contents for template/element @isClosed="true". Match context that we did not already match -->
   <rule fpi="RUL-QQQ"
         context="*[hl7:substanceAdministration[hl7:templateId[@root = '1.2.40.0.34.6.0.11.3.1'] and hl7:templateId[@root = '2.16.840.1.113883.10.20.1.24'] and hl7:templateId[@root = '1.3.6.1.4.1.19376.1.5.3.1.4.12']]]/hl7:substanceAdministration[hl7:templateId[@root = '1.2.40.0.34.6.0.11.3.1'] and hl7:templateId[@root = '2.16.840.1.113883.10.20.1.24'] and hl7:templateId[@root = '1.3.6.1.4.1.19376.1.5.3.1.4.12']]/hl7:participant[hl7:templateId[@root = '1.2.40.0.34.6.0.11.9.14']]/hl7:participantRole[not(@nullFlavor)]/hl7:playingDevice/*[not(@xsi:nil = 'true')][not(self::hl7:manufacturerModelName[not(@nullFlavor)] | self::hl7:softwareName[not(@nullFlavor)])]"
         id="d1161659e142-true-d1161903e0">
      <assert role="error"
              see="http://elga.art-decor.org/elgaimpf-html-20250116T125121/tmp-1.2.40.0.34.6.0.11.3.1-2021-02-19T124649.html"
              test="not(.)">(atcdabbr_entry_Immunization)/d1161659e142-true-d1161903e0: '<value-of select="name(..)"/>' ist als geschlossen definiert und dieses Element '<name/>' ist nicht erlaubt oder nicht mit diesem Inhalt erlaubt. Dies kann templateId, code oder id betreffen. Erwartet:  hl7:manufacturerModelName[not(@nullFlavor)] | hl7:softwareName[not(@nullFlavor)] (rule-reference: d1161659e142-true-d1161903e0)</assert>
   </rule>

   <!-- Checking undefined contents for template/element @isClosed="true". Match context that we did not already match -->
   <rule fpi="RUL-QQQ"
         context="*[hl7:substanceAdministration[hl7:templateId[@root = '1.2.40.0.34.6.0.11.3.1'] and hl7:templateId[@root = '2.16.840.1.113883.10.20.1.24'] and hl7:templateId[@root = '1.3.6.1.4.1.19376.1.5.3.1.4.12']]]/hl7:substanceAdministration[hl7:templateId[@root = '1.2.40.0.34.6.0.11.3.1'] and hl7:templateId[@root = '2.16.840.1.113883.10.20.1.24'] and hl7:templateId[@root = '1.3.6.1.4.1.19376.1.5.3.1.4.12']]/hl7:participant[hl7:templateId[@root = '1.2.40.0.34.6.0.11.9.14']]/hl7:participantRole[not(@nullFlavor)]/hl7:playingEntity/*[not(@xsi:nil = 'true')][not(self::hl7:name[not(@nullFlavor)])]"
         id="d1161659e144-true-d1161927e0">
      <assert role="error"
              see="http://elga.art-decor.org/elgaimpf-html-20250116T125121/tmp-1.2.40.0.34.6.0.11.3.1-2021-02-19T124649.html"
              test="not(.)">(atcdabbr_entry_Immunization)/d1161659e144-true-d1161927e0: '<value-of select="name(..)"/>' ist als geschlossen definiert und dieses Element '<name/>' ist nicht erlaubt oder nicht mit diesem Inhalt erlaubt. Dies kann templateId, code oder id betreffen. Erwartet:  hl7:name[not(@nullFlavor)] (rule-reference: d1161659e144-true-d1161927e0)</assert>
   </rule>

   <!-- Checking undefined contents for template/element @isClosed="true". Match context that we did not already match -->
   <rule fpi="RUL-QQQ"
         context="*[hl7:substanceAdministration[hl7:templateId[@root = '1.2.40.0.34.6.0.11.3.1'] and hl7:templateId[@root = '2.16.840.1.113883.10.20.1.24'] and hl7:templateId[@root = '1.3.6.1.4.1.19376.1.5.3.1.4.12']]]/hl7:substanceAdministration[hl7:templateId[@root = '1.2.40.0.34.6.0.11.3.1'] and hl7:templateId[@root = '2.16.840.1.113883.10.20.1.24'] and hl7:templateId[@root = '1.3.6.1.4.1.19376.1.5.3.1.4.12']]/hl7:participant[hl7:templateId[@root = '1.2.40.0.34.6.0.11.9.14']]/hl7:participantRole[not(@nullFlavor)]/hl7:playingEntity/hl7:name[not(@nullFlavor)]/*[not(@xsi:nil = 'true')][not(self::hl7:prefix | self::hl7:family[not(@nullFlavor)] | self::hl7:given[not(@nullFlavor)] | self::hl7:suffix)]"
         id="d1161659e150-true-d1161956e0">
      <assert role="error"
              see="http://elga.art-decor.org/elgaimpf-html-20250116T125121/tmp-1.2.40.0.34.6.0.11.3.1-2021-02-19T124649.html"
              test="not(.)">(atcdabbr_entry_Immunization)/d1161659e150-true-d1161956e0: '<value-of select="name(..)"/>' ist als geschlossen definiert und dieses Element '<name/>' ist nicht erlaubt oder nicht mit diesem Inhalt erlaubt. Dies kann templateId, code oder id betreffen. Erwartet:  hl7:prefix | hl7:family[not(@nullFlavor)] | hl7:given[not(@nullFlavor)] | hl7:suffix (rule-reference: d1161659e150-true-d1161956e0)</assert>
   </rule>

   <!-- Checking undefined contents for template/element @isClosed="true". Match context that we did not already match -->
   <rule fpi="RUL-QQQ"
         context="*[hl7:substanceAdministration[hl7:templateId[@root = '1.2.40.0.34.6.0.11.3.1'] and hl7:templateId[@root = '2.16.840.1.113883.10.20.1.24'] and hl7:templateId[@root = '1.3.6.1.4.1.19376.1.5.3.1.4.12']]]/hl7:substanceAdministration[hl7:templateId[@root = '1.2.40.0.34.6.0.11.3.1'] and hl7:templateId[@root = '2.16.840.1.113883.10.20.1.24'] and hl7:templateId[@root = '1.3.6.1.4.1.19376.1.5.3.1.4.12']]/hl7:participant[hl7:templateId[@root = '1.2.40.0.34.6.0.11.9.14']]/hl7:participantRole[not(@nullFlavor)]/hl7:scopingEntity/*[not(@xsi:nil = 'true')][not(self::hl7:desc)]"
         id="d1161659e245-true-d1161990e0">
      <assert role="error"
              see="http://elga.art-decor.org/elgaimpf-html-20250116T125121/tmp-1.2.40.0.34.6.0.11.3.1-2021-02-19T124649.html"
              test="not(.)">(atcdabbr_entry_Immunization)/d1161659e245-true-d1161990e0: '<value-of select="name(..)"/>' ist als geschlossen definiert und dieses Element '<name/>' ist nicht erlaubt oder nicht mit diesem Inhalt erlaubt. Dies kann templateId, code oder id betreffen. Erwartet:  hl7:desc (rule-reference: d1161659e245-true-d1161990e0)</assert>
   </rule>

   <!-- Checking undefined contents for template/element @isClosed="true". Match context that we did not already match -->
   <rule fpi="RUL-QQQ"
         context="*[hl7:substanceAdministration[hl7:templateId[@root = '1.2.40.0.34.6.0.11.3.1'] and hl7:templateId[@root = '2.16.840.1.113883.10.20.1.24'] and hl7:templateId[@root = '1.3.6.1.4.1.19376.1.5.3.1.4.12']]]/hl7:substanceAdministration[hl7:templateId[@root = '1.2.40.0.34.6.0.11.3.1'] and hl7:templateId[@root = '2.16.840.1.113883.10.20.1.24'] and hl7:templateId[@root = '1.3.6.1.4.1.19376.1.5.3.1.4.12']]/hl7:entryRelationship[hl7:observation[hl7:templateId[@root = '1.2.40.0.34.6.0.11.3.2']]]/*[not(@xsi:nil = 'true')][not(self::hl7:observation[hl7:templateId[@root = '1.2.40.0.34.6.0.11.3.2']])]"
         id="d42e28473-true-d1162023e0">
      <assert role="error"
              see="http://elga.art-decor.org/elgaimpf-html-20250116T125121/tmp-1.2.40.0.34.6.0.11.3.1-2021-02-19T124649.html"
              test="not(.)">(atcdabbr_entry_Immunization)/d42e28473-true-d1162023e0: '<value-of select="name(..)"/>' ist als geschlossen definiert und dieses Element '<name/>' ist nicht erlaubt oder nicht mit diesem Inhalt erlaubt. Dies kann templateId, code oder id betreffen. Erwartet:  hl7:observation[hl7:templateId[@root = '1.2.40.0.34.6.0.11.3.2']] (rule-reference: d42e28473-true-d1162023e0)</assert>
   </rule>

   <!-- Checking undefined contents for template/element @isClosed="true". Match context that we did not already match -->
   <rule fpi="RUL-QQQ"
         context="*[hl7:substanceAdministration[hl7:templateId[@root = '1.2.40.0.34.6.0.11.3.1'] and hl7:templateId[@root = '2.16.840.1.113883.10.20.1.24'] and hl7:templateId[@root = '1.3.6.1.4.1.19376.1.5.3.1.4.12']]]/hl7:substanceAdministration[hl7:templateId[@root = '1.2.40.0.34.6.0.11.3.1'] and hl7:templateId[@root = '2.16.840.1.113883.10.20.1.24'] and hl7:templateId[@root = '1.3.6.1.4.1.19376.1.5.3.1.4.12']]/hl7:entryRelationship[hl7:observation[hl7:templateId[@root = '1.2.40.0.34.6.0.11.3.2']]]/hl7:observation[hl7:templateId[@root = '1.2.40.0.34.6.0.11.3.2']]/*[not(@xsi:nil = 'true')][not(self::hl7:templateId[@root = '1.2.40.0.34.6.0.11.3.2'] | self::hl7:id | self::hl7:code[concat(@code, @codeSystem) = doc('include/voc-1.2.40.0.34.6.0.10.4-DYNAMIC.xml')//valueSet[1]/conceptList/concept/concat(@code, @codeSystem)] | self::hl7:text | self::hl7:statusCode[@code = 'completed'])]"
         id="d1162000e10-true-d1162069e0">
      <assert role="error"
              see="http://elga.art-decor.org/elgaimpf-html-20250116T125121/tmp-1.2.40.0.34.6.0.11.3.1-2021-02-19T124649.html"
              test="not(.)">(atcdabbr_entry_Immunization)/d1162000e10-true-d1162069e0: '<value-of select="name(..)"/>' ist als geschlossen definiert und dieses Element '<name/>' ist nicht erlaubt oder nicht mit diesem Inhalt erlaubt. Dies kann templateId, code oder id betreffen. Erwartet:  hl7:templateId[@root = '1.2.40.0.34.6.0.11.3.2'] | hl7:id | hl7:code[concat(@code, @codeSystem) = doc('include/voc-1.2.40.0.34.6.0.10.4-DYNAMIC.xml')//valueSet[1]/conceptList/concept/concat(@code, @codeSystem)] | hl7:text | hl7:statusCode[@code = 'completed'] (rule-reference: d1162000e10-true-d1162069e0)</assert>
   </rule>

   <!-- Checking undefined contents for template/element @isClosed="true". Match context that we did not already match -->
   <rule fpi="RUL-QQQ"
         context="*[hl7:substanceAdministration[hl7:templateId[@root = '1.2.40.0.34.6.0.11.3.1'] and hl7:templateId[@root = '2.16.840.1.113883.10.20.1.24'] and hl7:templateId[@root = '1.3.6.1.4.1.19376.1.5.3.1.4.12']]]/hl7:substanceAdministration[hl7:templateId[@root = '1.2.40.0.34.6.0.11.3.1'] and hl7:templateId[@root = '2.16.840.1.113883.10.20.1.24'] and hl7:templateId[@root = '1.3.6.1.4.1.19376.1.5.3.1.4.12']]/hl7:entryRelationship[hl7:observation[hl7:templateId[@root = '1.2.40.0.34.6.0.11.3.2']]]/hl7:observation[hl7:templateId[@root = '1.2.40.0.34.6.0.11.3.2']]/hl7:text/*[not(@xsi:nil = 'true')][not(self::hl7:reference[not(@nullFlavor)])]"
         id="d1162092e54-true-d1162104e0">
      <assert role="error"
              see="http://elga.art-decor.org/elgaimpf-html-20250116T125121/tmp-1.2.40.0.34.6.0.11.9.1-2021-05-06T093820.html"
              test="not(.)">(atcdabrr_other_NarrativeTextReference)/d1162092e54-true-d1162104e0: '<value-of select="name(..)"/>' ist als geschlossen definiert und dieses Element '<name/>' ist nicht erlaubt oder nicht mit diesem Inhalt erlaubt. Dies kann templateId, code oder id betreffen. Erwartet:  hl7:reference[not(@nullFlavor)] (rule-reference: d1162092e54-true-d1162104e0)</assert>
   </rule>

   <!-- Checking undefined contents for template/element @isClosed="true". Match context that we did not already match -->
   <rule fpi="RUL-QQQ"
         context="*[hl7:substanceAdministration[hl7:templateId[@root = '1.2.40.0.34.6.0.11.3.1'] and hl7:templateId[@root = '2.16.840.1.113883.10.20.1.24'] and hl7:templateId[@root = '1.3.6.1.4.1.19376.1.5.3.1.4.12']]]/hl7:substanceAdministration[hl7:templateId[@root = '1.2.40.0.34.6.0.11.3.1'] and hl7:templateId[@root = '2.16.840.1.113883.10.20.1.24'] and hl7:templateId[@root = '1.3.6.1.4.1.19376.1.5.3.1.4.12']]/hl7:entryRelationship[hl7:act[hl7:templateId[@root = '1.2.40.0.34.6.0.11.3.5']]]/*[not(@xsi:nil = 'true')][not(self::hl7:act[hl7:templateId[@root = '1.2.40.0.34.6.0.11.3.5']])]"
         id="d42e28486-true-d1162135e0">
      <assert role="error"
              see="http://elga.art-decor.org/elgaimpf-html-20250116T125121/tmp-1.2.40.0.34.6.0.11.3.1-2021-02-19T124649.html"
              test="not(.)">(atcdabbr_entry_Immunization)/d42e28486-true-d1162135e0: '<value-of select="name(..)"/>' ist als geschlossen definiert und dieses Element '<name/>' ist nicht erlaubt oder nicht mit diesem Inhalt erlaubt. Dies kann templateId, code oder id betreffen. Erwartet:  hl7:act[hl7:templateId[@root = '1.2.40.0.34.6.0.11.3.5']] (rule-reference: d42e28486-true-d1162135e0)</assert>
   </rule>

   <!-- Checking undefined contents for template/element @isClosed="true". Match context that we did not already match -->
   <rule fpi="RUL-QQQ"
         context="*[hl7:substanceAdministration[hl7:templateId[@root = '1.2.40.0.34.6.0.11.3.1'] and hl7:templateId[@root = '2.16.840.1.113883.10.20.1.24'] and hl7:templateId[@root = '1.3.6.1.4.1.19376.1.5.3.1.4.12']]]/hl7:substanceAdministration[hl7:templateId[@root = '1.2.40.0.34.6.0.11.3.1'] and hl7:templateId[@root = '2.16.840.1.113883.10.20.1.24'] and hl7:templateId[@root = '1.3.6.1.4.1.19376.1.5.3.1.4.12']]/hl7:entryRelationship[hl7:act[hl7:templateId[@root = '1.2.40.0.34.6.0.11.3.5']]]/hl7:act[hl7:templateId[@root = '1.2.40.0.34.6.0.11.3.5']]/*[not(@xsi:nil = 'true')][not(self::hl7:templateId[@root = '1.2.40.0.34.6.0.11.3.5'] | self::hl7:id[not(@nullFlavor)] | self::hl7:code[(@code = 'PAY' and @codeSystem = '2.16.840.1.113883.5.4')] | self::hl7:statusCode[not(@nullFlavor)] | self::hl7:effectiveTime[not(@nullFlavor)] | self::hl7:effectiveTime[@nullFlavor='UNK'])]"
         id="d1162120e30-true-d1162161e0">
      <assert role="error"
              see="http://elga.art-decor.org/elgaimpf-html-20250116T125121/tmp-1.2.40.0.34.6.0.11.3.1-2021-02-19T124649.html"
              test="not(.)">(atcdabbr_entry_Immunization)/d1162120e30-true-d1162161e0: '<value-of select="name(..)"/>' ist als geschlossen definiert und dieses Element '<name/>' ist nicht erlaubt oder nicht mit diesem Inhalt erlaubt. Dies kann templateId, code oder id betreffen. Erwartet:  hl7:templateId[@root = '1.2.40.0.34.6.0.11.3.5'] | hl7:id[not(@nullFlavor)] | hl7:code[(@code = 'PAY' and @codeSystem = '2.16.840.1.113883.5.4')] | hl7:statusCode[not(@nullFlavor)] | hl7:effectiveTime[not(@nullFlavor)] | hl7:effectiveTime[@nullFlavor='UNK'] (rule-reference: d1162120e30-true-d1162161e0)</assert>
   </rule>

   <!-- Checking undefined contents for template/element @isClosed="true". Match context that we did not already match -->
   <rule fpi="RUL-QQQ"
         context="*[hl7:substanceAdministration[hl7:templateId[@root = '1.2.40.0.34.6.0.11.3.1'] and hl7:templateId[@root = '2.16.840.1.113883.10.20.1.24'] and hl7:templateId[@root = '1.3.6.1.4.1.19376.1.5.3.1.4.12']]]/hl7:substanceAdministration[hl7:templateId[@root = '1.2.40.0.34.6.0.11.3.1'] and hl7:templateId[@root = '2.16.840.1.113883.10.20.1.24'] and hl7:templateId[@root = '1.3.6.1.4.1.19376.1.5.3.1.4.12']]/hl7:entryRelationship[hl7:act[hl7:templateId[@root = '1.2.40.0.34.6.0.11.3.5']]]/hl7:act[hl7:templateId[@root = '1.2.40.0.34.6.0.11.3.5']]/hl7:code[(@code = 'PAY' and @codeSystem = '2.16.840.1.113883.5.4')]/*[not(@xsi:nil = 'true')][not(self::hl7:qualifier[hl7:value[concat(@code, @codeSystem) = doc('include/voc-1.2.40.0.34.6.0.10.7-DYNAMIC.xml')//valueSet[1]/conceptList/concept/concat(@code, @codeSystem)]])]"
         id="d1162120e70-true-d1162191e0">
      <assert role="error"
              see="http://elga.art-decor.org/elgaimpf-html-20250116T125121/tmp-1.2.40.0.34.6.0.11.3.1-2021-02-19T124649.html"
              test="not(.)">(atcdabbr_entry_Immunization)/d1162120e70-true-d1162191e0: '<value-of select="name(..)"/>' ist als geschlossen definiert und dieses Element '<name/>' ist nicht erlaubt oder nicht mit diesem Inhalt erlaubt. Dies kann templateId, code oder id betreffen. Erwartet:  hl7:qualifier[hl7:value[concat(@code, @codeSystem) = doc('include/voc-1.2.40.0.34.6.0.10.7-DYNAMIC.xml')//valueSet[1]/conceptList/concept/concat(@code, @codeSystem)]] (rule-reference: d1162120e70-true-d1162191e0)</assert>
   </rule>

   <!-- Checking undefined contents for template/element @isClosed="true". Match context that we did not already match -->
   <rule fpi="RUL-QQQ"
         context="*[hl7:substanceAdministration[hl7:templateId[@root = '1.2.40.0.34.6.0.11.3.1'] and hl7:templateId[@root = '2.16.840.1.113883.10.20.1.24'] and hl7:templateId[@root = '1.3.6.1.4.1.19376.1.5.3.1.4.12']]]/hl7:substanceAdministration[hl7:templateId[@root = '1.2.40.0.34.6.0.11.3.1'] and hl7:templateId[@root = '2.16.840.1.113883.10.20.1.24'] and hl7:templateId[@root = '1.3.6.1.4.1.19376.1.5.3.1.4.12']]/hl7:entryRelationship[hl7:act[hl7:templateId[@root = '1.2.40.0.34.6.0.11.3.5']]]/hl7:act[hl7:templateId[@root = '1.2.40.0.34.6.0.11.3.5']]/hl7:code[(@code = 'PAY' and @codeSystem = '2.16.840.1.113883.5.4')]/hl7:qualifier[hl7:value[concat(@code, @codeSystem) = doc('include/voc-1.2.40.0.34.6.0.10.7-DYNAMIC.xml')//valueSet[1]/conceptList/concept/concat(@code, @codeSystem)]]/*[not(@xsi:nil = 'true')][not(self::hl7:value[concat(@code, @codeSystem) = doc('include/voc-1.2.40.0.34.6.0.10.7-DYNAMIC.xml')//valueSet[1]/conceptList/concept/concat(@code, @codeSystem)])]"
         id="d1162120e77-true-d1162214e0">
      <assert role="error"
              see="http://elga.art-decor.org/elgaimpf-html-20250116T125121/tmp-1.2.40.0.34.6.0.11.3.1-2021-02-19T124649.html"
              test="not(.)">(atcdabbr_entry_Immunization)/d1162120e77-true-d1162214e0: '<value-of select="name(..)"/>' ist als geschlossen definiert und dieses Element '<name/>' ist nicht erlaubt oder nicht mit diesem Inhalt erlaubt. Dies kann templateId, code oder id betreffen. Erwartet:  hl7:value[concat(@code, @codeSystem) = doc('include/voc-1.2.40.0.34.6.0.10.7-DYNAMIC.xml')//valueSet[1]/conceptList/concept/concat(@code, @codeSystem)] (rule-reference: d1162120e77-true-d1162214e0)</assert>
   </rule>

   <!-- Checking undefined contents for template/element @isClosed="true". Match context that we did not already match -->
   <rule fpi="RUL-QQQ"
         context="*[hl7:substanceAdministration[hl7:templateId[@root = '1.2.40.0.34.6.0.11.3.1'] and hl7:templateId[@root = '2.16.840.1.113883.10.20.1.24'] and hl7:templateId[@root = '1.3.6.1.4.1.19376.1.5.3.1.4.12']]]/hl7:substanceAdministration[hl7:templateId[@root = '1.2.40.0.34.6.0.11.3.1'] and hl7:templateId[@root = '2.16.840.1.113883.10.20.1.24'] and hl7:templateId[@root = '1.3.6.1.4.1.19376.1.5.3.1.4.12']]/hl7:reference[hl7:externalDocument[hl7:templateId[@root = '1.2.40.0.34.6.0.11.3.14']]]/*[not(@xsi:nil = 'true')][not(self::hl7:externalDocument[hl7:templateId[@root = '1.2.40.0.34.6.0.11.3.14']])]"
         id="d42e28519-true-d1162259e0">
      <assert role="error"
              see="http://elga.art-decor.org/elgaimpf-html-20250116T125121/tmp-1.2.40.0.34.6.0.11.3.1-2021-02-19T124649.html"
              test="not(.)">(atcdabbr_entry_Immunization)/d42e28519-true-d1162259e0: '<value-of select="name(..)"/>' ist als geschlossen definiert und dieses Element '<name/>' ist nicht erlaubt oder nicht mit diesem Inhalt erlaubt. Dies kann templateId, code oder id betreffen. Erwartet:  hl7:externalDocument[hl7:templateId[@root = '1.2.40.0.34.6.0.11.3.14']] (rule-reference: d42e28519-true-d1162259e0)</assert>
   </rule>

   <!-- Checking undefined contents for template/element @isClosed="true". Match context that we did not already match -->
   <rule fpi="RUL-QQQ"
         context="*[hl7:substanceAdministration[hl7:templateId[@root = '1.2.40.0.34.6.0.11.3.1'] and hl7:templateId[@root = '2.16.840.1.113883.10.20.1.24'] and hl7:templateId[@root = '1.3.6.1.4.1.19376.1.5.3.1.4.12']]]/hl7:substanceAdministration[hl7:templateId[@root = '1.2.40.0.34.6.0.11.3.1'] and hl7:templateId[@root = '2.16.840.1.113883.10.20.1.24'] and hl7:templateId[@root = '1.3.6.1.4.1.19376.1.5.3.1.4.12']]/hl7:reference[hl7:externalDocument[hl7:templateId[@root = '1.2.40.0.34.6.0.11.3.14']]]/hl7:externalDocument[hl7:templateId[@root = '1.2.40.0.34.6.0.11.3.14']]/*[not(@xsi:nil = 'true')][not(self::hl7:templateId[@root = '1.2.40.0.34.6.0.11.3.14'] | self::hl7:id[not(@nullFlavor)] | self::hl7:code | self::hl7:text | self::hl7:setId[not(@nullFlavor)] | self::hl7:versionNumber[not(@nullFlavor)])]"
         id="d1162236e24-true-d1162292e0">
      <assert role="error"
              see="http://elga.art-decor.org/elgaimpf-html-20250116T125121/tmp-1.2.40.0.34.6.0.11.3.1-2021-02-19T124649.html"
              test="not(.)">(atcdabbr_entry_Immunization)/d1162236e24-true-d1162292e0: '<value-of select="name(..)"/>' ist als geschlossen definiert und dieses Element '<name/>' ist nicht erlaubt oder nicht mit diesem Inhalt erlaubt. Dies kann templateId, code oder id betreffen. Erwartet:  hl7:templateId[@root = '1.2.40.0.34.6.0.11.3.14'] | hl7:id[not(@nullFlavor)] | hl7:code | hl7:text | hl7:setId[not(@nullFlavor)] | hl7:versionNumber[not(@nullFlavor)] (rule-reference: d1162236e24-true-d1162292e0)</assert>
   </rule>

   <!-- Checking undefined contents for template/element @isClosed="true". Match context that we did not already match -->
   <rule fpi="RUL-QQQ"
         context="*[hl7:substanceAdministration[hl7:templateId[@root = '1.2.40.0.34.6.0.11.3.1'] and hl7:templateId[@root = '2.16.840.1.113883.10.20.1.24'] and hl7:templateId[@root = '1.3.6.1.4.1.19376.1.5.3.1.4.12']]]/hl7:substanceAdministration[hl7:templateId[@root = '1.2.40.0.34.6.0.11.3.1'] and hl7:templateId[@root = '2.16.840.1.113883.10.20.1.24'] and hl7:templateId[@root = '1.3.6.1.4.1.19376.1.5.3.1.4.12']]/hl7:reference[hl7:externalDocument[hl7:templateId[@root = '1.2.40.0.34.6.0.11.3.14']]]/hl7:externalDocument[hl7:templateId[@root = '1.2.40.0.34.6.0.11.3.14']]/hl7:text/*[not(@xsi:nil = 'true')][not(self::hl7:reference[not(@nullFlavor)])]"
         id="d1162312e54-true-d1162324e0">
      <assert role="error"
              see="http://elga.art-decor.org/elgaimpf-html-20250116T125121/tmp-1.2.40.0.34.6.0.11.9.1-2021-05-06T093820.html"
              test="not(.)">(atcdabrr_other_NarrativeTextReference)/d1162312e54-true-d1162324e0: '<value-of select="name(..)"/>' ist als geschlossen definiert und dieses Element '<name/>' ist nicht erlaubt oder nicht mit diesem Inhalt erlaubt. Dies kann templateId, code oder id betreffen. Erwartet:  hl7:reference[not(@nullFlavor)] (rule-reference: d1162312e54-true-d1162324e0)</assert>
   </rule>

   <!-- Checking undefined contents for template/element @isClosed="true". Match context that we did not already match -->
   <rule fpi="RUL-QQQ"
         context="*[hl7:substanceAdministration[hl7:templateId[@root = '1.2.40.0.34.6.0.11.3.1'] and hl7:templateId[@root = '2.16.840.1.113883.10.20.1.24'] and hl7:templateId[@root = '1.3.6.1.4.1.19376.1.5.3.1.4.12']]]/hl7:substanceAdministration[hl7:templateId[@root = '1.2.40.0.34.6.0.11.3.1'] and hl7:templateId[@root = '2.16.840.1.113883.10.20.1.24'] and hl7:templateId[@root = '1.3.6.1.4.1.19376.1.5.3.1.4.12']]/hl7:precondition[hl7:criterion[hl7:templateId[@root = '1.2.40.0.34.6.0.11.3.10']]]/*[not(@xsi:nil = 'true')][not(self::hl7:criterion[hl7:templateId[@root = '1.2.40.0.34.6.0.11.3.10']])]"
         id="d42e28545-true-d1162369e0">
      <assert role="error"
              see="http://elga.art-decor.org/elgaimpf-html-20250116T125121/tmp-1.2.40.0.34.6.0.11.3.1-2021-02-19T124649.html"
              test="not(.)">(atcdabbr_entry_Immunization)/d42e28545-true-d1162369e0: '<value-of select="name(..)"/>' ist als geschlossen definiert und dieses Element '<name/>' ist nicht erlaubt oder nicht mit diesem Inhalt erlaubt. Dies kann templateId, code oder id betreffen. Erwartet:  hl7:criterion[hl7:templateId[@root = '1.2.40.0.34.6.0.11.3.10']] (rule-reference: d42e28545-true-d1162369e0)</assert>
   </rule>

   <!-- Checking undefined contents for template/element @isClosed="true". Match context that we did not already match -->
   <rule fpi="RUL-QQQ"
         context="*[hl7:substanceAdministration[hl7:templateId[@root = '1.2.40.0.34.6.0.11.3.1'] and hl7:templateId[@root = '2.16.840.1.113883.10.20.1.24'] and hl7:templateId[@root = '1.3.6.1.4.1.19376.1.5.3.1.4.12']]]/hl7:substanceAdministration[hl7:templateId[@root = '1.2.40.0.34.6.0.11.3.1'] and hl7:templateId[@root = '2.16.840.1.113883.10.20.1.24'] and hl7:templateId[@root = '1.3.6.1.4.1.19376.1.5.3.1.4.12']]/hl7:precondition[hl7:criterion[hl7:templateId[@root = '1.2.40.0.34.6.0.11.3.10']]]/hl7:criterion[hl7:templateId[@root = '1.2.40.0.34.6.0.11.3.10']]/*[not(@xsi:nil = 'true')][not(self::hl7:templateId[@root = '1.2.40.0.34.6.0.11.3.10'] | self::hl7:code[concat(@code, @codeSystem) = doc('include/voc-1.2.40.0.34.6.0.10.5-DYNAMIC.xml')//valueSet[1]/conceptList/concept/concat(@code, @codeSystem)] | self::hl7:code[@nullFlavor='NI'] | self::hl7:text | self::hl7:value[not(@nullFlavor)] | self::hl7:value[@nullFlavor='UNK'] | self::hl7:value[@nullFlavor='NAV'] | self::hl7:value[@nullFlavor='NA'])]"
         id="d1162340e7-true-d1162399e0">
      <assert role="error"
              see="http://elga.art-decor.org/elgaimpf-html-20250116T125121/tmp-1.2.40.0.34.6.0.11.3.1-2021-02-19T124649.html"
              test="not(.)">(atcdabbr_entry_Immunization)/d1162340e7-true-d1162399e0: '<value-of select="name(..)"/>' ist als geschlossen definiert und dieses Element '<name/>' ist nicht erlaubt oder nicht mit diesem Inhalt erlaubt. Dies kann templateId, code oder id betreffen. Erwartet:  hl7:templateId[@root = '1.2.40.0.34.6.0.11.3.10'] | hl7:code[concat(@code, @codeSystem) = doc('include/voc-1.2.40.0.34.6.0.10.5-DYNAMIC.xml')//valueSet[1]/conceptList/concept/concat(@code, @codeSystem)] | hl7:code[@nullFlavor='NI'] | hl7:text | hl7:value[not(@nullFlavor)] | hl7:value[@nullFlavor='UNK'] | hl7:value[@nullFlavor='NAV'] | hl7:value[@nullFlavor='NA'] (rule-reference: d1162340e7-true-d1162399e0)</assert>
   </rule>

   <!-- Checking undefined contents for template/element @isClosed="true". Match context that we did not already match -->
   <rule fpi="RUL-QQQ"
         context="*[hl7:substanceAdministration[hl7:templateId[@root = '1.2.40.0.34.6.0.11.3.1'] and hl7:templateId[@root = '2.16.840.1.113883.10.20.1.24'] and hl7:templateId[@root = '1.3.6.1.4.1.19376.1.5.3.1.4.12']]]/hl7:substanceAdministration[hl7:templateId[@root = '1.2.40.0.34.6.0.11.3.1'] and hl7:templateId[@root = '2.16.840.1.113883.10.20.1.24'] and hl7:templateId[@root = '1.3.6.1.4.1.19376.1.5.3.1.4.12']]/hl7:precondition[hl7:criterion[hl7:templateId[@root = '1.2.40.0.34.6.0.11.3.10']]]/hl7:criterion[hl7:templateId[@root = '1.2.40.0.34.6.0.11.3.10']]/hl7:text/*[not(@xsi:nil = 'true')][not(self::hl7:reference[not(@nullFlavor)])]"
         id="d1162420e54-true-d1162432e0">
      <assert role="error"
              see="http://elga.art-decor.org/elgaimpf-html-20250116T125121/tmp-1.2.40.0.34.6.0.11.9.1-2021-05-06T093820.html"
              test="not(.)">(atcdabrr_other_NarrativeTextReference)/d1162420e54-true-d1162432e0: '<value-of select="name(..)"/>' ist als geschlossen definiert und dieses Element '<name/>' ist nicht erlaubt oder nicht mit diesem Inhalt erlaubt. Dies kann templateId, code oder id betreffen. Erwartet:  hl7:reference[not(@nullFlavor)] (rule-reference: d1162420e54-true-d1162432e0)</assert>
   </rule>

   <!-- Checking undefined contents for template/element @isClosed="true". Match context that we did not already match -->
   <rule fpi="RUL-QQQ"
         context="*[hl7:substanceAdministration[hl7:templateId[@root = '1.2.40.0.34.6.0.11.3.1'] and hl7:templateId[@root = '2.16.840.1.113883.10.20.1.24'] and hl7:templateId[@root = '1.3.6.1.4.1.19376.1.5.3.1.4.12']]]/hl7:substanceAdministration[hl7:templateId[@root = '1.2.40.0.34.6.0.11.3.1'] and hl7:templateId[@root = '2.16.840.1.113883.10.20.1.24'] and hl7:templateId[@root = '1.3.6.1.4.1.19376.1.5.3.1.4.12']]/hl7:precondition[hl7:criterion[hl7:templateId[@root = '1.2.40.0.34.6.0.11.3.10']]]/hl7:criterion[hl7:templateId[@root = '1.2.40.0.34.6.0.11.3.10']]/hl7:value[not(@nullFlavor)]/*[not(@xsi:nil = 'true')][not(self::hl7:originalText)]"
         id="d1162340e65-true-d1162448e0">
      <assert role="error"
              see="http://elga.art-decor.org/elgaimpf-html-20250116T125121/tmp-1.2.40.0.34.6.0.11.3.1-2021-02-19T124649.html"
              test="not(.)">(atcdabbr_entry_Immunization)/d1162340e65-true-d1162448e0: '<value-of select="name(..)"/>' ist als geschlossen definiert und dieses Element '<name/>' ist nicht erlaubt oder nicht mit diesem Inhalt erlaubt. Dies kann templateId, code oder id betreffen. Erwartet:  hl7:originalText (rule-reference: d1162340e65-true-d1162448e0)</assert>
   </rule>

   <!-- Checking undefined contents for template/element @isClosed="true". Match context that we did not already match -->
   <rule fpi="RUL-QQQ"
         context="*[hl7:substanceAdministration[hl7:templateId[@root = '1.2.40.0.34.6.0.11.3.1'] and hl7:templateId[@root = '2.16.840.1.113883.10.20.1.24'] and hl7:templateId[@root = '1.3.6.1.4.1.19376.1.5.3.1.4.12']]]/hl7:substanceAdministration[hl7:templateId[@root = '1.2.40.0.34.6.0.11.3.1'] and hl7:templateId[@root = '2.16.840.1.113883.10.20.1.24'] and hl7:templateId[@root = '1.3.6.1.4.1.19376.1.5.3.1.4.12']]/hl7:precondition[hl7:criterion[hl7:templateId[@root = '1.2.40.0.34.6.0.11.3.10']]]/hl7:criterion[hl7:templateId[@root = '1.2.40.0.34.6.0.11.3.10']]/hl7:value[not(@nullFlavor)]/hl7:originalText/*[not(@xsi:nil = 'true')][not(self::hl7:reference[not(@nullFlavor)])]"
         id="d1162452e41-true-d1162464e0">
      <assert role="error"
              see="http://elga.art-decor.org/elgaimpf-html-20250116T125121/tmp-1.2.40.0.34.6.0.11.9.2-2021-02-19T133148.html"
              test="not(.)">(atcdabbr_other_OriginalTextReference)/d1162452e41-true-d1162464e0: '<value-of select="name(..)"/>' ist als geschlossen definiert und dieses Element '<name/>' ist nicht erlaubt oder nicht mit diesem Inhalt erlaubt. Dies kann templateId, code oder id betreffen. Erwartet:  hl7:reference[not(@nullFlavor)] (rule-reference: d1162452e41-true-d1162464e0)</assert>
   </rule>
</pattern>
