<?xml version="1.0" encoding="UTF-8"?>
<!--
Template derived pattern
===========================================
ID: 1.2.40.0.34.6.0.11.9.47
Name: Participant Body - Data Enterer
Description: 
                 Die dokumentierende Person (z.B. Medizinische Dokumentationsassistenz, Schreibkraft). Template entspricht inhaltlich dem Header-Element "Data Enterer" und ermöglicht die Abbildung dieser Information im CDA-Body. 
            
-->
<pattern xmlns="http://purl.oclc.org/dsdl/schematron"
         id="template-1.2.40.0.34.6.0.11.9.47-2023-02-28T124446">
   <title>Participant Body - Data Enterer</title>
   <!--
Template derived rules for ID: 1.2.40.0.34.6.0.11.9.47
Context: *[hl7:templateId[@root = '1.2.40.0.34.6.0.11.9.47']]
Item: (atcdabbr_other_ParticipantBodyDataEnterer)
-->

   <rule fpi="RULC-1"
         context="*[hl7:templateId[@root = '1.2.40.0.34.6.0.11.9.47']]"
         id="d42e62299-false-d1530892e0">
      <assert role="error"
              see="http://elga.art-decor.org/elgaimpf-html-20250116T125121/tmp-1.2.40.0.34.6.0.11.9.47-2023-02-28T124446.html"
              test="count(hl7:templateId[@root = '1.2.40.0.34.6.0.11.9.47']) &gt;= 1">(atcdabbr_other_ParticipantBodyDataEnterer): Element hl7:templateId[@root = '1.2.40.0.34.6.0.11.9.47'] ist mandatory [min 1x].</assert>
      <assert role="error"
              see="http://elga.art-decor.org/elgaimpf-html-20250116T125121/tmp-1.2.40.0.34.6.0.11.9.47-2023-02-28T124446.html"
              test="count(hl7:templateId[@root = '1.2.40.0.34.6.0.11.9.47']) &lt;= 1">(atcdabbr_other_ParticipantBodyDataEnterer): Element hl7:templateId[@root = '1.2.40.0.34.6.0.11.9.47'] kommt zu häufig vor [max 1x].</assert>
      <assert role="error"
              see="http://elga.art-decor.org/elgaimpf-html-20250116T125121/tmp-1.2.40.0.34.6.0.11.9.47-2023-02-28T124446.html"
              test="count(hl7:time) &lt;= 1">(atcdabbr_other_ParticipantBodyDataEnterer): Element hl7:time kommt zu häufig vor [max 1x].</assert>
      <assert role="error"
              see="http://elga.art-decor.org/elgaimpf-html-20250116T125121/tmp-1.2.40.0.34.6.0.11.9.47-2023-02-28T124446.html"
              test="count(hl7:participantRole[not(@nullFlavor)]) &gt;= 1">(atcdabbr_other_ParticipantBodyDataEnterer): Element hl7:participantRole[not(@nullFlavor)] ist mandatory [min 1x].</assert>
      <assert role="error"
              see="http://elga.art-decor.org/elgaimpf-html-20250116T125121/tmp-1.2.40.0.34.6.0.11.9.47-2023-02-28T124446.html"
              test="count(hl7:participantRole[not(@nullFlavor)]) &lt;= 1">(atcdabbr_other_ParticipantBodyDataEnterer): Element hl7:participantRole[not(@nullFlavor)] kommt zu häufig vor [max 1x].</assert>
   </rule>
   <!--
Template derived rules for ID: 1.2.40.0.34.6.0.11.9.47
Context: *[hl7:templateId[@root = '1.2.40.0.34.6.0.11.9.47']]/hl7:templateId[@root = '1.2.40.0.34.6.0.11.9.47']
Item: (atcdabbr_other_ParticipantBodyDataEnterer)
-->

   <rule fpi="RULC-1"
         context="*[hl7:templateId[@root = '1.2.40.0.34.6.0.11.9.47']]/hl7:templateId[@root = '1.2.40.0.34.6.0.11.9.47']"
         id="d42e62369-false-d1530938e0">
      <extends rule="II"/>
      <assert role="error"
              see="http://elga.art-decor.org/elgaimpf-html-20250116T125121/tmp-1.2.40.0.34.6.0.11.9.47-2023-02-28T124446.html"
              test="empty(@xsi:type) or resolve-QName(@xsi:type, .) = QName('urn:hl7-org:v3', 'II')">(atcdabbr_other_ParticipantBodyDataEnterer): Wenn eine @xsi:type Instruktion anwesend ist MUSS diese den Wert "{urn:hl7-org:v3}:II" haben. Gefunden "{<value-of select="namespace-uri-from-QName(resolve-QName(@xsi:type,.))"/>}:<value-of select="local-name-from-QName(resolve-QName(@xsi:type,.))"/>"</assert>
      <assert role="error"
              see="http://elga.art-decor.org/elgaimpf-html-20250116T125121/tmp-1.2.40.0.34.6.0.11.9.47-2023-02-28T124446.html"
              test="string(@root) = ('1.2.40.0.34.6.0.11.9.47')">(atcdabbr_other_ParticipantBodyDataEnterer): Der Wert von root MUSS '1.2.40.0.34.6.0.11.9.47' sein. Gefunden: "<value-of select="@root"/>"</assert>
   </rule>
   <!--
Template derived rules for ID: 1.2.40.0.34.6.0.11.9.47
Context: *[hl7:templateId[@root = '1.2.40.0.34.6.0.11.9.47']]/hl7:time
Item: (atcdabbr_other_ParticipantBodyDataEnterer)
-->

   <rule fpi="RULC-1"
         context="*[hl7:templateId[@root = '1.2.40.0.34.6.0.11.9.47']]/hl7:time"
         id="d42e62378-false-d1530952e0">
      <extends rule="TS.AT.TZ"/>
      <assert role="error"
              see="http://elga.art-decor.org/elgaimpf-html-20250116T125121/tmp-1.2.40.0.34.6.0.11.9.47-2023-02-28T124446.html"
              test="empty(@xsi:type) or resolve-QName(@xsi:type, .) = QName('urn:hl7-org:v3', 'TS')">(atcdabbr_other_ParticipantBodyDataEnterer): Wenn eine @xsi:type Instruktion anwesend ist MUSS diese den Wert "{urn:hl7-org:v3}:TS" haben. Gefunden "{<value-of select="namespace-uri-from-QName(resolve-QName(@xsi:type,.))"/>}:<value-of select="local-name-from-QName(resolve-QName(@xsi:type,.))"/>"</assert>
      <assert role="error"
              see="http://elga.art-decor.org/elgaimpf-html-20250116T125121/tmp-1.2.40.0.34.6.0.11.9.47-2023-02-28T124446.html"
              test="not(*)">(atcdabbr_other_ParticipantBodyDataEnterer): <value-of select="local-name()"/> with datatype TS.AT.TZ, SHOULD NOT have child elements.</assert>
   </rule>
   <!--
Template derived rules for ID: 1.2.40.0.34.6.0.11.9.47
Context: *[hl7:templateId[@root = '1.2.40.0.34.6.0.11.9.47']]/hl7:participantRole[not(@nullFlavor)]
Item: (atcdabbr_other_ParticipantBodyDataEnterer)
-->

   <rule fpi="RULC-1"
         context="*[hl7:templateId[@root = '1.2.40.0.34.6.0.11.9.47']]/hl7:participantRole[not(@nullFlavor)]"
         id="d42e62386-false-d1530980e0">
      <assert role="error"
              see="http://elga.art-decor.org/elgaimpf-html-20250116T125121/tmp-1.2.40.0.34.6.0.11.9.47-2023-02-28T124446.html"
              test="string(@classCode) = ('ROL') or not(@classCode)">(atcdabbr_other_ParticipantBodyDataEnterer): Der Wert von classCode MUSS 'ROL' sein. Gefunden: "<value-of select="@classCode"/>"</assert>
      <let name="elmcount"
           value="count(hl7:id[not(@nullFlavor)] | hl7:id[@nullFlavor='NI'] | hl7:id[@nullFlavor='UNK'])"/>
      <assert role="error"
              see="http://elga.art-decor.org/elgaimpf-html-20250116T125121/tmp-1.2.40.0.34.6.0.11.9.47-2023-02-28T124446.html"
              test="$elmcount &gt;= 1">(atcdabbr_other_ParticipantBodyDataEnterer): Auswahl (hl7:id[not(@nullFlavor)]  oder  hl7:id[@nullFlavor='NI']  oder  hl7:id[@nullFlavor='UNK']) enthält nicht genügend Elemente [min 1x]</assert>
      <assert role="error"
              see="http://elga.art-decor.org/elgaimpf-html-20250116T125121/tmp-1.2.40.0.34.6.0.11.9.47-2023-02-28T124446.html"
              test="count(hl7:id[@nullFlavor='NI']) &lt;= 1">(atcdabbr_other_ParticipantBodyDataEnterer): Element hl7:id[@nullFlavor='NI'] kommt zu häufig vor [max 1x].</assert>
      <assert role="error"
              see="http://elga.art-decor.org/elgaimpf-html-20250116T125121/tmp-1.2.40.0.34.6.0.11.9.47-2023-02-28T124446.html"
              test="count(hl7:id[@nullFlavor='UNK']) &lt;= 1">(atcdabbr_other_ParticipantBodyDataEnterer): Element hl7:id[@nullFlavor='UNK'] kommt zu häufig vor [max 1x].</assert>
      <assert role="error"
              see="http://elga.art-decor.org/elgaimpf-html-20250116T125121/tmp-1.2.40.0.34.6.0.11.9.47-2023-02-28T124446.html"
              test="count(hl7:addr[not(@nullFlavor)]) &lt;= 1">(atcdabbr_other_ParticipantBodyDataEnterer): Element hl7:addr[not(@nullFlavor)] kommt zu häufig vor [max 1x].</assert>
      <let name="elmcount" value="count(hl7:playingDevice | hl7:playingEntity)"/>
      <assert role="error"
              see="http://elga.art-decor.org/elgaimpf-html-20250116T125121/tmp-1.2.40.0.34.6.0.11.9.47-2023-02-28T124446.html"
              test="$elmcount &gt;= 1">(atcdabbr_other_ParticipantBodyDataEnterer): Auswahl (hl7:playingDevice  oder  hl7:playingEntity) enthält nicht genügend Elemente [min 1x]</assert>
      <assert role="error"
              see="http://elga.art-decor.org/elgaimpf-html-20250116T125121/tmp-1.2.40.0.34.6.0.11.9.47-2023-02-28T124446.html"
              test="$elmcount &lt;= 1">(atcdabbr_other_ParticipantBodyDataEnterer): Auswahl (hl7:playingDevice  oder  hl7:playingEntity) enthält zu viele Elemente [max 1x]</assert>
      <assert role="error"
              see="http://elga.art-decor.org/elgaimpf-html-20250116T125121/tmp-1.2.40.0.34.6.0.11.9.47-2023-02-28T124446.html"
              test="count(hl7:playingDevice) &lt;= 1">(atcdabbr_other_ParticipantBodyDataEnterer): Element hl7:playingDevice kommt zu häufig vor [max 1x].</assert>
      <assert role="error"
              see="http://elga.art-decor.org/elgaimpf-html-20250116T125121/tmp-1.2.40.0.34.6.0.11.9.47-2023-02-28T124446.html"
              test="count(hl7:playingEntity) &lt;= 1">(atcdabbr_other_ParticipantBodyDataEnterer): Element hl7:playingEntity kommt zu häufig vor [max 1x].</assert>
      <assert role="error"
              see="http://elga.art-decor.org/elgaimpf-html-20250116T125121/tmp-1.2.40.0.34.6.0.11.9.47-2023-02-28T124446.html"
              test="count(hl7:scopingEntity) &lt;= 1">(atcdabbr_other_ParticipantBodyDataEnterer): Element hl7:scopingEntity kommt zu häufig vor [max 1x].</assert>
   </rule>
   <!--
Template derived rules for ID: 1.2.40.0.34.6.0.11.9.47
Context: *[hl7:templateId[@root = '1.2.40.0.34.6.0.11.9.47']]/hl7:participantRole[not(@nullFlavor)]/hl7:id[not(@nullFlavor)]
Item: (atcdabbr_other_ParticipantBodyDataEnterer)
-->

   <rule fpi="RULC-1"
         context="*[hl7:templateId[@root = '1.2.40.0.34.6.0.11.9.47']]/hl7:participantRole[not(@nullFlavor)]/hl7:id[not(@nullFlavor)]"
         id="d42e62397-false-d1531049e0">
      <extends rule="II"/>
      <assert role="error"
              see="http://elga.art-decor.org/elgaimpf-html-20250116T125121/tmp-1.2.40.0.34.6.0.11.9.47-2023-02-28T124446.html"
              test="empty(@xsi:type) or resolve-QName(@xsi:type, .) = QName('urn:hl7-org:v3', 'II')">(atcdabbr_other_ParticipantBodyDataEnterer): Wenn eine @xsi:type Instruktion anwesend ist MUSS diese den Wert "{urn:hl7-org:v3}:II" haben. Gefunden "{<value-of select="namespace-uri-from-QName(resolve-QName(@xsi:type,.))"/>}:<value-of select="local-name-from-QName(resolve-QName(@xsi:type,.))"/>"</assert>
      <assert role="error"
              see="http://elga.art-decor.org/elgaimpf-html-20250116T125121/tmp-1.2.40.0.34.6.0.11.9.47-2023-02-28T124446.html"
              test="not(@root) or (string-length(@root) &gt; 0 and not(matches(@root,'\s')))">(atcdabbr_other_ParticipantBodyDataEnterer): Attribute @root MUSS vom Datentyp 'cs' sein  - '<value-of select="@root"/>'</assert>
      <assert role="error"
              see="http://elga.art-decor.org/elgaimpf-html-20250116T125121/tmp-1.2.40.0.34.6.0.11.9.47-2023-02-28T124446.html"
              test="not(@extension) or string-length(@extension)&gt;0">(atcdabbr_other_ParticipantBodyDataEnterer): Attribute @extension MUSS vom Datentyp 'st' sein  - '<value-of select="@extension"/>'</assert>
   </rule>
   <!--
Template derived rules for ID: 1.2.40.0.34.6.0.11.9.47
Context: *[hl7:templateId[@root = '1.2.40.0.34.6.0.11.9.47']]/hl7:participantRole[not(@nullFlavor)]/hl7:id[@nullFlavor='NI']
Item: (atcdabbr_other_ParticipantBodyDataEnterer)
-->

   <rule fpi="RULC-1"
         context="*[hl7:templateId[@root = '1.2.40.0.34.6.0.11.9.47']]/hl7:participantRole[not(@nullFlavor)]/hl7:id[@nullFlavor='NI']"
         id="d42e62404-false-d1531064e0">
      <extends rule="II"/>
      <assert role="error"
              see="http://elga.art-decor.org/elgaimpf-html-20250116T125121/tmp-1.2.40.0.34.6.0.11.9.47-2023-02-28T124446.html"
              test="empty(@xsi:type) or resolve-QName(@xsi:type, .) = QName('urn:hl7-org:v3', 'II')">(atcdabbr_other_ParticipantBodyDataEnterer): Wenn eine @xsi:type Instruktion anwesend ist MUSS diese den Wert "{urn:hl7-org:v3}:II" haben. Gefunden "{<value-of select="namespace-uri-from-QName(resolve-QName(@xsi:type,.))"/>}:<value-of select="local-name-from-QName(resolve-QName(@xsi:type,.))"/>"</assert>
      <assert role="error"
              see="http://elga.art-decor.org/elgaimpf-html-20250116T125121/tmp-1.2.40.0.34.6.0.11.9.47-2023-02-28T124446.html"
              test="string(@nullFlavor) = ('NI')">(atcdabbr_other_ParticipantBodyDataEnterer): Der Wert von nullFlavor MUSS 'NI' sein. Gefunden: "<value-of select="@nullFlavor"/>"</assert>
   </rule>
   <!--
Template derived rules for ID: 1.2.40.0.34.6.0.11.9.47
Context: *[hl7:templateId[@root = '1.2.40.0.34.6.0.11.9.47']]/hl7:participantRole[not(@nullFlavor)]/hl7:id[@nullFlavor='UNK']
Item: (atcdabbr_other_ParticipantBodyDataEnterer)
-->

   <rule fpi="RULC-1"
         context="*[hl7:templateId[@root = '1.2.40.0.34.6.0.11.9.47']]/hl7:participantRole[not(@nullFlavor)]/hl7:id[@nullFlavor='UNK']"
         id="d42e62409-false-d1531076e0">
      <extends rule="II"/>
      <assert role="error"
              see="http://elga.art-decor.org/elgaimpf-html-20250116T125121/tmp-1.2.40.0.34.6.0.11.9.47-2023-02-28T124446.html"
              test="empty(@xsi:type) or resolve-QName(@xsi:type, .) = QName('urn:hl7-org:v3', 'II')">(atcdabbr_other_ParticipantBodyDataEnterer): Wenn eine @xsi:type Instruktion anwesend ist MUSS diese den Wert "{urn:hl7-org:v3}:II" haben. Gefunden "{<value-of select="namespace-uri-from-QName(resolve-QName(@xsi:type,.))"/>}:<value-of select="local-name-from-QName(resolve-QName(@xsi:type,.))"/>"</assert>
      <assert role="error"
              see="http://elga.art-decor.org/elgaimpf-html-20250116T125121/tmp-1.2.40.0.34.6.0.11.9.47-2023-02-28T124446.html"
              test="string(@nullFlavor) = ('UNK')">(atcdabbr_other_ParticipantBodyDataEnterer): Der Wert von nullFlavor MUSS 'UNK' sein. Gefunden: "<value-of select="@nullFlavor"/>"</assert>
   </rule>

   <!--
Template derived rules for ID: 1.2.40.0.34.6.0.11.9.47
Context: *[hl7:templateId[@root = '1.2.40.0.34.6.0.11.9.47']]/hl7:participantRole[not(@nullFlavor)]/hl7:addr[not(@nullFlavor)]
Item: (atcdabbr_other_ParticipantBodyDataEnterer)
-->

   <!--
Template derived rules for ID: 1.2.40.0.34.6.0.11.9.25
Context: *[hl7:templateId[@root = '1.2.40.0.34.6.0.11.9.47']]/hl7:participantRole[not(@nullFlavor)]/hl7:addr[not(@nullFlavor)]
Item: (atcdabbr_other_AddressCompilation)
-->
   <rule fpi="RULC-1"
         context="*[hl7:templateId[@root = '1.2.40.0.34.6.0.11.9.47']]/hl7:participantRole[not(@nullFlavor)]/hl7:addr[not(@nullFlavor)]">
      <assert role="error"
              see="http://elga.art-decor.org/elgaimpf-html-20250116T125121/tmp-1.2.40.0.34.6.0.11.9.25-2023-04-13T132100.html"
              test="not(@use) or (string-length(@use) &gt; 0 and not(matches(@use,'\s')))">(atcdabbr_other_AddressCompilation): Attribute @use MUSS vom Datentyp 'cs' sein  - '<value-of select="@use"/>'</assert>
      <assert role="error"
              see="http://elga.art-decor.org/elgaimpf-html-20250116T125121/tmp-1.2.40.0.34.6.0.11.9.25-2023-04-13T132100.html"
              test="not(hl7:streetAddressLine and (hl7:streetName or hl7:houseNumber)) or ((hl7:streetAddressLine or (hl7:streetName and hl7:houseNumber)) and not((hl7:streetAddressLine and hl7:streetName and hl7:houseNumber) or (hl7:streetAddressLine and (hl7:streetName or hl7:houseNumber))))">(atcdabbr_other_AddressCompilation): Es muss entweder streetAddressLine oder streetName UND houseNumber angegeben
                werden.</assert>
      <assert role="error"
              see="http://elga.art-decor.org/elgaimpf-html-20250116T125121/tmp-1.2.40.0.34.6.0.11.9.25-2023-04-13T132100.html"
              test="count(hl7:streetAddressLine) &lt;= 1">(atcdabbr_other_AddressCompilation): Element hl7:streetAddressLine kommt zu häufig vor [max 1x].</assert>
      <assert role="error"
              see="http://elga.art-decor.org/elgaimpf-html-20250116T125121/tmp-1.2.40.0.34.6.0.11.9.25-2023-04-13T132100.html"
              test="count(hl7:streetName) &lt;= 1">(atcdabbr_other_AddressCompilation): Element hl7:streetName kommt zu häufig vor [max 1x].</assert>
      <assert role="error"
              see="http://elga.art-decor.org/elgaimpf-html-20250116T125121/tmp-1.2.40.0.34.6.0.11.9.25-2023-04-13T132100.html"
              test="count(hl7:houseNumber) &lt;= 1">(atcdabbr_other_AddressCompilation): Element hl7:houseNumber kommt zu häufig vor [max 1x].</assert>
      <assert role="error"
              see="http://elga.art-decor.org/elgaimpf-html-20250116T125121/tmp-1.2.40.0.34.6.0.11.9.25-2023-04-13T132100.html"
              test="count(hl7:postalCode[not(@nullFlavor)]) &gt;= 1">(atcdabbr_other_AddressCompilation): Element hl7:postalCode[not(@nullFlavor)] ist mandatory [min 1x].</assert>
      <assert role="error"
              see="http://elga.art-decor.org/elgaimpf-html-20250116T125121/tmp-1.2.40.0.34.6.0.11.9.25-2023-04-13T132100.html"
              test="count(hl7:postalCode[not(@nullFlavor)]) &lt;= 1">(atcdabbr_other_AddressCompilation): Element hl7:postalCode[not(@nullFlavor)] kommt zu häufig vor [max 1x].</assert>
      <assert role="error"
              see="http://elga.art-decor.org/elgaimpf-html-20250116T125121/tmp-1.2.40.0.34.6.0.11.9.25-2023-04-13T132100.html"
              test="count(hl7:city[not(@nullFlavor)]) &gt;= 1">(atcdabbr_other_AddressCompilation): Element hl7:city[not(@nullFlavor)] ist mandatory [min 1x].</assert>
      <assert role="error"
              see="http://elga.art-decor.org/elgaimpf-html-20250116T125121/tmp-1.2.40.0.34.6.0.11.9.25-2023-04-13T132100.html"
              test="count(hl7:city[not(@nullFlavor)]) &lt;= 1">(atcdabbr_other_AddressCompilation): Element hl7:city[not(@nullFlavor)] kommt zu häufig vor [max 1x].</assert>
      <assert role="error"
              see="http://elga.art-decor.org/elgaimpf-html-20250116T125121/tmp-1.2.40.0.34.6.0.11.9.25-2023-04-13T132100.html"
              test="count(hl7:state) &lt;= 1">(atcdabbr_other_AddressCompilation): Element hl7:state kommt zu häufig vor [max 1x].</assert>
      <assert role="error"
              see="http://elga.art-decor.org/elgaimpf-html-20250116T125121/tmp-1.2.40.0.34.6.0.11.9.25-2023-04-13T132100.html"
              test="count(hl7:country[not(@nullFlavor)]) &gt;= 1">(atcdabbr_other_AddressCompilation): Element hl7:country[not(@nullFlavor)] ist mandatory [min 1x].</assert>
      <assert role="error"
              see="http://elga.art-decor.org/elgaimpf-html-20250116T125121/tmp-1.2.40.0.34.6.0.11.9.25-2023-04-13T132100.html"
              test="count(hl7:country[not(@nullFlavor)]) &lt;= 1">(atcdabbr_other_AddressCompilation): Element hl7:country[not(@nullFlavor)] kommt zu häufig vor [max 1x].</assert>
      <assert role="error"
              see="http://elga.art-decor.org/elgaimpf-html-20250116T125121/tmp-1.2.40.0.34.6.0.11.9.25-2023-04-13T132100.html"
              test="count(hl7:additionalLocator) &lt;= 1">(atcdabbr_other_AddressCompilation): Element hl7:additionalLocator kommt zu häufig vor [max 1x].</assert>
   </rule>

   <!--
Template derived rules for ID: 1.2.40.0.34.6.0.11.9.25
Context: *[hl7:templateId[@root = '1.2.40.0.34.6.0.11.9.47']]/hl7:participantRole[not(@nullFlavor)]/hl7:addr[not(@nullFlavor)]/hl7:streetAddressLine
Item: (atcdabbr_other_AddressCompilation)
-->
   <rule fpi="RULC-1"
         context="*[hl7:templateId[@root = '1.2.40.0.34.6.0.11.9.47']]/hl7:participantRole[not(@nullFlavor)]/hl7:addr[not(@nullFlavor)]/hl7:streetAddressLine">
      <extends rule="ADXP"/>
      <assert role="error"
              see="http://elga.art-decor.org/elgaimpf-html-20250116T125121/tmp-1.2.40.0.34.6.0.11.9.25-2023-04-13T132100.html"
              test="empty(@xsi:type) or resolve-QName(@xsi:type, .) = QName('urn:hl7-org:v3', 'ADXP')">(atcdabbr_other_AddressCompilation): Wenn eine @xsi:type Instruktion anwesend ist MUSS diese den Wert "{urn:hl7-org:v3}:ADXP" haben. Gefunden "{<value-of select="namespace-uri-from-QName(resolve-QName(@xsi:type,.))"/>}:<value-of select="local-name-from-QName(resolve-QName(@xsi:type,.))"/>"</assert>
   </rule>

   <!--
Template derived rules for ID: 1.2.40.0.34.6.0.11.9.25
Context: *[hl7:templateId[@root = '1.2.40.0.34.6.0.11.9.47']]/hl7:participantRole[not(@nullFlavor)]/hl7:addr[not(@nullFlavor)]/hl7:streetName
Item: (atcdabbr_other_AddressCompilation)
-->
   <rule fpi="RULC-1"
         context="*[hl7:templateId[@root = '1.2.40.0.34.6.0.11.9.47']]/hl7:participantRole[not(@nullFlavor)]/hl7:addr[not(@nullFlavor)]/hl7:streetName">
      <extends rule="ADXP"/>
      <assert role="error"
              see="http://elga.art-decor.org/elgaimpf-html-20250116T125121/tmp-1.2.40.0.34.6.0.11.9.25-2023-04-13T132100.html"
              test="empty(@xsi:type) or resolve-QName(@xsi:type, .) = QName('urn:hl7-org:v3', 'ADXP')">(atcdabbr_other_AddressCompilation): Wenn eine @xsi:type Instruktion anwesend ist MUSS diese den Wert "{urn:hl7-org:v3}:ADXP" haben. Gefunden "{<value-of select="namespace-uri-from-QName(resolve-QName(@xsi:type,.))"/>}:<value-of select="local-name-from-QName(resolve-QName(@xsi:type,.))"/>"</assert>
   </rule>

   <!--
Template derived rules for ID: 1.2.40.0.34.6.0.11.9.25
Context: *[hl7:templateId[@root = '1.2.40.0.34.6.0.11.9.47']]/hl7:participantRole[not(@nullFlavor)]/hl7:addr[not(@nullFlavor)]/hl7:houseNumber
Item: (atcdabbr_other_AddressCompilation)
-->
   <rule fpi="RULC-1"
         context="*[hl7:templateId[@root = '1.2.40.0.34.6.0.11.9.47']]/hl7:participantRole[not(@nullFlavor)]/hl7:addr[not(@nullFlavor)]/hl7:houseNumber">
      <extends rule="ADXP"/>
      <assert role="error"
              see="http://elga.art-decor.org/elgaimpf-html-20250116T125121/tmp-1.2.40.0.34.6.0.11.9.25-2023-04-13T132100.html"
              test="empty(@xsi:type) or resolve-QName(@xsi:type, .) = QName('urn:hl7-org:v3', 'ADXP')">(atcdabbr_other_AddressCompilation): Wenn eine @xsi:type Instruktion anwesend ist MUSS diese den Wert "{urn:hl7-org:v3}:ADXP" haben. Gefunden "{<value-of select="namespace-uri-from-QName(resolve-QName(@xsi:type,.))"/>}:<value-of select="local-name-from-QName(resolve-QName(@xsi:type,.))"/>"</assert>
   </rule>

   <!--
Template derived rules for ID: 1.2.40.0.34.6.0.11.9.25
Context: *[hl7:templateId[@root = '1.2.40.0.34.6.0.11.9.47']]/hl7:participantRole[not(@nullFlavor)]/hl7:addr[not(@nullFlavor)]/hl7:postalCode[not(@nullFlavor)]
Item: (atcdabbr_other_AddressCompilation)
-->
   <rule fpi="RULC-1"
         context="*[hl7:templateId[@root = '1.2.40.0.34.6.0.11.9.47']]/hl7:participantRole[not(@nullFlavor)]/hl7:addr[not(@nullFlavor)]/hl7:postalCode[not(@nullFlavor)]">
      <extends rule="ADXP"/>
      <assert role="error"
              see="http://elga.art-decor.org/elgaimpf-html-20250116T125121/tmp-1.2.40.0.34.6.0.11.9.25-2023-04-13T132100.html"
              test="empty(@xsi:type) or resolve-QName(@xsi:type, .) = QName('urn:hl7-org:v3', 'ADXP')">(atcdabbr_other_AddressCompilation): Wenn eine @xsi:type Instruktion anwesend ist MUSS diese den Wert "{urn:hl7-org:v3}:ADXP" haben. Gefunden "{<value-of select="namespace-uri-from-QName(resolve-QName(@xsi:type,.))"/>}:<value-of select="local-name-from-QName(resolve-QName(@xsi:type,.))"/>"</assert>
   </rule>

   <!--
Template derived rules for ID: 1.2.40.0.34.6.0.11.9.25
Context: *[hl7:templateId[@root = '1.2.40.0.34.6.0.11.9.47']]/hl7:participantRole[not(@nullFlavor)]/hl7:addr[not(@nullFlavor)]/hl7:city[not(@nullFlavor)]
Item: (atcdabbr_other_AddressCompilation)
-->
   <rule fpi="RULC-1"
         context="*[hl7:templateId[@root = '1.2.40.0.34.6.0.11.9.47']]/hl7:participantRole[not(@nullFlavor)]/hl7:addr[not(@nullFlavor)]/hl7:city[not(@nullFlavor)]">
      <extends rule="ADXP"/>
      <assert role="error"
              see="http://elga.art-decor.org/elgaimpf-html-20250116T125121/tmp-1.2.40.0.34.6.0.11.9.25-2023-04-13T132100.html"
              test="empty(@xsi:type) or resolve-QName(@xsi:type, .) = QName('urn:hl7-org:v3', 'ADXP')">(atcdabbr_other_AddressCompilation): Wenn eine @xsi:type Instruktion anwesend ist MUSS diese den Wert "{urn:hl7-org:v3}:ADXP" haben. Gefunden "{<value-of select="namespace-uri-from-QName(resolve-QName(@xsi:type,.))"/>}:<value-of select="local-name-from-QName(resolve-QName(@xsi:type,.))"/>"</assert>
   </rule>

   <!--
Template derived rules for ID: 1.2.40.0.34.6.0.11.9.25
Context: *[hl7:templateId[@root = '1.2.40.0.34.6.0.11.9.47']]/hl7:participantRole[not(@nullFlavor)]/hl7:addr[not(@nullFlavor)]/hl7:state
Item: (atcdabbr_other_AddressCompilation)
-->
   <rule fpi="RULC-1"
         context="*[hl7:templateId[@root = '1.2.40.0.34.6.0.11.9.47']]/hl7:participantRole[not(@nullFlavor)]/hl7:addr[not(@nullFlavor)]/hl7:state">
      <extends rule="ADXP"/>
      <assert role="error"
              see="http://elga.art-decor.org/elgaimpf-html-20250116T125121/tmp-1.2.40.0.34.6.0.11.9.25-2023-04-13T132100.html"
              test="empty(@xsi:type) or resolve-QName(@xsi:type, .) = QName('urn:hl7-org:v3', 'ADXP')">(atcdabbr_other_AddressCompilation): Wenn eine @xsi:type Instruktion anwesend ist MUSS diese den Wert "{urn:hl7-org:v3}:ADXP" haben. Gefunden "{<value-of select="namespace-uri-from-QName(resolve-QName(@xsi:type,.))"/>}:<value-of select="local-name-from-QName(resolve-QName(@xsi:type,.))"/>"</assert>
   </rule>

   <!--
Template derived rules for ID: 1.2.40.0.34.6.0.11.9.25
Context: *[hl7:templateId[@root = '1.2.40.0.34.6.0.11.9.47']]/hl7:participantRole[not(@nullFlavor)]/hl7:addr[not(@nullFlavor)]/hl7:country[not(@nullFlavor)]
Item: (atcdabbr_other_AddressCompilation)
-->
   <rule fpi="RULC-1"
         context="*[hl7:templateId[@root = '1.2.40.0.34.6.0.11.9.47']]/hl7:participantRole[not(@nullFlavor)]/hl7:addr[not(@nullFlavor)]/hl7:country[not(@nullFlavor)]">
      <extends rule="ADXP"/>
      <assert role="error"
              see="http://elga.art-decor.org/elgaimpf-html-20250116T125121/tmp-1.2.40.0.34.6.0.11.9.25-2023-04-13T132100.html"
              test="empty(@xsi:type) or resolve-QName(@xsi:type, .) = QName('urn:hl7-org:v3', 'ADXP')">(atcdabbr_other_AddressCompilation): Wenn eine @xsi:type Instruktion anwesend ist MUSS diese den Wert "{urn:hl7-org:v3}:ADXP" haben. Gefunden "{<value-of select="namespace-uri-from-QName(resolve-QName(@xsi:type,.))"/>}:<value-of select="local-name-from-QName(resolve-QName(@xsi:type,.))"/>"</assert>
      <assert role="info"
              see="http://elga.art-decor.org/elgaimpf-html-20250116T125121/tmp-1.2.40.0.34.6.0.11.9.25-2023-04-13T132100.html"
              test="string-length(text()) = 3">(atcdabbr_other_AddressCompilation): Es wird EMPFOHLEN, den Staat im ISO 3 Ländercode anzugeben.</assert>
   </rule>

   <!--
Template derived rules for ID: 1.2.40.0.34.6.0.11.9.25
Context: *[hl7:templateId[@root = '1.2.40.0.34.6.0.11.9.47']]/hl7:participantRole[not(@nullFlavor)]/hl7:addr[not(@nullFlavor)]/hl7:additionalLocator
Item: (atcdabbr_other_AddressCompilation)
-->
   <rule fpi="RULC-1"
         context="*[hl7:templateId[@root = '1.2.40.0.34.6.0.11.9.47']]/hl7:participantRole[not(@nullFlavor)]/hl7:addr[not(@nullFlavor)]/hl7:additionalLocator">
      <extends rule="ADXP"/>
      <assert role="error"
              see="http://elga.art-decor.org/elgaimpf-html-20250116T125121/tmp-1.2.40.0.34.6.0.11.9.25-2023-04-13T132100.html"
              test="empty(@xsi:type) or resolve-QName(@xsi:type, .) = QName('urn:hl7-org:v3', 'ADXP')">(atcdabbr_other_AddressCompilation): Wenn eine @xsi:type Instruktion anwesend ist MUSS diese den Wert "{urn:hl7-org:v3}:ADXP" haben. Gefunden "{<value-of select="namespace-uri-from-QName(resolve-QName(@xsi:type,.))"/>}:<value-of select="local-name-from-QName(resolve-QName(@xsi:type,.))"/>"</assert>
   </rule>
   <!--
Template derived rules for ID: 1.2.40.0.34.6.0.11.9.47
Context: *[hl7:templateId[@root = '1.2.40.0.34.6.0.11.9.47']]/hl7:participantRole[not(@nullFlavor)]/hl7:telecom[not(@nullFlavor)]
Item: (atcdabbr_other_ParticipantBodyDataEnterer)
-->

   <rule fpi="RULC-1"
         context="*[hl7:templateId[@root = '1.2.40.0.34.6.0.11.9.47']]/hl7:participantRole[not(@nullFlavor)]/hl7:telecom[not(@nullFlavor)]"
         id="d42e62423-false-d1531242e0">
      <extends rule="TEL.AT"/>
      <assert role="error"
              see="http://elga.art-decor.org/elgaimpf-html-20250116T125121/tmp-1.2.40.0.34.6.0.11.9.47-2023-02-28T124446.html"
              test="empty(@xsi:type) or resolve-QName(@xsi:type, .) = QName('urn:hl7-org:v3', 'TEL')">(atcdabbr_other_ParticipantBodyDataEnterer): Wenn eine @xsi:type Instruktion anwesend ist MUSS diese den Wert "{urn:hl7-org:v3}:TEL" haben. Gefunden "{<value-of select="namespace-uri-from-QName(resolve-QName(@xsi:type,.))"/>}:<value-of select="local-name-from-QName(resolve-QName(@xsi:type,.))"/>"</assert>
      <assert role="error"
              see="http://elga.art-decor.org/elgaimpf-html-20250116T125121/tmp-1.2.40.0.34.6.0.11.9.47-2023-02-28T124446.html"
              test="@value">(atcdabbr_other_ParticipantBodyDataEnterer): Attribut @value MUSS vorkommen.</assert>
      <assert role="error"
              see="http://elga.art-decor.org/elgaimpf-html-20250116T125121/tmp-1.2.40.0.34.6.0.11.9.47-2023-02-28T124446.html"
              test="not(@value) or string-length(@value)&gt;0">(atcdabbr_other_ParticipantBodyDataEnterer): Attribute @value MUSS vom Datentyp 'st' sein  - '<value-of select="@value"/>'</assert>
      <assert role="error"
              see="http://elga.art-decor.org/elgaimpf-html-20250116T125121/tmp-1.2.40.0.34.6.0.11.9.47-2023-02-28T124446.html"
              test="not(@use) or string-length(@use) &gt; 0">(atcdabbr_other_ParticipantBodyDataEnterer): Attribute @use MUSS vom Datentyp 'set_cs' sein  - '<value-of select="@use"/>'</assert>
   </rule>

   <!--
Template derived rules for ID: 1.2.40.0.34.6.0.11.9.47
Context: *[hl7:templateId[@root = '1.2.40.0.34.6.0.11.9.47']]/hl7:participantRole[not(@nullFlavor)]/hl7:playingDevice
Item: (atcdabbr_other_ParticipantBodyDataEnterer)
-->

   <!--
Template derived rules for ID: 1.2.40.0.34.6.0.11.9.18
Context: *[hl7:templateId[@root = '1.2.40.0.34.6.0.11.9.47']]/hl7:participantRole[not(@nullFlavor)]/hl7:playingDevice
Item: (atcdabbr_other_DeviceCompilation)
-->
   <rule fpi="RULC-1"
         context="*[hl7:templateId[@root = '1.2.40.0.34.6.0.11.9.47']]/hl7:participantRole[not(@nullFlavor)]/hl7:playingDevice">
      <assert role="error"
              see="http://elga.art-decor.org/elgaimpf-html-20250116T125121/tmp-1.2.40.0.34.6.0.11.9.18-2023-04-06T142415.html"
              test="string(@classCode) = ('DEV') or not(@classCode)">(atcdabbr_other_DeviceCompilation): Der Wert von classCode MUSS 'DEV' sein. Gefunden: "<value-of select="@classCode"/>"</assert>
      <assert role="error"
              see="http://elga.art-decor.org/elgaimpf-html-20250116T125121/tmp-1.2.40.0.34.6.0.11.9.18-2023-04-06T142415.html"
              test="string(@determinerCode) = ('INSTANCE') or not(@determinerCode)">(atcdabbr_other_DeviceCompilation): Der Wert von determinerCode MUSS 'INSTANCE' sein. Gefunden: "<value-of select="@determinerCode"/>"</assert>
      <assert role="error"
              see="http://elga.art-decor.org/elgaimpf-html-20250116T125121/tmp-1.2.40.0.34.6.0.11.9.18-2023-04-06T142415.html"
              test="count(hl7:manufacturerModelName[not(@nullFlavor)]) &gt;= 1">(atcdabbr_other_DeviceCompilation): Element hl7:manufacturerModelName[not(@nullFlavor)] ist mandatory [min 1x].</assert>
      <assert role="error"
              see="http://elga.art-decor.org/elgaimpf-html-20250116T125121/tmp-1.2.40.0.34.6.0.11.9.18-2023-04-06T142415.html"
              test="count(hl7:manufacturerModelName[not(@nullFlavor)]) &lt;= 1">(atcdabbr_other_DeviceCompilation): Element hl7:manufacturerModelName[not(@nullFlavor)] kommt zu häufig vor [max 1x].</assert>
      <assert role="error"
              see="http://elga.art-decor.org/elgaimpf-html-20250116T125121/tmp-1.2.40.0.34.6.0.11.9.18-2023-04-06T142415.html"
              test="count(hl7:softwareName[not(@nullFlavor)]) &gt;= 1">(atcdabbr_other_DeviceCompilation): Element hl7:softwareName[not(@nullFlavor)] ist mandatory [min 1x].</assert>
      <assert role="error"
              see="http://elga.art-decor.org/elgaimpf-html-20250116T125121/tmp-1.2.40.0.34.6.0.11.9.18-2023-04-06T142415.html"
              test="count(hl7:softwareName[not(@nullFlavor)]) &lt;= 1">(atcdabbr_other_DeviceCompilation): Element hl7:softwareName[not(@nullFlavor)] kommt zu häufig vor [max 1x].</assert>
   </rule>

   <!--
Template derived rules for ID: 1.2.40.0.34.6.0.11.9.18
Context: *[hl7:templateId[@root = '1.2.40.0.34.6.0.11.9.47']]/hl7:participantRole[not(@nullFlavor)]/hl7:playingDevice/hl7:manufacturerModelName[not(@nullFlavor)]
Item: (atcdabbr_other_DeviceCompilation)
-->
   <rule fpi="RULC-1"
         context="*[hl7:templateId[@root = '1.2.40.0.34.6.0.11.9.47']]/hl7:participantRole[not(@nullFlavor)]/hl7:playingDevice/hl7:manufacturerModelName[not(@nullFlavor)]">
      <extends rule="SC"/>
      <assert role="error"
              see="http://elga.art-decor.org/elgaimpf-html-20250116T125121/tmp-1.2.40.0.34.6.0.11.9.18-2023-04-06T142415.html"
              test="empty(@xsi:type) or resolve-QName(@xsi:type, .) = QName('urn:hl7-org:v3', 'SC')">(atcdabbr_other_DeviceCompilation): Wenn eine @xsi:type Instruktion anwesend ist MUSS diese den Wert "{urn:hl7-org:v3}:SC" haben. Gefunden "{<value-of select="namespace-uri-from-QName(resolve-QName(@xsi:type,.))"/>}:<value-of select="local-name-from-QName(resolve-QName(@xsi:type,.))"/>"</assert>
   </rule>

   <!--
Template derived rules for ID: 1.2.40.0.34.6.0.11.9.18
Context: *[hl7:templateId[@root = '1.2.40.0.34.6.0.11.9.47']]/hl7:participantRole[not(@nullFlavor)]/hl7:playingDevice/hl7:softwareName[not(@nullFlavor)]
Item: (atcdabbr_other_DeviceCompilation)
-->
   <rule fpi="RULC-1"
         context="*[hl7:templateId[@root = '1.2.40.0.34.6.0.11.9.47']]/hl7:participantRole[not(@nullFlavor)]/hl7:playingDevice/hl7:softwareName[not(@nullFlavor)]">
      <extends rule="SC"/>
      <assert role="error"
              see="http://elga.art-decor.org/elgaimpf-html-20250116T125121/tmp-1.2.40.0.34.6.0.11.9.18-2023-04-06T142415.html"
              test="empty(@xsi:type) or resolve-QName(@xsi:type, .) = QName('urn:hl7-org:v3', 'SC')">(atcdabbr_other_DeviceCompilation): Wenn eine @xsi:type Instruktion anwesend ist MUSS diese den Wert "{urn:hl7-org:v3}:SC" haben. Gefunden "{<value-of select="namespace-uri-from-QName(resolve-QName(@xsi:type,.))"/>}:<value-of select="local-name-from-QName(resolve-QName(@xsi:type,.))"/>"</assert>
   </rule>
   <!--
Template derived rules for ID: 1.2.40.0.34.6.0.11.9.47
Context: *[hl7:templateId[@root = '1.2.40.0.34.6.0.11.9.47']]/hl7:participantRole[not(@nullFlavor)]/hl7:playingEntity
Item: (atcdabbr_other_ParticipantBodyDataEnterer)
-->

   <rule fpi="RULC-1"
         context="*[hl7:templateId[@root = '1.2.40.0.34.6.0.11.9.47']]/hl7:participantRole[not(@nullFlavor)]/hl7:playingEntity"
         id="d42e62447-false-d1531332e0">
      <assert role="error"
              see="http://elga.art-decor.org/elgaimpf-html-20250116T125121/tmp-1.2.40.0.34.6.0.11.9.47-2023-02-28T124446.html"
              test="string(@classCode) = ('ENT') or not(@classCode)">(atcdabbr_other_ParticipantBodyDataEnterer): Der Wert von classCode MUSS 'ENT' sein. Gefunden: "<value-of select="@classCode"/>"</assert>
      <assert role="error"
              see="http://elga.art-decor.org/elgaimpf-html-20250116T125121/tmp-1.2.40.0.34.6.0.11.9.47-2023-02-28T124446.html"
              test="string(@determinerCode) = ('INSTANCE') or not(@determinerCode)">(atcdabbr_other_ParticipantBodyDataEnterer): Der Wert von determinerCode MUSS 'INSTANCE' sein. Gefunden: "<value-of select="@determinerCode"/>"</assert>
      <assert role="error"
              see="http://elga.art-decor.org/elgaimpf-html-20250116T125121/tmp-1.2.40.0.34.6.0.11.9.47-2023-02-28T124446.html"
              test="count(hl7:name[not(@nullFlavor)]) &gt;= 1">(atcdabbr_other_ParticipantBodyDataEnterer): Element hl7:name[not(@nullFlavor)] ist mandatory [min 1x].</assert>
      <assert role="error"
              see="http://elga.art-decor.org/elgaimpf-html-20250116T125121/tmp-1.2.40.0.34.6.0.11.9.47-2023-02-28T124446.html"
              test="count(hl7:name[not(@nullFlavor)]) &lt;= 1">(atcdabbr_other_ParticipantBodyDataEnterer): Element hl7:name[not(@nullFlavor)] kommt zu häufig vor [max 1x].</assert>
   </rule>
   <!--
Template derived rules for ID: 1.2.40.0.34.6.0.11.9.47
Context: *[hl7:templateId[@root = '1.2.40.0.34.6.0.11.9.47']]/hl7:participantRole[not(@nullFlavor)]/hl7:playingEntity/hl7:name[not(@nullFlavor)]
Item: (atcdabbr_other_ParticipantBodyDataEnterer)
-->

   <rule fpi="RULC-1"
         context="*[hl7:templateId[@root = '1.2.40.0.34.6.0.11.9.47']]/hl7:participantRole[not(@nullFlavor)]/hl7:playingEntity/hl7:name[not(@nullFlavor)]"
         id="d42e62453-false-d1531356e0">
      <extends rule="PN"/>
      <assert role="error"
              see="http://elga.art-decor.org/elgaimpf-html-20250116T125121/tmp-1.2.40.0.34.6.0.11.9.47-2023-02-28T124446.html"
              test="empty(@xsi:type) or resolve-QName(@xsi:type, .) = QName('urn:hl7-org:v3', 'PN')">(atcdabbr_other_ParticipantBodyDataEnterer): Wenn eine @xsi:type Instruktion anwesend ist MUSS diese den Wert "{urn:hl7-org:v3}:PN" haben. Gefunden "{<value-of select="namespace-uri-from-QName(resolve-QName(@xsi:type,.))"/>}:<value-of select="local-name-from-QName(resolve-QName(@xsi:type,.))"/>"</assert>
      <assert role="error"
              see="http://elga.art-decor.org/elgaimpf-html-20250116T125121/tmp-1.2.40.0.34.6.0.11.9.47-2023-02-28T124446.html"
              test="not(@use) or (string-length(@use) &gt; 0 and not(matches(@use,'\s')))">(atcdabbr_other_ParticipantBodyDataEnterer): Attribute @use MUSS vom Datentyp 'cs' sein  - '<value-of select="@use"/>'</assert>
      <assert role="error"
              see="http://elga.art-decor.org/elgaimpf-html-20250116T125121/tmp-1.2.40.0.34.6.0.11.9.47-2023-02-28T124446.html"
              test="count(hl7:family[not(@nullFlavor)]) &gt;= 1">(atcdabbr_other_ParticipantBodyDataEnterer): Element hl7:family[not(@nullFlavor)] ist mandatory [min 1x].</assert>
      <assert role="error"
              see="http://elga.art-decor.org/elgaimpf-html-20250116T125121/tmp-1.2.40.0.34.6.0.11.9.47-2023-02-28T124446.html"
              test="count(hl7:given[not(@nullFlavor)]) &gt;= 1">(atcdabbr_other_ParticipantBodyDataEnterer): Element hl7:given[not(@nullFlavor)] ist mandatory [min 1x].</assert>
   </rule>
   <!--
Template derived rules for ID: 1.2.40.0.34.6.0.11.9.47
Context: *[hl7:templateId[@root = '1.2.40.0.34.6.0.11.9.47']]/hl7:participantRole[not(@nullFlavor)]/hl7:playingEntity/hl7:name[not(@nullFlavor)]/hl7:prefix
Item: (atcdabbr_other_ParticipantBodyDataEnterer)
-->

   <rule fpi="RULC-1"
         context="*[hl7:templateId[@root = '1.2.40.0.34.6.0.11.9.47']]/hl7:participantRole[not(@nullFlavor)]/hl7:playingEntity/hl7:name[not(@nullFlavor)]/hl7:prefix"
         id="d42e62480-false-d1531389e0">
      <extends rule="ENXP"/>
      <assert role="error"
              see="http://elga.art-decor.org/elgaimpf-html-20250116T125121/tmp-1.2.40.0.34.6.0.11.9.47-2023-02-28T124446.html"
              test="empty(@xsi:type) or resolve-QName(@xsi:type, .) = QName('urn:hl7-org:v3', 'ENXP')">(atcdabbr_other_ParticipantBodyDataEnterer): Wenn eine @xsi:type Instruktion anwesend ist MUSS diese den Wert "{urn:hl7-org:v3}:ENXP" haben. Gefunden "{<value-of select="namespace-uri-from-QName(resolve-QName(@xsi:type,.))"/>}:<value-of select="local-name-from-QName(resolve-QName(@xsi:type,.))"/>"</assert>
      <assert role="error"
              see="http://elga.art-decor.org/elgaimpf-html-20250116T125121/tmp-1.2.40.0.34.6.0.11.9.47-2023-02-28T124446.html"
              test="not(@qualifier) or (string-length(@qualifier) &gt; 0 and not(matches(@qualifier,'\s')))">(atcdabbr_other_ParticipantBodyDataEnterer): Attribute @qualifier MUSS vom Datentyp 'cs' sein  - '<value-of select="@qualifier"/>'</assert>
   </rule>
   <!--
Template derived rules for ID: 1.2.40.0.34.6.0.11.9.47
Context: *[hl7:templateId[@root = '1.2.40.0.34.6.0.11.9.47']]/hl7:participantRole[not(@nullFlavor)]/hl7:playingEntity/hl7:name[not(@nullFlavor)]/hl7:family[not(@nullFlavor)]
Item: (atcdabbr_other_ParticipantBodyDataEnterer)
-->

   <rule fpi="RULC-1"
         context="*[hl7:templateId[@root = '1.2.40.0.34.6.0.11.9.47']]/hl7:participantRole[not(@nullFlavor)]/hl7:playingEntity/hl7:name[not(@nullFlavor)]/hl7:family[not(@nullFlavor)]"
         id="d42e62502-false-d1531403e0">
      <extends rule="ENXP"/>
      <assert role="error"
              see="http://elga.art-decor.org/elgaimpf-html-20250116T125121/tmp-1.2.40.0.34.6.0.11.9.47-2023-02-28T124446.html"
              test="empty(@xsi:type) or resolve-QName(@xsi:type, .) = QName('urn:hl7-org:v3', 'ENXP')">(atcdabbr_other_ParticipantBodyDataEnterer): Wenn eine @xsi:type Instruktion anwesend ist MUSS diese den Wert "{urn:hl7-org:v3}:ENXP" haben. Gefunden "{<value-of select="namespace-uri-from-QName(resolve-QName(@xsi:type,.))"/>}:<value-of select="local-name-from-QName(resolve-QName(@xsi:type,.))"/>"</assert>
      <assert role="error"
              see="http://elga.art-decor.org/elgaimpf-html-20250116T125121/tmp-1.2.40.0.34.6.0.11.9.47-2023-02-28T124446.html"
              test="not(@qualifier) or (string-length(@qualifier) &gt; 0 and not(matches(@qualifier,'\s')))">(atcdabbr_other_ParticipantBodyDataEnterer): Attribute @qualifier MUSS vom Datentyp 'cs' sein  - '<value-of select="@qualifier"/>'</assert>
   </rule>
   <!--
Template derived rules for ID: 1.2.40.0.34.6.0.11.9.47
Context: *[hl7:templateId[@root = '1.2.40.0.34.6.0.11.9.47']]/hl7:participantRole[not(@nullFlavor)]/hl7:playingEntity/hl7:name[not(@nullFlavor)]/hl7:given[not(@nullFlavor)]
Item: (atcdabbr_other_ParticipantBodyDataEnterer)
-->

   <rule fpi="RULC-1"
         context="*[hl7:templateId[@root = '1.2.40.0.34.6.0.11.9.47']]/hl7:participantRole[not(@nullFlavor)]/hl7:playingEntity/hl7:name[not(@nullFlavor)]/hl7:given[not(@nullFlavor)]"
         id="d42e62519-false-d1531417e0">
      <extends rule="ENXP"/>
      <assert role="error"
              see="http://elga.art-decor.org/elgaimpf-html-20250116T125121/tmp-1.2.40.0.34.6.0.11.9.47-2023-02-28T124446.html"
              test="empty(@xsi:type) or resolve-QName(@xsi:type, .) = QName('urn:hl7-org:v3', 'ENXP')">(atcdabbr_other_ParticipantBodyDataEnterer): Wenn eine @xsi:type Instruktion anwesend ist MUSS diese den Wert "{urn:hl7-org:v3}:ENXP" haben. Gefunden "{<value-of select="namespace-uri-from-QName(resolve-QName(@xsi:type,.))"/>}:<value-of select="local-name-from-QName(resolve-QName(@xsi:type,.))"/>"</assert>
      <assert role="error"
              see="http://elga.art-decor.org/elgaimpf-html-20250116T125121/tmp-1.2.40.0.34.6.0.11.9.47-2023-02-28T124446.html"
              test="not(@qualifier) or (string-length(@qualifier) &gt; 0 and not(matches(@qualifier,'\s')))">(atcdabbr_other_ParticipantBodyDataEnterer): Attribute @qualifier MUSS vom Datentyp 'cs' sein  - '<value-of select="@qualifier"/>'</assert>
   </rule>
   <!--
Template derived rules for ID: 1.2.40.0.34.6.0.11.9.47
Context: *[hl7:templateId[@root = '1.2.40.0.34.6.0.11.9.47']]/hl7:participantRole[not(@nullFlavor)]/hl7:playingEntity/hl7:name[not(@nullFlavor)]/hl7:suffix
Item: (atcdabbr_other_ParticipantBodyDataEnterer)
-->

   <rule fpi="RULC-1"
         context="*[hl7:templateId[@root = '1.2.40.0.34.6.0.11.9.47']]/hl7:participantRole[not(@nullFlavor)]/hl7:playingEntity/hl7:name[not(@nullFlavor)]/hl7:suffix"
         id="d42e62537-false-d1531431e0">
      <extends rule="ENXP"/>
      <assert role="error"
              see="http://elga.art-decor.org/elgaimpf-html-20250116T125121/tmp-1.2.40.0.34.6.0.11.9.47-2023-02-28T124446.html"
              test="empty(@xsi:type) or resolve-QName(@xsi:type, .) = QName('urn:hl7-org:v3', 'ENXP')">(atcdabbr_other_ParticipantBodyDataEnterer): Wenn eine @xsi:type Instruktion anwesend ist MUSS diese den Wert "{urn:hl7-org:v3}:ENXP" haben. Gefunden "{<value-of select="namespace-uri-from-QName(resolve-QName(@xsi:type,.))"/>}:<value-of select="local-name-from-QName(resolve-QName(@xsi:type,.))"/>"</assert>
      <assert role="error"
              see="http://elga.art-decor.org/elgaimpf-html-20250116T125121/tmp-1.2.40.0.34.6.0.11.9.47-2023-02-28T124446.html"
              test="not(@qualifier) or (string-length(@qualifier) &gt; 0 and not(matches(@qualifier,'\s')))">(atcdabbr_other_ParticipantBodyDataEnterer): Attribute @qualifier MUSS vom Datentyp 'cs' sein  - '<value-of select="@qualifier"/>'</assert>
   </rule>
   <!--
Template derived rules for ID: 1.2.40.0.34.6.0.11.9.47
Context: *[hl7:templateId[@root = '1.2.40.0.34.6.0.11.9.47']]/hl7:participantRole[not(@nullFlavor)]/hl7:scopingEntity
Item: (atcdabbr_other_ParticipantBodyDataEnterer)
-->

   <rule fpi="RULC-1"
         context="*[hl7:templateId[@root = '1.2.40.0.34.6.0.11.9.47']]/hl7:participantRole[not(@nullFlavor)]/hl7:scopingEntity"
         id="d42e62558-false-d1531445e0">
      <assert role="error"
              see="http://elga.art-decor.org/elgaimpf-html-20250116T125121/tmp-1.2.40.0.34.6.0.11.9.47-2023-02-28T124446.html"
              test="string(@classCode) = ('ENT') or not(@classCode)">(atcdabbr_other_ParticipantBodyDataEnterer): Der Wert von classCode MUSS 'ENT' sein. Gefunden: "<value-of select="@classCode"/>"</assert>
      <assert role="error"
              see="http://elga.art-decor.org/elgaimpf-html-20250116T125121/tmp-1.2.40.0.34.6.0.11.9.47-2023-02-28T124446.html"
              test="string(@determinerCode) = ('INSTANCE') or not(@determinerCode)">(atcdabbr_other_ParticipantBodyDataEnterer): Der Wert von determinerCode MUSS 'INSTANCE' sein. Gefunden: "<value-of select="@determinerCode"/>"</assert>
      <assert role="error"
              see="http://elga.art-decor.org/elgaimpf-html-20250116T125121/tmp-1.2.40.0.34.6.0.11.9.47-2023-02-28T124446.html"
              test="count(hl7:desc) &lt;= 1">(atcdabbr_other_ParticipantBodyDataEnterer): Element hl7:desc kommt zu häufig vor [max 1x].</assert>
   </rule>
   <!--
Template derived rules for ID: 1.2.40.0.34.6.0.11.9.47
Context: *[hl7:templateId[@root = '1.2.40.0.34.6.0.11.9.47']]/hl7:participantRole[not(@nullFlavor)]/hl7:scopingEntity/hl7:desc
Item: (atcdabbr_other_ParticipantBodyDataEnterer)
-->

   <rule fpi="RULC-1"
         context="*[hl7:templateId[@root = '1.2.40.0.34.6.0.11.9.47']]/hl7:participantRole[not(@nullFlavor)]/hl7:scopingEntity/hl7:desc"
         id="d42e62567-false-d1531467e0">
      <extends rule="ST"/>
      <assert role="error"
              see="http://elga.art-decor.org/elgaimpf-html-20250116T125121/tmp-1.2.40.0.34.6.0.11.9.47-2023-02-28T124446.html"
              test="empty(@xsi:type) or resolve-QName(@xsi:type, .) = QName('urn:hl7-org:v3', 'ST')">(atcdabbr_other_ParticipantBodyDataEnterer): Wenn eine @xsi:type Instruktion anwesend ist MUSS diese den Wert "{urn:hl7-org:v3}:ST" haben. Gefunden "{<value-of select="namespace-uri-from-QName(resolve-QName(@xsi:type,.))"/>}:<value-of select="local-name-from-QName(resolve-QName(@xsi:type,.))"/>"</assert>
   </rule>
</pattern>
