<?xml version="1.0" encoding="UTF-8"?>
<!-- 
    DTR1 CV.IPS - Coded Value
    Status: draft
-->
<rule xmlns="http://purl.oclc.org/dsdl/schematron"
      abstract="true"
      id="CV.IPS"
      see="https://docs.art-decor.org/documentation/datatypes/DTr1_CV.IPS">
    <extends rule="CE.IPS"/>
</rule>
