<?xml version="1.0" encoding="UTF-8"?>
<!--
Template derived pattern
===========================================
ID: 1.2.40.0.34.6.0.11.9.17
Name: Performer Body
Description: 
-->
<pattern xmlns="http://purl.oclc.org/dsdl/schematron"
         id="template-1.2.40.0.34.6.0.11.9.17-2021-02-19T133615-closed">
   <title>Performer Body</title>

   <!-- Checking undefined contents for template/element @isClosed="true". Match context that we did not already match -->
   <rule fpi="RUL-QQQ"
         context="*[hl7:templateId[@root = '1.2.40.0.34.6.0.11.9.17']]/*[not(@xsi:nil = 'true')][not(self::hl7:templateId[@root = '1.2.40.0.34.6.0.11.9.17'] | self::hl7:time | self::hl7:assignedEntity[not(@nullFlavor)])]"
         id="d42e53344-true-d1508834e0">
      <assert role="error"
              see="http://elga.art-decor.org/elgaimpf-html-20250116T125121/tmp-1.2.40.0.34.6.0.11.9.17-2021-02-19T133615.html"
              test="not(.)">(atcdabbr_other_PerformerBody)/d42e53344-true-d1508834e0: '<value-of select="name(..)"/>' ist als geschlossen definiert und dieses Element '<name/>' ist nicht erlaubt oder nicht mit diesem Inhalt erlaubt. Dies kann templateId, code oder id betreffen. Erwartet:  hl7:templateId[@root = '1.2.40.0.34.6.0.11.9.17'] | hl7:time | hl7:assignedEntity[not(@nullFlavor)] (rule-reference: d42e53344-true-d1508834e0)</assert>
   </rule>

   <!-- Checking undefined contents for template/element @isClosed="true". Match context that we did not already match -->
   <rule fpi="RUL-QQQ"
         context="*[hl7:templateId[@root = '1.2.40.0.34.6.0.11.9.17']]/hl7:assignedEntity[not(@nullFlavor)]/*[not(@xsi:nil = 'true')][not(self::hl7:id[not(@nullFlavor)] | self::hl7:id[@nullFlavor='NI'] | self::hl7:id[@nullFlavor='UNK'] | self::hl7:code | self::hl7:addr | self::hl7:telecom | self::hl7:assignedPerson | self::hl7:assignedPerson | self::hl7:representedOrganization)]"
         id="d42e53393-true-d1508940e0">
      <assert role="error"
              see="http://elga.art-decor.org/elgaimpf-html-20250116T125121/tmp-1.2.40.0.34.6.0.11.9.17-2021-02-19T133615.html"
              test="not(.)">(atcdabbr_other_PerformerBody)/d42e53393-true-d1508940e0: '<value-of select="name(..)"/>' ist als geschlossen definiert und dieses Element '<name/>' ist nicht erlaubt oder nicht mit diesem Inhalt erlaubt. Dies kann templateId, code oder id betreffen. Erwartet:  hl7:id[not(@nullFlavor)] | hl7:id[@nullFlavor='NI'] | hl7:id[@nullFlavor='UNK'] | hl7:code | hl7:addr | hl7:telecom | hl7:assignedPerson | hl7:assignedPerson | hl7:representedOrganization (rule-reference: d42e53393-true-d1508940e0)</assert>
   </rule>

   <!-- Checking undefined contents for template/element @isClosed="true". Match context that we did not already match -->
   <rule fpi="RUL-QQQ"
         context="*[hl7:templateId[@root = '1.2.40.0.34.6.0.11.9.17']]/hl7:assignedEntity[not(@nullFlavor)]/hl7:addr/*[not(@xsi:nil = 'true')][not(self::hl7:streetAddressLine | self::hl7:streetName | self::hl7:houseNumber | self::hl7:postalCode | self::hl7:city | self::hl7:state | self::hl7:country | self::hl7:additionalLocator)]"
         id="d1508944e101-true-d1509013e0">
      <assert role="error"
              see="http://elga.art-decor.org/elgaimpf-html-20250116T125121/tmp-1.2.40.0.34.6.0.11.9.17-2021-02-19T133615.html"
              test="not(.)">(atcdabbr_other_PerformerBody)/d1508944e101-true-d1509013e0: '<value-of select="name(..)"/>' ist als geschlossen definiert und dieses Element '<name/>' ist nicht erlaubt oder nicht mit diesem Inhalt erlaubt. Dies kann templateId, code oder id betreffen. Erwartet:  hl7:streetAddressLine | hl7:streetName | hl7:houseNumber | hl7:postalCode | hl7:city | hl7:state | hl7:country | hl7:additionalLocator (rule-reference: d1508944e101-true-d1509013e0)</assert>
   </rule>

   <!-- Checking undefined contents for template/element @isClosed="true". Match context that we did not already match -->
   <rule fpi="RUL-QQQ"
         context="*[hl7:templateId[@root = '1.2.40.0.34.6.0.11.9.17']]/hl7:assignedEntity[not(@nullFlavor)]/hl7:assignedPerson/*[not(@xsi:nil = 'true')][not(self::hl7:name[not(@nullFlavor)])]"
         id="d1508944e174-true-d1509089e0">
      <assert role="error"
              see="http://elga.art-decor.org/elgaimpf-html-20250116T125121/tmp-1.2.40.0.34.6.0.11.9.16-2021-05-26T140421.html"
              test="not(.)">( atcdabbr_other_AssignedEntityBody)/d1508944e174-true-d1509089e0: '<value-of select="name(..)"/>' ist als geschlossen definiert und dieses Element '<name/>' ist nicht erlaubt oder nicht mit diesem Inhalt erlaubt. Dies kann templateId, code oder id betreffen. Erwartet:  hl7:name[not(@nullFlavor)] (rule-reference: d1508944e174-true-d1509089e0)</assert>
   </rule>

   <!-- Checking undefined contents for template/element @isClosed="true". Match context that we did not already match -->
   <rule fpi="RUL-QQQ"
         context="*[hl7:templateId[@root = '1.2.40.0.34.6.0.11.9.17']]/hl7:assignedEntity[not(@nullFlavor)]/hl7:assignedPerson/*[not(@xsi:nil = 'true')][not(self::hl7:name[not(@nullFlavor)])]"
         id="d1508944e186-true-d1509111e0">
      <assert role="error"
              see="http://elga.art-decor.org/elgaimpf-html-20250116T125121/tmp-1.2.40.0.34.6.0.11.9.16-2021-05-26T140421.html"
              test="not(.)">( atcdabbr_other_AssignedEntityBody)/d1508944e186-true-d1509111e0: '<value-of select="name(..)"/>' ist als geschlossen definiert und dieses Element '<name/>' ist nicht erlaubt oder nicht mit diesem Inhalt erlaubt. Dies kann templateId, code oder id betreffen. Erwartet:  hl7:name[not(@nullFlavor)] (rule-reference: d1508944e186-true-d1509111e0)</assert>
   </rule>

   <!-- Checking undefined contents for template/element @isClosed="true". Match context that we did not already match -->
   <rule fpi="RUL-QQQ"
         context="*[hl7:templateId[@root = '1.2.40.0.34.6.0.11.9.17']]/hl7:assignedEntity[not(@nullFlavor)]/hl7:assignedPerson/hl7:name[not(@nullFlavor)]/*[not(@xsi:nil = 'true')][not(self::hl7:prefix | self::hl7:family[not(@nullFlavor)] | self::hl7:given[not(@nullFlavor)] | self::hl7:suffix)]"
         id="d1509099e12-true-d1509140e0">
      <assert role="error"
              see="http://elga.art-decor.org/elgaimpf-html-20250116T125121/tmp-1.2.40.0.34.6.0.11.9.16-2021-05-26T140421.html"
              test="not(.)">( atcdabbr_other_AssignedEntityBody)/d1509099e12-true-d1509140e0: '<value-of select="name(..)"/>' ist als geschlossen definiert und dieses Element '<name/>' ist nicht erlaubt oder nicht mit diesem Inhalt erlaubt. Dies kann templateId, code oder id betreffen. Erwartet:  hl7:prefix | hl7:family[not(@nullFlavor)] | hl7:given[not(@nullFlavor)] | hl7:suffix (rule-reference: d1509099e12-true-d1509140e0)</assert>
   </rule>

   <!-- Checking undefined contents for template/element @isClosed="true". Match context that we did not already match -->
   <rule fpi="RUL-QQQ"
         context="*[hl7:templateId[@root = '1.2.40.0.34.6.0.11.9.17']]/hl7:assignedEntity[not(@nullFlavor)]/hl7:representedOrganization/*[not(@xsi:nil = 'true')][not(self::hl7:id[not(@nullFlavor)] | self::hl7:name[not(@nullFlavor)] | self::hl7:telecom[not(@nullFlavor)] | self::hl7:addr[not(@nullFlavor)])]"
         id="d1508944e198-true-d1509191e0">
      <assert role="error"
              see="http://elga.art-decor.org/elgaimpf-html-20250116T125121/tmp-1.2.40.0.34.6.0.11.9.17-2021-02-19T133615.html"
              test="not(.)">(atcdabbr_other_PerformerBody)/d1508944e198-true-d1509191e0: '<value-of select="name(..)"/>' ist als geschlossen definiert und dieses Element '<name/>' ist nicht erlaubt oder nicht mit diesem Inhalt erlaubt. Dies kann templateId, code oder id betreffen. Erwartet:  hl7:id[not(@nullFlavor)] | hl7:name[not(@nullFlavor)] | hl7:telecom[not(@nullFlavor)] | hl7:addr[not(@nullFlavor)] (rule-reference: d1508944e198-true-d1509191e0)</assert>
   </rule>

   <!-- Checking undefined contents for template/element @isClosed="true". Match context that we did not already match -->
   <rule fpi="RUL-QQQ"
         context="*[hl7:templateId[@root = '1.2.40.0.34.6.0.11.9.17']]/hl7:assignedEntity[not(@nullFlavor)]/hl7:representedOrganization/hl7:addr[not(@nullFlavor)]/*[not(@xsi:nil = 'true')][not(self::hl7:streetAddressLine | self::hl7:streetName | self::hl7:houseNumber | self::hl7:postalCode | self::hl7:city | self::hl7:state | self::hl7:country | self::hl7:additionalLocator)]"
         id="d1509165e58-true-d1509252e0">
      <assert role="error"
              see="http://elga.art-decor.org/elgaimpf-html-20250116T125121/tmp-1.2.40.0.34.6.0.11.9.17-2021-02-19T133615.html"
              test="not(.)">(atcdabbr_other_PerformerBody)/d1509165e58-true-d1509252e0: '<value-of select="name(..)"/>' ist als geschlossen definiert und dieses Element '<name/>' ist nicht erlaubt oder nicht mit diesem Inhalt erlaubt. Dies kann templateId, code oder id betreffen. Erwartet:  hl7:streetAddressLine | hl7:streetName | hl7:houseNumber | hl7:postalCode | hl7:city | hl7:state | hl7:country | hl7:additionalLocator (rule-reference: d1509165e58-true-d1509252e0)</assert>
   </rule>
</pattern>
